siren,nic,siret,statutDiffusionEtablissement,dateCreationEtablissement,trancheEffectifsEtablissement,anneeEffectifsEtablissement,activitePrincipaleRegistreMetiersEtablissement,dateDernierTraitementEtablissement,etablissementSiege,nombrePeriodesEtablissement,complementAdresseEtablissement,numeroVoieEtablissement,indiceRepetitionEtablissement,typeVoieEtablissement,libelleVoieEtablissement,codePostalEtablissement,libelleCommuneEtablissement,libelleCommuneEtrangerEtablissement,distributionSpecialeEtablissement,codeCommuneEtablissement,codeCedexEtablissement,libelleCedexEtablissement,codePaysEtrangerEtablissement,libellePaysEtrangerEtablissement,complementAdresse2Etablissement,numeroVoie2Etablissement,indiceRepetition2Etablissement,typeVoie2Etablissement,libelleVoie2Etablissement,codePostal2Etablissement,libelleCommune2Etablissement,libelleCommuneEtranger2Etablissement,distributionSpeciale2Etablissement,codeCommune2Etablissement,codeCedex2Etablissement,libelleCedex2Etablissement,codePaysEtranger2Etablissement,libellePaysEtranger2Etablissement,dateDebut,etatAdministratifEtablissement,enseigne1Etablissement,enseigne2Etablissement,enseigne3Etablissement,denominationUsuelleEtablissement,activitePrincipaleEtablissement,nomenclatureActivitePrincipaleEtablissement,caractereEmployeurEtablissement,longitude,latitude,geo_score,geo_type,geo_adresse,geo_id,geo_ligne,geo_l4,geo_l5
200090199,00015,20009019900015,O,2019-10-02,,,,2019-11-05T11:58:35,true,1,MAIRIE,27,,RUE,DU BOURG,33340,SAINT GERMAIN D'ESTEUIL,,,33412,,,,,,,,,,,,,,,,,,,2019-10-02,A,,,,,84.11Z,NAFRev2,O,-0.859527,45.295816,0.94,housenumber,27 Rue du Bourg 33340 Saint-Germain-d'Esteuil,33412_0029_00027,G,27 RUE DU BOURG,
213304124,00018,21330412400018,O,1983-03-01,NN,,,2018-09-29T12:05:04,true,4,,,,,,33340,SAINT GERMAIN D'ESTEUIL,,,33412,,,,,,,,,,,,,,,,,,,2008-01-01,A,MAIRIE,,,,84.11Z,NAFRev2,O,,,0,,,,,,
213304124,00026,21330412400026,O,1983-12-21,03,2018,,2020-08-25T10:16:50,false,3,,26,,RUE,DU MAQUIS VIGNES OUDIDES,33340,SAINT GERMAIN D'ESTEUIL,,,33412,,,,,,,,,,,,,,,,,,,2008-01-01,A,ECOLE PRIMAIRE PUBLIQUE,,,,85.20Z,NAFRev2,N,-0.890019,45.269588,0.91,housenumber,26 Rue du Maquis de Vignes Oudides 33340 Saint-Germain-d'Esteuil,33412_0197_00026,G,26 RUE MAQUIS DE VIGNES OUDIDES,
213304124,00034,21330412400034,O,1996-12-25,NN,,,2008-01-04T18:31:25,false,2,MAIRIE,,,,,33340,SAINT GERMAIN D'ESTEUIL,,,33412,,,,,,,,,,,,,,,,,,,2008-01-01,A,SCE TRANSPORTS SCOLAIRES,,,,49.31Z,NAFRev2,N,-0.846584,45.281186,0.77,street,Metairie de Cassan 33340 Saint-Germain-d'Esteuil,33412_b204,D,METAIRIE DE CASSAN,
243301132,00011,24330113200011,O,,,,,,true,1,,,,,MAIRIE,33340,SAINT GERMAIN D'ESTEUIL,,,33412,,,,,,,,,,,,,,,,,,,1998-12-02,F,,,,,75.1A,NAF1993,N,-0.846584,45.281186,0.77,street,Metairie de Cassan 33340 Saint-Germain-d'Esteuil,33412_b204,G,METAIRIE DE CASSAN,
253301600,00057,25330160000057,O,2002-03-12,01,2018,,2020-08-25T10:20:21,true,4,,,,,HOTEL DE VILLE,33340,SAINT GERMAIN D'ESTEUIL,,,33412,,,,,,,,,,,,,,,,,,,2019-10-02,F,,,,,84.13Z,NAFRev2,O,-0.907797,45.274347,0.34,street,Chemin de Pillet 33340 Saint-Germain-d'Esteuil,33412_0237,G,CHEMIN DE PILLET,
253306112,00017,25330611200017,O,1998-12-02,NN,,,2006-10-26T23:43:42,true,3,,,,,MAIRIE,33340,SAINT GERMAIN D'ESTEUIL,,,33412,,,,,,,,,,,,,,,,,,,2005-08-08,F,,,,,75.1A,NAFRev1,N,-0.846584,45.281186,0.77,street,Metairie de Cassan 33340 Saint-Germain-d'Esteuil,33412_b204,G,METAIRIE DE CASSAN,
263304040,00011,26330404000011,O,1983-03-01,NN,,,2018-03-07T15:09:23,true,4,MAIRIE,,,,,33340,SAINT GERMAIN D'ESTEUIL,,,33412,,,,,,,,,,,,,,,,,,,2018-01-01,F,CCAS,,,,88.99B,NAFRev2,N,-0.846584,45.281186,0.77,street,Metairie de Cassan 33340 Saint-Germain-d'Esteuil,33412_b204,D,METAIRIE DE CASSAN,
263306771,00019,26330677100019,O,1996-12-25,,,,2010-06-26T03:08:42,true,2,,,,,,33340,SAINT GERMAIN D'ESTEUIL,,,33412,,,,,,,,,,,,,,,,,,,2008-01-01,A,CDE,,,,88.99B,NAFRev2,N,,,0,,,,,,
293300786,00010,29330078600010,O,1983-12-06,NN,,,2008-01-04T19:06:29,true,3,,,,,MAIRIE,33340,SAINT GERMAIN D'ESTEUIL,,,33412,,,,,,,,,,,,,,,,,,,2008-01-01,A,DFCI,,,,42.99Z,NAFRev2,N,-0.846584,45.281186,0.77,street,Metairie de Cassan 33340 Saint-Germain-d'Esteuil,33412_b204,G,METAIRIE DE CASSAN,
300385739,00010,30038573900010,O,1992-06-10,NN,,,,true,3,,,,,ARTIGUILLON,33340,SAINT GERMAIN D'ESTEUIL,,,33412,,,,,,,,,,,,,,,,,,,1993-11-26,F,,,,,50.1Z,NAF1993,N,-0.888362,45.271912,0.94,street,Artiguillon 33340 Saint-Germain-d'Esteuil,33412_turtd9,G,ARTIGUILLON,
300415544,00018,30041554400018,O,,,,,,true,1,,,,,,33340,SAINT GERMAIN D'ESTEUIL,,,33412,,,,,,,,,,,,,,,,,,,1984-12-25,F,,,,,81.21,NAP,N,,,0,,,,,,
300660347,00018,30066034700018,O,,,,,,true,1,,,,,,33340,SAINT GERMAIN D'ESTEUIL,,,33412,,,,,,,,,,,,,,,,,,,1984-12-25,F,,,,,62.43,NAP,N,,,0,,,,,,
303327472,00039,30332747200039,O,1900-01-01,NN,,,2008-11-07T00:18:57,false,4,,,,LD,ARTIGUILLON,33340,SAINT GERMAIN D'ESTEUIL,,,33412,,,,,,,,,,,,,,,,,,,2001-01-01,F,,,,,45.2V,NAF1993,N,-0.888362,45.271912,0.94,street,Artiguillon 33340 Saint-Germain-d'Esteuil,33412_turtd9,G,ARTIGUILLON,
303327472,00047,30332747200047,O,2001-01-01,NN,,,2014-07-08T00:11:57,true,5,,16,,RTE,DE LESPARRE,33340,SAINT GERMAIN D'ESTEUIL,,,33412,,,,,,,,,,,,,,,,,,,2008-09-30,F,,,,,43.99C,NAFRev2,N,-0.889454,45.275368,0.84,housenumber,16 Route de Lesparre 33340 Saint-Germain-d'Esteuil,33412_0167_00016,G,16 ROUTE DE LESPARRE,
306251539,00012,30625153900012,O,1900-01-01,NN,,,2008-01-04T19:40:59,true,3,,,,,LE BROUSTEY,33340,SAINT GERMAIN D'ESTEUIL,,,33412,,,,,,,,,,,,,,,,,,,2008-01-01,A,,,,,01.61Z,NAFRev2,N,-0.88071,45.271558,0.7,street,Vignes du Broustey 33340 Saint-Germain-d'Esteuil,33412_b309,G,VIGNES DU BROUSTEY,
309472173,00025,30947217300025,O,1900-01-01,NN,,,2008-11-07T00:24:17,false,4,,,,LD,ARTIGUILLON,33340,SAINT GERMAIN D'ESTEUIL,,,33412,,,,,,,,,,,,,,,,,,,2004-12-31,F,,,,,45.3E,NAFRev1,O,-0.888362,45.271912,0.94,street,Artiguillon 33340 Saint-Germain-d'Esteuil,33412_turtd9,G,ARTIGUILLON,
310527528,00049,31052752800049,O,2000-07-01,NN,,,2006-11-25T09:26:27,false,3,,2,,RTE,DU CUQUET,33340,SAINT GERMAIN D'ESTEUIL,,,33412,,,,,,,,,,,,,,,,,,,2006-05-01,F,,,,,85.1G,NAFRev1,N,-0.897652,45.273825,0.83,housenumber,2 Route du Cuquet 33340 Saint-Germain-d'Esteuil,33412_0086_00002,G,2 ROUTE DU CUQUET,
311361372,00064,31136137200064,O,1991-09-01,,,,,false,4,,,,,,33340,SAINT GERMAIN D'ESTEUIL,,,33412,,,,,,,,,,,,,,,,,,,1993-12-25,F,INTERNAT LE CHALET DES BOIS,,,,91.3E,NAF1993,N,,,0,,,,,,
311395065,00098,31139506500098,O,2007-01-01,NN,,4932ZA,2018-09-29T12:13:25,true,4,,59,B,RTE,DE LIARD,33340,SAINT GERMAIN D'ESTEUIL,,,33412,,,,,,,,,,,,,,,,,,,2016-12-31,F,,,,,49.32Z,NAFRev2,O,-0.907014,45.272398,0.68,housenumber,59 bis Route de Liard 33340 Saint-Germain-d'Esteuil,33412_0171_00059_bis,G,59 BIS ROUTE DE LIARD,
312752215,00011,31275221500011,O,1978-01-01,NN,,,2012-06-28T09:18:22,true,6,,,,,ARTIGUILLON,33340,SAINT GERMAIN D'ESTEUIL,,,33412,,,,,,,,,,,,,,,,,,,2012-05-21,F,,,,,47.11B,NAFRev2,N,-0.888362,45.271912,0.94,street,Artiguillon 33340 Saint-Germain-d'Esteuil,33412_turtd9,G,ARTIGUILLON,
312982564,00014,31298256400014,O,1963-01-01,,,,2008-11-07T00:28:10,false,3,,,,,ARTIGUILLON,33340,SAINT GERMAIN D'ESTEUIL,,,33412,,,,,,,,,,,,,,,,,,,2000-01-01,F,,,,,45.4C,NAF1993,N,-0.888362,45.271912,0.94,street,Artiguillon 33340 Saint-Germain-d'Esteuil,33412_turtd9,G,ARTIGUILLON,
312982564,00022,31298256400022,O,2000-01-01,NN,,4332AA,2015-03-17T00:13:03,true,4,,2,,CHE,DE COLAS,33340,SAINT GERMAIN D'ESTEUIL,,,33412,,,,,,,,,,,,,,,,,,,2008-01-01,A,,,,,43.32A,NAFRev2,O,-0.887398,45.272937,0.82,housenumber,2 Chemin de Colas 33340 Saint-Germain-d'Esteuil,33412_0074_00002,G,2 CHEMIN DE COLAS,
313581134,00027,31358113400027,O,1996-01-07,NN,,,,true,1,,2,,CHE,DU GAY,33340,SAINT GERMAIN D'ESTEUIL,,,33412,,,,,,,,,,,,,,,,,,,1998-01-30,F,,,,,51.1R,NAF1993,N,-0.880254,45.295844,0.8,housenumber,2 Chemin du Gay 33340 Saint-Germain-d'Esteuil,33412_0127_00002,G,2 CHEMIN DU GAY,
317602795,00021,31760279500021,O,1998-07-01,NN,,,2008-11-07T00:33:11,true,3,ARTIGUILLON,6,,IMP,DU CHATEAU,33340,SAINT GERMAIN D'ESTEUIL,,,33412,,,,,,,,,,,,,,,,,,,2006-09-30,F,,,,,45.4C,NAFRev1,N,-0.883309,45.271857,0.83,housenumber,6 Impasse du Chateau 33340 Saint-Germain-d'Esteuil,33412_0069_00006,G,6 IMPASSE DU CHATEAU,
317617066,00046,31761706600046,O,1984-01-01,,,4321AB,2015-03-17T00:14:26,true,4,,,,LD,ARTIGUILLON,33340,SAINT GERMAIN D'ESTEUIL,,,33412,,,,,,,,,,,,,,,,,,,2008-01-01,A,,,,,43.21A,NAFRev2,N,-0.888362,45.271912,0.94,street,Artiguillon 33340 Saint-Germain-d'Esteuil,33412_turtd9,G,ARTIGUILLON,
318222122,00067,31822212200067,O,2005-07-14,,,,2012-05-25T13:53:59,false,3,LIARD,12,,RTE,DE SOULAC,33340,SAINT GERMAIN D'ESTEUIL,,,33412,,,,,,,,,,,,,,,,,,,2006-11-14,F,,,,,55.3A,NAFRev1,N,-0.911866,45.271106,0.83,housenumber,12 Route de Soulac 33340 Saint-Germain-d'Esteuil,33412_0260_00012,G,12 ROUTE DE SOULAC,
321343147,00013,32134314700013,O,,,,,,true,1,,,,,,33340,SAINT GERMAIN D'ESTEUIL,,,33412,,,,,,,,,,,,,,,,,,,1984-12-25,F,,,,,67.03,NAP,N,,,0,,,,,,
321354045,00015,32135404500015,O,1981-03-17,NN,,,2013-11-07T03:09:55,true,3,,,,,CHATEAU LIVRAN,33340,SAINT GERMAIN D'ESTEUIL,,,33412,,,,,,,,,,,,,,,,,,,2008-01-01,A,,,,,02.40Z,NAFRev2,N,-0.878077,45.284673,0.94,street,Chateau Livran 33340 Saint-Germain-d'Esteuil,33412_b068,G,CHATEAU LIVRAN,
321606964,00021,32160696400021,O,1985-11-26,NN,,,2019-01-14T21:27:49,false,4,1 CHEMIN DU COT DE HAUT,,,LD,ARTIGUILLON,33340,SAINT GERMAIN D'ESTEUIL,,,33412,,,,,,,,,,,,,,,,,,,2011-04-18,F,,,,,01.61Z,NAFRev2,N,-0.888362,45.271912,0.94,street,Artiguillon 33340 Saint-Germain-d'Esteuil,33412_turtd9,G,ARTIGUILLON,
321606964,00039,32160696400039,O,2011-04-18,,,,2012-02-13T02:40:15,true,1,,2,B,RTE,SAINT GAUX,33340,SAINT GERMAIN D'ESTEUIL,,,33412,,,,,,,,,,,,,,,,,,,2011-04-18,A,,,,,01.61Z,NAFRev2,N,-0.908004,45.263716,0.69,housenumber,2 bis Route de Saint-gaux 33340 Saint-Germain-d'Esteuil,33412_0252_00002_bis,G,2 BIS ROUTE DE SAINT GAUX,
322070467,00012,32207046700012,O,,,,,,true,1,,,,,MOULIN DU GOUAT,33340,SAINT GERMAIN D'ESTEUIL,,,33412,,,,,,,,,,,,,,,,,,,1984-12-25,F,,,,,62.44,NAP,N,-0.871532,45.264755,0.77,street,Moulin de Gouat 33340 Saint-Germain-d'Esteuil,33412_b219,G,MOULIN DE GOUAT,
322171463,00019,32217146300019,O,,NN,,,,true,1,,,,LD,MUSSET,33340,SAINT GERMAIN D'ESTEUIL,,,33412,,,,,,,,,,,,,,,,,,,1987-12-25,F,,,,,62.46,NAP,N,-0.899079,45.208126,0.94,street,Musset 33340 Saint-Germain-d'Esteuil,33412_6b35pj,G,MUSSET,
323568303,00016,32356830300016,O,,,,,,true,1,,,,,,33340,SAINT GERMAIN D'ESTEUIL,,,33412,,,,,,,,,,,,,,,,,,,1984-12-25,F,,,,,64.46,NAP,N,,,0,,,,,,
323617118,00019,32361711800019,O,,,,,,true,1,,,,,LAS BRIGNOLLES,33340,SAINT GERMAIN D'ESTEUIL,,,33412,,,,,,,,,,,,,,,,,,,1984-12-25,F,,,,,64.11,NAP,N,6.0488374,43.4094784,0.71,poi.clothes,La Halle ! (Vêtements) Brignoles,https://osm.org/way/352173363,G,,
324436500,00015,32443650000015,O,,,,,,true,1,,,,,MIQUEU,33340,SAINT GERMAIN D'ESTEUIL,,,33412,,,,,,,,,,,,,,,,,,,1984-12-25,F,,,,,48.04,NAP,N,-0.873629,45.278919,0.94,street,Miqueu 33340 Saint-Germain-d'Esteuil,33412_m7a8zb,G,MIQUEU,
324436518,00017,32443651800017,O,1980-10-01,NN,,,2008-01-04T18:56:43,true,3,,,,,PASSE DE RAYSSON,33340,SAINT GERMAIN D'ESTEUIL,,,33412,,,,,,,,,,,,,,,,,,,2008-01-01,A,,,,,01.21Z,NAFRev2,N,-0.87248,45.264738,0.77,street,Passe du Marais de Reysson 33340 Saint-Germain-d'Esteuil,33412_0204,G,PASSE DU MARAIS DE REYSSON,
325386324,00017,32538632400017,O,,NN,,,,true,1,,,,LD,ARTIGUILLON,33340,SAINT GERMAIN D'ESTEUIL,,,33412,,,,,,,,,,,,,,,,,,,,F,,,,,37.04,NAP,N,-0.888362,45.271912,0.94,street,Artiguillon 33340 Saint-Germain-d'Esteuil,33412_turtd9,G,ARTIGUILLON,
325566461,00035,32556646100035,O,1900-01-01,NN,,,2011-04-28T00:22:02,false,3,,1,,PAS,,33340,SAINT GERMAIN D'ESTEUIL,,,33412,,,,,,,,,,,,,,,,,,,1997-05-08,F,,,,,85.1G,NAF1993,N,-0.866291,45.289521,0.75,housenumber,1 Passage de l'Eglise 33340 Saint-Germain-d'Esteuil,33412_0100_00001,G,1 PASSAGE DE L EGLISE,
325877645,00045,32587764500045,O,1996-01-01,NN,,,2008-01-04T19:11:26,false,3,,,,,FERME EQUESTRE BAYENTRAN,33340,SAINT GERMAIN D'ESTEUIL,,,33412,,,,,,,,,,,,,,,,,,,2008-01-01,A,,,,,93.12Z,NAFRev2,N,,,0,,,,,,
326279791,00015,32627979100015,O,1900-01-01,,,,2020-04-23T08:01:13,false,2,,,,,MIQUEU,33340,SAINT GERMAIN D'ESTEUIL,,,33412,,,,,,,,,,,,,,,,,,,1984-12-25,F,,,,,55.60,NAP,N,-0.873629,45.278919,0.94,street,Miqueu 33340 Saint-Germain-d'Esteuil,33412_m7a8zb,G,MIQUEU,
326279791,00023,32627979100023,O,1980-01-01,,,,2020-04-23T08:04:23,true,1,,2,,RUE,DE LA CHAPELLE,33340,SAINT GERMAIN D'ESTEUIL,,,33412,,,,,,,,,,,,,,,,,,,1980-01-01,A,,,,,01.21Z,NAFRev2,N,-0.874267,45.278943,0.94,housenumber,2 Rue de la Chapelle 33340 Saint-Germain-d'Esteuil,33412_0064_00002,G,2 RUE DE LA CHAPELLE,
327207858,00025,32720785800025,O,1986-09-01,NN,,,2007-05-19T09:24:43,true,4,,,,RTE,DE LIARD,33340,SAINT GERMAIN D'ESTEUIL,,,33412,,,,,,,,,,,,,,,,,,,2005-12-31,F,,,,,52.6D,NAFRev1,O,-0.888471,45.272525,0.8,street,Route de Liard 33340 Saint-Germain-d'Esteuil,33412_0171,G,ROUTE DE LIARD,
327343778,00046,32734377800046,O,1997-04-01,NN,,,2006-12-15T00:23:46,false,3,SARL MEDOC RENOV,2,,CHE,DE TERRES NOIRES,33340,SAINT GERMAIN D'ESTEUIL,,,33412,,,,,,,,,,,,,,,,,,,2003-10-31,F,,,,,74.1J,NAFRev1,N,-0.913891,45.274634,0.63,street,Chemin de Terre Noire 33340 Saint-Germain-d'Esteuil,33412_0279,G,CHEMIN DE TERRE NOIRE,
327343778,00061,32734377800061,O,2016-04-04,,,4334ZB,2016-04-15T10:04:35,true,1,,37,,RTE,DE LIARD,33340,SAINT GERMAIN D'ESTEUIL,,,33412,,,,,,,,,,,,,,,,,,,2016-04-04,A,,,,,43.34Z,NAFRev2,N,-0.894518,45.274401,0.83,housenumber,37 Route de Liard 33340 Saint-Germain-d'Esteuil,33412_0171_00037,G,37 ROUTE DE LIARD,
327584835,00026,32758483500026,O,1997-01-01,NN,,,2006-10-27T01:45:26,true,3,,11,,RTE,DE BOYENTRON,33340,SAINT GERMAIN D'ESTEUIL,,,33412,,,,,,,,,,,,,,,,,,,2004-11-29,F,,,,,01.1G,NAFRev1,N,-0.840976,45.291616,0.72,housenumber,11 Route de Boyentran 33340 Saint-Germain-d'Esteuil,33412_0038_00011,G,11 ROUTE DE BOYENTRAN,
327953584,00015,32795358400015,O,1900-01-01,,,,2011-04-28T00:23:41,false,2,,,,,LAGUNE,33340,SAINT GERMAIN D'ESTEUIL,,,33412,,,,,,,,,,,,,,,,,,,1984-12-25,F,,,,,62.45,NAP,N,-0.902774,45.256655,0.92,street,Lagune Sud 33340 Saint-Germain-d'Esteuil,33412_b162,G,LAGUNE SUD,
328245493,00015,32824549300015,O,,,,,,true,1,,,,LD,GUIBEAU,33340,SAINT GERMAIN D'ESTEUIL,,,33412,,,,,,,,,,,,,,,,,,,1992-06-22,F,,,,,45.3A,NAF1993,N,-0.874074,45.266615,0.94,street,Guibeau 33340 Saint-Germain-d'Esteuil,33412_w4860j,G,GUIBEAU,
328607304,00024,32860730400024,O,,,,,,true,1,,,,,ST GAUX,33340,SAINT GERMAIN D'ESTEUIL,,,33412,,,,,,,,,,,,,,,,,,,1985-12-25,F,,,,,67.08,NAP,N,-0.908071,45.263632,0.69,street,Route de Saint-gaux 33340 Saint-Germain-d'Esteuil,33412_0252,G,ROUTE DE SAINT GAUX,
329077200,00015,32907720000015,O,,NN,,,,true,1,,,,,,33340,SAINT GERMAIN D'ESTEUIL,,,33412,,,,,,,,,,,,,,,,,,,1987-02-01,F,,,,,84.12,NAP,N,,,0,,,,,,
329090773,00014,32909077300014,O,1984-01-30,NN,,,2012-06-13T07:29:57,false,4,,,,,ARTIGUILLON,33340,SAINT GERMAIN D'ESTEUIL,,,33412,,,,,,,,,,,,,,,,,,,2010-06-30,F,,,,,01.21Z,NAFRev2,N,-0.888362,45.271912,0.94,street,Artiguillon 33340 Saint-Germain-d'Esteuil,33412_turtd9,G,ARTIGUILLON,
329090781,00017,32909078100017,O,1984-01-27,NN,,,2008-01-04T19:45:47,true,3,1 CHEMIN DU COT DE HAUT,,,,ARTIGUILLON,33340,SAINT GERMAIN D'ESTEUIL,,,33412,,,,,,,,,,,,,,,,,,,2008-01-01,A,,,,,01.21Z,NAFRev2,N,-0.888362,45.271912,0.94,street,Artiguillon 33340 Saint-Germain-d'Esteuil,33412_turtd9,G,ARTIGUILLON,
329954184,00019,32995418400019,O,1984-05-15,NN,,,,true,4,,,,,MIQUEU,33340,SAINT GERMAIN D'ESTEUIL,,,33412,,,,,,,,,,,,,,,,,,,1994-12-25,F,,,,,02.0B,NAF1993,N,-0.873629,45.278919,0.94,street,Miqueu 33340 Saint-Germain-d'Esteuil,33412_m7a8zb,G,MIQUEU,
330398876,00012,33039887600012,O,,NN,,,,true,1,,,,LD,ST GAUX,33340,SAINT GERMAIN D'ESTEUIL,,,33412,,,,,,,,,,,,,,,,,,,1995-12-25,F,,,,,70.2C,NAF1993,N,-0.908071,45.263632,0.69,street,Route de Saint-gaux 33340 Saint-Germain-d'Esteuil,33412_0252,G,ROUTE DE SAINT GAUX,
330592049,00028,33059204900028,O,1988-02-02,NN,,,,false,4,,,,LD,AU BOURG,33340,SAINT GERMAIN D'ESTEUIL,,,33412,,,,,,,,,,,,,,,,,,,1997-08-31,F,,,,,93.0D,NAF1993,O,-0.862875,45.292694,0.72,street,Rue du Bourg 33340 Saint-Germain-d'Esteuil,33412_0029,G,RUE DU BOURG,
330592049,00069,33059204900069,O,2011-02-01,NN,,,2016-04-26T03:05:12,true,3,,14,,,RUE DU STADE,33340,SAINT GERMAIN D'ESTEUIL,,,33412,,,,,,,,,,,,,,,,,,,2014-03-31,F,,,,,47.81Z,NAFRev2,O,-0.86566,45.289579,0.94,housenumber,14 Rue du Stade 33340 Saint-Germain-d'Esteuil,33412_0269_00014,G,14 RUE DU STADE,
330714833,00010,33071483300010,O,1984-08-01,NN,,,2015-05-05T04:19:39,true,5,,1,,CHE,COT DU HAUT,33340,SAINT GERMAIN D'ESTEUIL,,,33412,,,,,,,,,,,,,,,,,,,2015-03-31,F,,,,,01.21Z,NAFRev2,N,-0.889969,45.270885,0.84,housenumber,1 Chemin du Cot du Haut 33340 Saint-Germain-d'Esteuil,33412_0080_00001,G,1 CHEMIN DU COT DU HAUT,
330964016,00019,33096401600019,O,1984-08-21,02,2018,,2020-08-25T10:34:42,true,3,,,,,,33340,SAINT GERMAIN D'ESTEUIL,,,33412,,,,,,,,,,,,,,,,,,,2008-01-01,A,,,,,01.21Z,NAFRev2,N,,,0,,,,,,
331041525,00022,33104152500022,O,1999-11-01,,,,2014-07-08T00:36:02,true,4,,11,,RTE,D'HOURTINN,33340,SAINT GERMAIN D'ESTEUIL,,,33412,,,,,,,,,,,,,,,,,,,2011-03-06,F,,,,,45.20A,NAFRev2,N,-0.907765,45.260889,0.74,housenumber,11 Route d'Hourtin 33340 Saint-Germain-d'Esteuil,33412_0150_00011,G,11 ROUTE D HOURTIN,
332347715,00010,33234771500010,O,,NN,,,,true,1,,,,LD,ARTIGUILLON,33340,SAINT GERMAIN D'ESTEUIL,,,33412,,,,,,,,,,,,,,,,,,,,F,,,,,48.03,NAP,N,-0.888362,45.271912,0.94,street,Artiguillon 33340 Saint-Germain-d'Esteuil,33412_turtd9,G,ARTIGUILLON,
332591650,00046,33259165000046,O,2002-10-02,NN,,,2014-07-08T00:37:49,false,5,LA CHAPELLE,2,T,RTE,DE L'HOPITAL,33340,SAINT GERMAIN D'ESTEUIL,,,33412,,,,,,,,,,,,,,,,,,,2012-02-01,F,BT SERVICE GRILLET GEORGES,,,,43.31Z,NAFRev2,N,-0.879065,45.294271,0.72,housenumber,2 ter Route de l'Hôpital 33340 Saint-Germain-d'Esteuil,33412_0146_00002_ter,G,2 TER ROUTE DE L HOPITAL,
332694611,00051,33269461100051,O,1990-03-01,NN,,4313ZZ,2018-12-07T03:41:16,true,5,,10,,RTE,DE PAUILLAC,33340,SAINT GERMAIN D'ESTEUIL,,,33412,,,,,,,,,,,,,,,,,,,2018-09-30,F,,,,,43.13Z,NAFRev2,N,-0.87646,45.267064,0.84,housenumber,10 Route de Pauillac 33340 Saint-Germain-d'Esteuil,33412_0231_00010,G,10 ROUTE DE PAUILLAC,
332834977,00016,33283497700016,O,1985-01-01,NN,,,2008-01-04T20:31:06,true,3,,,,,,33340,SAINT GERMAIN D'ESTEUIL,,,33412,,,,,,,,,,,,,,,,,,,2008-01-01,A,,,,,01.21Z,NAFRev2,N,,,0,,,,,,
333633329,00011,33363332900011,O,1985-07-01,NN,,,2006-10-27T02:30:47,true,4,,,,,DOMAINE DE LA LAGUNE,33340,SAINT GERMAIN D'ESTEUIL,,,33412,,,,,,,,,,,,,,,,,,,2004-05-12,F,,,,,51.3J,NAFRev1,O,-0.844816,45.284017,0.56,street,Domaine de Cassan 33340 Saint-Germain-d'Esteuil,33412_a023,G,DOMAINE DE CASSAN,
334023751,00046,33402375100046,O,1997-07-08,,,,2017-09-12T03:58:19,false,4,LE CHALET DE BOIS,16,,RTE,DE BOYENTRAN,33340,SAINT GERMAIN D'ESTEUIL,,,33412,,,,,,,,,,,,,,,,,,,2017-07-10,F,,,,,02.20Z,NAFRev2,N,-0.851299,45.290362,0.85,housenumber,16 Route de Boyentran 33340 Saint-Germain-d'Esteuil,33412_0038_00016,G,16 ROUTE DE BOYENTRAN,
334373685,00018,33437368500018,O,,NN,,,,true,1,,,,LD,ARTIGUILLON,33340,SAINT GERMAIN D'ESTEUIL,,,33412,,,,,,,,,,,,,,,,,,,1994-12-31,F,,,,,15.8C,NAF1993,N,-0.888362,45.271912,0.94,street,Artiguillon 33340 Saint-Germain-d'Esteuil,33412_turtd9,G,ARTIGUILLON,
334568425,00014,33456842500014,O,1985-12-12,NN,,,2008-11-07T00:54:50,true,4,,52,,RTE,DE LIARD,33340,SAINT GERMAIN D'ESTEUIL,,,33412,,,,,,,,,,,,,,,,,,,2006-06-30,F,,,,,45.2V,NAFRev1,O,-0.896618,45.274357,0.83,housenumber,52 Route de Liard 33340 Saint-Germain-d'Esteuil,33412_0171_00052,G,52 ROUTE DE LIARD,
335098711,00013,33509871100013,O,1985-10-21,NN,,,2008-01-04T21:07:30,true,3,,,,,DOMAINE DE CASSAN,33340,SAINT GERMAIN D'ESTEUIL,,,33412,,,,,,,,,,,,,,,,,,,2008-01-01,A,,,,,68.20B,NAFRev2,N,-0.844816,45.284017,0.94,street,Domaine de Cassan 33340 Saint-Germain-d'Esteuil,33412_a023,G,DOMAINE DE CASSAN,
335315412,00015,33531541200015,O,1986-05-02,NN,,,,true,1,,,,,ARTIGUILLON,33340,SAINT GERMAIN D'ESTEUIL,,,33412,,,,,,,,,,,,,,,,,,,1999-02-28,F,,,,,50.5Z,NAF1993,N,-0.888362,45.271912,0.94,street,Artiguillon 33340 Saint-Germain-d'Esteuil,33412_turtd9,G,ARTIGUILLON,
337696801,00014,33769680100014,O,1986-05-15,NN,,,2008-11-07T00:56:28,false,3,,,,LD,L HOPITAL,33340,SAINT GERMAIN D'ESTEUIL,,,33412,,,,,,,,,,,,,,,,,,,1994-12-25,F,MENAFROID,,,,29.2F,NAF1993,N,-0.879119,45.2944,0.92,street,Route de l'Hôpital 33340 Saint-Germain-d'Esteuil,33412_0146,G,ROUTE DE L HOPITAL,
338006455,00012,33800645500012,O,,,,,,true,1,,,,LD,ARTIGUILLON,33340,SAINT GERMAIN D'ESTEUIL,,,33412,,,,,,,,,,,,,,,,,,,1994-12-31,F,,,,,15.8C,NAF1993,N,-0.888362,45.271912,0.94,street,Artiguillon 33340 Saint-Germain-d'Esteuil,33412_turtd9,G,ARTIGUILLON,
338058175,00013,33805817500013,O,,,,,,true,1,,,,,LE BOURG,33340,SAINT GERMAIN D'ESTEUIL,,,33412,,,,,,,,,,,,,,,,,,,1987-01-02,F,,,,,62.46,NAP,N,-0.86521,45.289394,0.94,street,Le Bourg 33340 Saint-Germain-d'Esteuil,33412_oelb7f,G,LE BOURG,
338231475,00033,33823147500033,O,2005-07-06,NN,,,2011-04-23T05:57:59,true,5,CHATEAU CASTERA,,,,LE CASTERA,33340,SAINT GERMAIN D'ESTEUIL,,,33412,,,,,,,,,,,,,,,,,,,2010-10-05,F,,,,,70.22Z,NAFRev2,N,-0.844816,45.284017,0.43,street,Domaine de Cassan 33340 Saint-Germain-d'Esteuil,33412_a023,G,DOMAINE DE CASSAN,
338832173,00029,33883217300029,O,1987-01-09,NN,,,2012-05-05T02:34:50,true,6,,,,,,33340,SAINT GERMAIN D'ESTEUIL,,,33412,,,,,,,,,,,,,,,,,,,2010-12-20,F,,,,,01.21Z,NAFRev2,O,,,0,,,,,,
339118432,00014,33911843200014,O,,NN,,,,true,1,,,,LD,ARTIGUILLON,33340,SAINT GERMAIN D'ESTEUIL,,,33412,,,,,,,,,,,,,,,,,,,1988-07-31,F,,,,,33.02,NAP,N,-0.888362,45.271912,0.94,street,Artiguillon 33340 Saint-Germain-d'Esteuil,33412_turtd9,G,ARTIGUILLON,
339124737,00018,33912473700018,O,,NN,,,,true,1,,,,,LE BOURG,33340,SAINT GERMAIN D'ESTEUIL,,,33412,,,,,,,,,,,,,,,,,,,1991-07-11,F,,,,,86.06,NAP,N,-0.86521,45.289394,0.94,street,Le Bourg 33340 Saint-Germain-d'Esteuil,33412_oelb7f,G,LE BOURG,
339177503,00010,33917750300010,O,,NN,,,,true,1,,,,LD,LE MARTIBEAU,33340,SAINT GERMAIN D'ESTEUIL,,,33412,,,,,,,,,,,,,,,,,,,1989-12-14,F,,,,,02.20,NAP,N,-0.860376,45.285442,0.94,street,Le Martibeau 33340 Saint-Germain-d'Esteuil,33412_987pd9,G,LE MARTIBEAU,
340835099,00029,34083509900029,O,2003-11-04,NN,,,2008-03-04T08:42:55,true,3,,21,,RTE,DE LUC BEIL,33340,SAINT GERMAIN D'ESTEUIL,,,33412,,,,,,,,,,,,,,,,,,,2006-05-03,F,,,,,01.4A,NAFRev1,N,,,0,,,,,,
341324143,00013,34132414300013,O,,NN,,,,true,1,,,,LD,PAWDOT,33340,SAINT GERMAIN D'ESTEUIL,,,33412,,,,,,,,,,,,,,,,,,,1987-04-07,F,,,,,48.05,NAP,N,,,0,,,,,,
341679033,00017,34167903300017,O,,NN,,,,true,1,,,,LD,ARTIGUILLON,33340,SAINT GERMAIN D'ESTEUIL,,,33412,,,,,,,,,,,,,,,,,,,1992-02-24,F,,,,,36.1G,NAF1993,N,-0.888362,45.271912,0.94,street,Artiguillon 33340 Saint-Germain-d'Esteuil,33412_turtd9,G,ARTIGUILLON,
342098464,00023,34209846400023,O,1989-09-12,NN,,,2008-01-04T21:59:44,true,3,,8,,RUE,LALO,33340,SAINT GERMAIN D'ESTEUIL,,,33412,,,,,,,,,,,,,,,,,,,2008-01-01,A,,,,,01.61Z,NAFRev2,N,-0.872191,45.296864,0.68,housenumber,8 Route de Lalo 33340 Saint-Germain-d'Esteuil,33412_0158_00008,G,8 ROUTE DE LALO,
342428679,00019,34242867900019,O,1984-08-09,NN,,,2017-01-11T09:42:11,false,3,,,,,L'HOPITAL,33340,SAINT GERMAIN D'ESTEUIL,,,33412,,,,,,,,,,,,,,,,,,,2006-04-30,F,,,,,01.1G,NAFRev1,N,-0.879119,45.2944,0.92,street,Route de l'Hôpital 33340 Saint-Germain-d'Esteuil,33412_0146,G,ROUTE DE L HOPITAL,
342529500,00015,34252950000015,O,1987-10-01,NN,,4331ZB,2018-09-29T12:34:42,true,5,,,,LD,LES CERISIERS,33340,SAINT GERMAIN D'ESTEUIL,,,33412,,,,,,,,,,,,,,,,,,,2016-07-12,F,,,,,43.31Z,NAFRev2,O,-0.866265,45.265022,0.8,street,Chemin des Cerisiers 33340 Saint-Germain-d'Esteuil,33412_0058,G,CHEMIN DES CERISIERS,