siren,nic,siret,statutDiffusionEtablissement,dateCreationEtablissement,trancheEffectifsEtablissement,anneeEffectifsEtablissement,activitePrincipaleRegistreMetiersEtablissement,dateDernierTraitementEtablissement,etablissementSiege,nombrePeriodesEtablissement,complementAdresseEtablissement,numeroVoieEtablissement,indiceRepetitionEtablissement,typeVoieEtablissement,libelleVoieEtablissement,codePostalEtablissement,libelleCommuneEtablissement,libelleCommuneEtrangerEtablissement,distributionSpecialeEtablissement,codeCommuneEtablissement,codeCedexEtablissement,libelleCedexEtablissement,codePaysEtrangerEtablissement,libellePaysEtrangerEtablissement,complementAdresse2Etablissement,numeroVoie2Etablissement,indiceRepetition2Etablissement,typeVoie2Etablissement,libelleVoie2Etablissement,codePostal2Etablissement,libelleCommune2Etablissement,libelleCommuneEtranger2Etablissement,distributionSpeciale2Etablissement,codeCommune2Etablissement,codeCedex2Etablissement,libelleCedex2Etablissement,codePaysEtranger2Etablissement,libellePaysEtranger2Etablissement,dateDebut,etatAdministratifEtablissement,enseigne1Etablissement,enseigne2Etablissement,enseigne3Etablissement,denominationUsuelleEtablissement,activitePrincipaleEtablissement,nomenclatureActivitePrincipaleEtablissement,caractereEmployeurEtablissement,longitude,latitude,geo_score,geo_type,geo_adresse,geo_id,geo_ligne,geo_l4,geo_l5
195600630,00014,19560063000014,O,1983-03-01,12,2018,,2020-08-25T10:14:14,true,4,,,,RTE,DU COLPO,56660,SAINT-JEAN-BREVELAY,,,56222,,,,,,,,,,,,,,,,,,,2012-02-12,A,,,,,85.31Z,NAFRev2,O,-2.736204,47.843038,0.59,locality,Route de Colpo 56660 Saint-Jean-Brévelay,56222_0040,G,ROUTE DE COLPO,
195602743,00013,19560274300013,O,1983-03-01,21,2018,,2020-08-25T10:14:14,true,7,,,,,LE SULLIO,56660,SAINT-JEAN-BREVELAY,,,56222,,,,,,,,,,,,,,,,,,,2010-01-17,A,LPA,,,,85.32Z,NAFRev2,O,-2.749899,47.8251,0.38,locality,Le Moulin de Sclunge 56660 Saint-Jean-Brévelay,56222_b358,G,LE MOULIN DE SCLUNGE,
195602743,00047,19560274300047,O,1989-01-01,,,,2019-11-14T14:00:45,false,4,,,,,LE SULLIO,56660,SAINT-JEAN-BREVELAY,,,56222,,,,,,,,,,,,,,,,,,,2008-01-01,A,EXPLOITATION AGRICOLE,,,,01.30Z,NAFRev2,N,-2.749899,47.8251,0.38,locality,Le Moulin de Sclunge 56660 Saint-Jean-Brévelay,56222_b358,G,LE MOULIN DE SCLUNGE,
215602228,00011,21560222800011,O,1983-03-01,11,2018,,2020-08-25T10:17:51,true,4,,11,,RUE,DE RENNES,56660,SAINT-JEAN-BREVELAY,,,56222,,,,,,,,,,,,,,,,,,,2008-01-01,A,MAIRIE,,,,84.11Z,NAFRev2,O,-2.720976,47.845135,0.94,housenumber,11 Rue de Rennes 56660 Saint-Jean-Brévelay,56222_0180_00011,G,11 RUE DE RENNES,
215602228,00029,21560222800029,O,1983-12-21,11,2018,,2020-08-25T10:17:51,false,3,KERFROLO,,,RTE,DE COLPO,56660,SAINT-JEAN-BREVELAY,,,56222,,,,,,,,,,,,,,,,,,,2008-01-01,A,ECOLE PRIMAIRE PUBL PAUL-EMILE VICTOR,,,,85.20Z,NAFRev2,N,-2.736204,47.843038,0.8,locality,Route de Colpo 56660 Saint-Jean-Brévelay,56222_0040,G,ROUTE DE COLPO,
215602228,00037,21560222800037,O,1994-12-25,NN,,,2019-11-14T14:00:45,false,2,MAIRIE,11,,RUE,DE RENNES,56660,SAINT-JEAN-BREVELAY,,,56222,,,,,,,,,,,,,,,,,,,2008-01-01,A,SERVICE D'ASSAINISSEMENT,,,,37.00Z,NAFRev2,N,-2.720976,47.845135,0.94,housenumber,11 Rue de Rennes 56660 Saint-Jean-Brévelay,56222_0180_00011,G,11 RUE DE RENNES,
215602228,00045,21560222800045,O,2000-02-01,NN,,,2019-11-14T14:00:45,false,4,MAIRIE,11,,RUE,DE RENNES,56660,SAINT-JEAN-BREVELAY,,,56222,,,,,,,,,,,,,,,,,,,2012-12-25,F,LOTISSEMENT COMMUNAL,,,,42.99Z,NAFRev2,N,-2.720976,47.845135,0.94,housenumber,11 Rue de Rennes 56660 Saint-Jean-Brévelay,56222_0180_00011,G,11 RUE DE RENNES,
215602228,00052,21560222800052,O,2001-12-25,NN,,,2019-11-14T14:00:45,false,3,MAIRIE,11,,RUE,DE RENNES,56660,SAINT-JEAN-BREVELAY,,,56222,,,,,,,,,,,,,,,,,,,2008-01-01,F,LOTISSEMENT SAMSON,,,,42.99Z,NAFRev2,N,-2.720976,47.845135,0.94,housenumber,11 Rue de Rennes 56660 Saint-Jean-Brévelay,56222_0180_00011,G,11 RUE DE RENNES,
215602228,00060,21560222800060,O,2003-01-01,NN,,,2019-11-14T14:00:45,false,4,,7,,RUE,SAINT-ARMEL,56660,SAINT-JEAN-BREVELAY,,,56222,,,,,,,,,,,,,,,,,,,2012-12-25,F,LOGEMENTS LOCATIFS,,,,68.20A,NAFRev2,N,-2.722614,47.844954,0.94,housenumber,7 Rue Saint Armel 56660 Saint-Jean-Brévelay,56222_0200_00007,G,7 RUE SAINT ARMEL,
215602228,00078,21560222800078,O,2004-03-31,NN,,,2019-11-14T14:00:45,false,4,MAIRIE,11,,RUE,DE RENNES,56660,SAINT-JEAN-BREVELAY,,,56222,,,,,,,,,,,,,,,,,,,2008-01-01,F,LOTISSEMENT COET BIHAN,,,,42.99Z,NAFRev2,N,-2.720976,47.845135,0.94,housenumber,11 Rue de Rennes 56660 Saint-Jean-Brévelay,56222_0180_00011,G,11 RUE DE RENNES,
215602228,00086,21560222800086,O,2005-03-21,,,,2019-11-14T14:00:45,false,3,,11,,RUE,DE RENNES,56660,SAINT-JEAN-BREVELAY,,,56222,,,,,,,,,,,,,,,,,,,2008-01-01,F,LOTISSEMENT ROBIN,,,,42.99Z,NAFRev2,N,-2.720976,47.845135,0.94,housenumber,11 Rue de Rennes 56660 Saint-Jean-Brévelay,56222_0180_00011,G,11 RUE DE RENNES,
225600014,00388,22560001400388,O,1998-12-15,03,2018,,2020-08-25T10:19:55,false,4,,,,RUE,DU STADE,56660,SAINT-JEAN-BREVELAY,,,56222,,,,,,,,,,,,,,,,,,,2008-01-01,A,DGISS CENTRE MEDICO SOCIAL,,,,86.21Z,NAFRev2,N,-2.711445,47.84506,0.94,street,Rue du Stade 56660 Saint-Jean-Brévelay,56222_0222,G,RUE DU STADE,
245600143,00011,24560014300011,O,1983-03-01,NN,,,2019-11-14T14:00:45,false,4,ZI DU LAY,,,,BOURG,56660,SAINT-JEAN-BREVELAY,,,56222,,,,,,,,,,,,,,,,,,,2003-10-02,F,,,,,75.1A,NAFRev1,N,-2.723817,47.840654,0.43,street,Rue du Bon Secours 56660 Saint-Jean-Brévelay,56222_0024,G,RUE DU BON SECOURS,
245600143,00029,24560014300029,O,2003-10-02,NN,,,2019-11-14T14:00:45,false,4,,,,,ZONE INDUSTRIELLE DU LAY,56660,SAINT-JEAN-BREVELAY,,,56222,,,,,,,,,,,,,,,,,,,2008-03-07,F,,,,,84.11Z,NAFRev2,O,-2.728832,47.855246,0.94,street,Zone Industrielle du Lay 56660 Saint-Jean-Brévelay,56222_b370,G,ZONE INDUSTRIELLE DU LAY,
245600143,00037,24560014300037,O,2003-10-15,NN,,,2019-11-14T14:00:45,false,4,MAISON DES SERVICES PUBLICS,27,,RUE,DE RENNES,56660,SAINT-JEAN-BREVELAY,,,56222,,,,,,,,,,,,,,,,,,,2017-01-01,F,LOGEMENT GENDARMERIE,,,,68.20A,NAFRev2,N,-2.717017,47.845196,0.94,housenumber,27 Rue de Rennes 56660 Saint-Jean-Brévelay,56222_0180_00027,G,27 RUE DE RENNES,
245600143,00086,24560014300086,O,2008-03-07,NN,,,2019-11-14T14:00:45,false,2,,3,,RUE,DU GENERAL DE GAULLE,56660,SAINT-JEAN-BREVELAY,,,56222,,,,,,,,,,,,,,,,,,,2010-05-04,F,,,,,84.11Z,NAFRev2,O,-2.719014,47.845779,0.94,housenumber,3 Rue du Général de Gaulle 56660 Saint-Jean-Brévelay,56222_0081_00003,G,3 RUE DU GENERAL DE GAULLE,
245600143,00094,24560014300094,O,2009-04-01,NN,,,2019-11-14T14:00:45,false,3,,6,,RUE,BULEON,56660,SAINT-JEAN-BREVELAY,,BP 03,56222,,,,,,,,,,,,,,,,,,,2013-06-10,F,,,,,84.11Z,NAFRev2,N,-2.72215,47.845505,0.93,housenumber,6 Rue de Buleon 56660 Saint-Jean-Brévelay,56222_0033_00006,G,6 RUE DE BULEON,
245600143,00102,24560014300102,O,2013-06-10,00,2017,,2019-11-14T14:00:45,true,2,MAISON DES SERVICES PUBLICS,27,,RUE,DE RENNES,56660,SAINT-JEAN-BREVELAY,,,56222,,,,,,,,,,,,,,,,,,,2017-01-01,F,,,,,84.11Z,NAFRev2,O,-2.717017,47.845196,0.94,housenumber,27 Rue de Rennes 56660 Saint-Jean-Brévelay,56222_0180_00027,G,27 RUE DE RENNES,
255600488,00019,25560048800019,O,1983-03-01,NN,,,2019-11-14T14:00:45,true,4,MAIRIE,11,,RUE,RENNES,56660,SAINT-JEAN-BREVELAY,,,56222,,,,,,,,,,,,,,,,,,,2012-01-01,F,,,,,36.00Z,NAFRev2,N,-2.720976,47.845135,0.93,housenumber,11 Rue de Rennes 56660 Saint-Jean-Brévelay,56222_0180_00011,G,11 RUE DE RENNES,
255600660,00013,25560066000013,O,,NN,,,2019-11-14T14:00:45,true,1,,,,LD,SOURAN,56660,SAINT-JEAN-BREVELAY,,,56222,,,,,,,,,,,,,,,,,,,1996-07-12,F,,,,,75.1E,NAF1993,N,-2.723817,47.840654,0.39,street,Rue du Bon Secours 56660 Saint-Jean-Brévelay,56222_0024,G,RUE DU BON SECOURS,
255613432,00012,25561343200012,O,2003-11-17,NN,,,2019-11-14T14:00:45,false,3,,,,,ZI DU LAY,56660,SAINT-JEAN-BREVELAY,,,56222,,,,,,,,,,,,,,,,,,,2006-09-22,F,,,,,75.1A,NAFRev1,N,-2.728832,47.855246,0.65,street,Zone Industrielle du Lay 56660 Saint-Jean-Brévelay,56222_b370,G,ZONE INDUSTRIELLE DU LAY,
255613432,00020,25561343200020,O,2004-09-01,,,,2019-11-14T14:00:45,false,4,CC ST JEAN COMM - MAISON SCES COMMUNS,27,,RUE,DE RENNES,56660,SAINT-JEAN-BREVELAY,,,56222,,,,,,,,,,,,,,,,,,,2016-12-31,F,ZA,,,,42.99Z,NAFRev2,N,-2.717017,47.845196,0.94,housenumber,27 Rue de Rennes 56660 Saint-Jean-Brévelay,56222_0180_00027,G,27 RUE DE RENNES,
255613432,00038,25561343200038,O,2006-09-22,NN,,,2019-11-14T14:00:45,false,3,SAINT JEAN BREVELAY COMMUNAUTE,3,,RUE,DU GENERAL DE GAULLE,56660,SAINT-JEAN-BREVELAY,,,56222,,,,,,,,,,,,,,,,,,,2013-11-17,F,,,,,84.11Z,NAFRev2,N,-2.719014,47.845779,0.94,housenumber,3 Rue du Général de Gaulle 56660 Saint-Jean-Brévelay,56222_0081_00003,G,3 RUE DU GENERAL DE GAULLE,
255613432,00053,25561343200053,O,2013-11-17,,,,2019-11-14T14:00:45,true,2,ST JEAN COMM - MAISON SCES PUBLICS,27,,RUE,DE RENNES,56660,SAINT-JEAN-BREVELAY,,,56222,,,,,,,,,,,,,,,,,,,2016-12-31,F,,,,,84.11Z,NAFRev2,N,-2.717017,47.845196,0.94,housenumber,27 Rue de Rennes 56660 Saint-Jean-Brévelay,56222_0180_00027,G,27 RUE DE RENNES,
265600254,00014,26560025400014,O,1983-03-01,21,2018,,2020-08-25T10:21:07,true,4,,,,RUE,DE RENNES,56660,SAINT-JEAN-BREVELAY,,,56222,,,,,,,,,,,,,,,,,,,2008-01-01,A,,,,,87.10A,NAFRev2,O,-2.721521,47.84531,0.94,street,Rue de Rennes 56660 Saint-Jean-Brévelay,56222_0180,G,RUE DE RENNES,
265603357,00012,26560335700012,O,1986-03-25,NN,,,2019-11-14T14:00:45,true,5,MAIRIE,11,,RUE,DE RENNES,56660,SAINT-JEAN-BREVELAY,,,56222,,,,,,,,,,,,,,,,,,,2008-12-25,A,,,,,88.99B,NAFRev2,N,-2.720976,47.845135,0.94,housenumber,11 Rue de Rennes 56660 Saint-Jean-Brévelay,56222_0180_00011,G,11 RUE DE RENNES,
295600316,00018,29560031600018,O,1983-08-10,NN,,,2019-11-14T14:00:45,true,4,,11,,RUE,DE RENNES,56660,SAINT-JEAN-BREVELAY,,,56222,,,,,,,,,,,,,,,,,,,2010-03-02,F,,,,,42.99Z,NAFRev2,N,-2.720976,47.845135,0.94,housenumber,11 Rue de Rennes 56660 Saint-Jean-Brévelay,56222_0180_00011,G,11 RUE DE RENNES,
300459120,00279,30045912000279,O,2006-09-19,,,,2019-11-14T14:00:45,false,1,,,,RUE,DES HERBIERS,56660,SAINT-JEAN-BREVELAY,,,56222,,,,,,,,,,,,,,,,,,,2006-09-19,A,,,,,47.76Z,NAFRev2,N,-2.722651,47.846564,0.94,street,Rue des Herbiers 56660 Saint-Jean-Brévelay,56222_0104,G,RUE DES HERBIERS,
300820990,00012,30082099000012,O,,,,,2019-11-14T14:00:45,true,1,,,,,BOURG,56660,SAINT-JEAN-BREVELAY,,,56222,,,,,,,,,,,,,,,,,,,1988-03-11,F,,,,,67.02,NAP,N,-2.723817,47.840654,0.43,street,Rue du Bon Secours 56660 Saint-Jean-Brévelay,56222_0024,G,RUE DU BON SECOURS,
301224119,00018,30122411900018,O,,,,,2019-11-14T14:00:45,true,1,,,,RUE,DE BULEON,56660,SAINT-JEAN-BREVELAY,,,56222,,,,,,,,,,,,,,,,,,,1984-12-25,F,,,,,64.21,NAP,N,-2.722378,47.845233,0.94,street,Rue de Buleon 56660 Saint-Jean-Brévelay,56222_0033,G,RUE DE BULEON,
302323308,00015,30232330800015,O,,NN,,,2019-11-14T14:00:45,true,1,,1,,RUE,ST ARMEL,56660,SAINT-JEAN-BREVELAY,,,56222,,,,,,,,,,,,,,,,,,,1995-11-06,F,,,,,70.2C,NAF1993,N,-2.722107,47.845022,0.82,housenumber,1 Rue Saint Armel 56660 Saint-Jean-Brévelay,56222_0200_00001,G,1 RUE SAINT ARMEL,
302557582,00038,30255758200038,O,1993-05-01,NN,,,2019-11-14T14:00:45,false,4,,,,,ZONE INDUSTRIELLE,56660,SAINT-JEAN-BREVELAY,,,56222,,,,,,,,,,,,,,,,,,,1994-12-25,F,,,,,15.1C,NAF1993,O,-2.727695,47.847578,0.94,locality,Zone Industrielle 56660 Saint-Jean-Brévelay,56222_b322,G,ZONE INDUSTRIELLE,
302600242,00010,30260024200010,O,1975-01-01,,,,2019-11-14T14:00:45,true,1,,8,,RUE,DU PONT BANIR,56660,SAINT-JEAN-BREVELAY,,,56222,,,,,,,,,,,,,,,,,,,2000-12-31,F,,,,,45.4J,NAF1993,N,-2.724729,47.84194,0.81,housenumber,8 Rue du Pont Baner 56660 Saint-Jean-Brévelay,56222_0165_00008,G,8 RUE DU PONT BANER,
302890496,00011,30289049600011,O,,NN,,,2019-11-14T14:00:45,true,1,,,,LD,PORCHICAN,56660,SAINT-JEAN-BREVELAY,,,56222,,,,,,,,,,,,,,,,,,,1989-06-30,F,,,,,22.02,NAP,N,,,0,,,,,,
302890504,00012,30289050400012,O,1965-01-01,NN,,,2019-11-14T14:00:45,true,5,,,,LD,PARK CHICAN,56660,SAINT-JEAN-BREVELAY,,,56222,,,,,,,,,,,,,,,,,,,2008-01-01,F,,,,,68.20B,NAFRev2,N,-2.730241,47.814022,0.94,locality,Park Chican 56660 Saint-Jean-Brévelay,56222_b228,G,PARK CHICAN,
303822860,00019,30382286000019,O,,NN,,,2019-11-14T14:00:45,true,1,,13,,RUE,ST ARMEL,56660,SAINT-JEAN-BREVELAY,,,56222,,,,,,,,,,,,,,,,,,,,F,,,,,62.43,NAP,N,-2.723387,47.844835,0.83,housenumber,13 Rue Saint Armel 56660 Saint-Jean-Brévelay,56222_0200_00013,G,13 RUE SAINT ARMEL,
303822878,00011,30382287800011,O,,,,,2019-11-14T14:00:45,true,1,,4,,RUE,DU PARC,56660,SAINT-JEAN-BREVELAY,,,56222,,,,,,,,,,,,,,,,,,,,F,,,,,64.21,NAP,N,-2.72462,47.843653,0.94,housenumber,4 Rue du Parc 56660 Saint-Jean-Brévelay,56222_0130_00004,G,4 RUE DU PARC,
303854954,00011,30385495400011,O,1975-01-01,NN,,,2019-11-14T14:00:45,true,5,,11,,RUE,DU STADE,56660,SAINT-JEAN-BREVELAY,,,56222,,,,,,,,,,,,,,,,,,,2008-01-01,F,,,,,43.32A,NAFRev2,N,-2.711068,47.843525,0.94,housenumber,11 Rue du Stade 56660 Saint-Jean-Brévelay,56222_0222_00011,G,11 RUE DU STADE,
304612203,00014,30461220300014,O,,,,,2019-11-14T14:00:45,true,1,,,,LD,KERGAL,56660,SAINT-JEAN-BREVELAY,,,56222,,,,,,,,,,,,,,,,,,,1984-12-25,F,,,,,22.02,NAP,N,-2.708322,47.845951,0.52,street,Rue de Kergonan 56660 Saint-Jean-Brévelay,56222_0121,G,RUE DE KERGONAN,
305692188,00025,30569218800025,O,1900-01-01,NN,,,2019-11-14T14:00:45,true,4,,,,RUE,LE CLOS ST JEAN,56660,SAINT-JEAN-BREVELAY,,,56222,,,,,,,,,,,,,,,,,,,2010-11-03,F,,,,,86.90D,NAFRev2,N,-2.719402,47.843431,0.67,street,Rue du Clos Saint Jean 56660 Saint-Jean-Brévelay,56222_0058,G,RUE DU CLOS SAINT JEAN,
306452863,00013,30645286300013,O,,NN,,,2019-11-14T14:00:45,true,1,,2,,RUE,SAINT ARMEL,56660,SAINT-JEAN-BREVELAY,,,56222,,,,,,,,,,,,,,,,,,,1989-07-31,F,,,,,64.11,NAP,N,-2.721868,47.845106,0.94,housenumber,2 Rue Saint Armel 56660 Saint-Jean-Brévelay,56222_0200_00002,G,2 RUE SAINT ARMEL,
306569385,00017,30656938500017,O,,NN,,,2019-11-14T14:00:45,true,1,,21,,RUE,DE RENNES,56660,SAINT-JEAN-BREVELAY,,,56222,,,,,,,,,,,,,,,,,,,1990-08-17,F,,,,,67.04,NAP,N,-2.719325,47.845162,0.94,housenumber,21 Rue de Rennes 56660 Saint-Jean-Brévelay,56222_0180_00021,G,21 RUE DE RENNES,
306907387,00063,30690738700063,O,1990-10-01,NN,,,2019-11-14T14:00:45,false,3,,21,,RUE,DE RENNES,56660,SAINT-JEAN-BREVELAY,,,56222,,,,,,,,,,,,,,,,,,,2003-12-31,F,,,,,55.3A,NAFRev1,O,-2.719325,47.845162,0.94,housenumber,21 Rue de Rennes 56660 Saint-Jean-Brévelay,56222_0180_00021,G,21 RUE DE RENNES,
306962127,00016,30696212700016,O,1900-01-01,NN,,,2019-11-14T14:00:45,false,5,,,,,MAIRIE,56660,SAINT-JEAN-BREVELAY,,,56222,,,,,,,,,,,,,,,,,,,2013-01-10,F,,,,,88.10A,NAFRev2,O,-2.755213,47.802893,0.65,locality,La Metairie Neuve 56660 Saint-Jean-Brévelay,56222_b345,G,LA METAIRIE NEUVE,
306962127,00024,30696212700024,O,2013-01-10,12,2018,,2020-08-25T10:23:39,true,2,MAISON DE SERVICES PUBLICS,27,,RUE,DE RENNES,56660,SAINT-JEAN-BREVELAY,,,56222,,,,,,,,,,,,,,,,,,,2019-08-01,F,,,,,88.10A,NAFRev2,O,-2.717017,47.845196,0.94,housenumber,27 Rue de Rennes 56660 Saint-Jean-Brévelay,56222_0180_00027,G,27 RUE DE RENNES,
307016329,00038,30701632900038,O,1996-06-01,NN,,,2019-11-14T14:00:45,false,4,,,,,PARK CHICAN,56660,SAINT-JEAN-BREVELAY,,,56222,,,,,,,,,,,,,,,,,,,1999-12-31,F,,,,,45.2L,NAF1993,O,-2.730241,47.814022,0.94,locality,Park Chican 56660 Saint-Jean-Brévelay,56222_b228,G,PARK CHICAN,
309035004,00014,30903500400014,O,,NN,,,2019-11-14T14:00:45,true,1,,8,,RUE,JULES SIMON,56660,SAINT-JEAN-BREVELAY,,,56222,,,,,,,,,,,,,,,,,,,1996-12-15,F,,,,,52.1B,NAF1993,N,-2.722822,47.845476,0.94,housenumber,8 Rue Jules Simon 56660 Saint-Jean-Brévelay,56222_0113_00008,G,8 RUE JULES SIMON,
309357242,00085,30935724200085,O,,NN,,,2019-11-14T14:00:45,true,1,,,,,ZI DU LAY,56660,SAINT-JEAN-BREVELAY,,,56222,,,,,,,,,,,,,,,,,,,1997-08-22,F,,,,,80.4C,NAF1993,N,-2.728832,47.855246,0.65,street,Zone Industrielle du Lay 56660 Saint-Jean-Brévelay,56222_b370,G,ZONE INDUSTRIELLE DU LAY,
309407708,00044,30940770800044,O,2000-01-01,,,,2019-11-14T14:00:45,false,4,,23,,RUE,DE RENNES,56660,SAINT-JEAN-BREVELAY,,,56222,,,,,,,,,,,,,,,,,,,2011-11-14,F,,,,,69.20Z,NAFRev2,O,-2.718865,47.845161,0.94,housenumber,23 Rue de Rennes 56660 Saint-Jean-Brévelay,56222_0180_00023,G,23 RUE DE RENNES,
309649408,00031,30964940800031,O,1987-07-10,NN,,,2020-08-12T19:34:46,true,3,,,,RUE,DE VANNES,56660,SAINT-JEAN-BREVELAY,,,56222,,,,,,,,,,,,,,,,,,,2008-01-01,A,,,,,64.19Z,NAFRev2,N,-2.721635,47.844983,0.94,street,Rue de Vannes 56660 Saint-Jean-Brévelay,56222_0242,G,RUE DE VANNES,
311198071,00012,31119807100012,O,,,,,2019-11-14T14:00:45,true,1,,,,,ABATTOIR,56660,SAINT-JEAN-BREVELAY,,,56222,,,,,,,,,,,,,,,,,,,1990-04-05,F,,,,,35.01,NAP,N,-2.7354,47.812137,0.41,locality,Le Petit Moustoir 56660 Saint-Jean-Brévelay,56222_b325,G,LE PETIT MOUSTOIR,
311228563,00020,31122856300020,O,1983-07-01,NN,,,2019-11-14T14:00:45,true,5,,,,,TALRUN,56660,SAINT-JEAN-BREVELAY,,,56222,,,,,,,,,,,,,,,,,,,2008-01-01,F,,,,,43.31Z,NAFRev2,N,,,0,,,,,,
312198864,00018,31219886400018,O,,,,,2019-11-14T14:00:45,true,1,,10,,RUE,DE RENNES,56660,SAINT-JEAN-BREVELAY,,,56222,,,,,,,,,,,,,,,,,,,1984-12-25,F,,,,,81.21,NAP,N,-2.720623,47.845058,0.94,housenumber,10 Rue de Rennes 56660 Saint-Jean-Brévelay,56222_0180_00010,G,10 RUE DE RENNES,
312218167,00012,31221816700012,O,,,,,2019-11-14T14:00:45,true,1,,10,,RUE,RENNES,56660,SAINT-JEAN-BREVELAY,,,56222,,,,,,,,,,,,,,,,,,,1984-12-25,F,,,,,81.21,NAP,N,-2.720623,47.845058,0.93,housenumber,10 Rue de Rennes 56660 Saint-Jean-Brévelay,56222_0180_00010,G,10 RUE DE RENNES,
312275803,00012,31227580300012,O,,,,,2019-11-14T14:00:45,true,1,,10,,RUE,DE RENNES,56660,SAINT-JEAN-BREVELAY,,,56222,,,,,,,,,,,,,,,,,,,1997-06-30,F,,,,,55.4B,NAF1993,N,-2.720623,47.845058,0.94,housenumber,10 Rue de Rennes 56660 Saint-Jean-Brévelay,56222_0180_00010,G,10 RUE DE RENNES,
312979511,00028,31297951100028,O,1992-01-01,,,,2019-11-14T14:00:45,false,3,,,,,LE QUILLIO,56660,SAINT-JEAN-BREVELAY,,,56222,,,,,,,,,,,,,,,,,,,1997-05-14,F,,,,,01.2A,NAF1993,N,-2.8779347,48.2457106,0.9,poi,(Pont) Le Quillio,https://osm.org/way/280734988,G,,
313439465,00011,31343946500011,O,,,,,2019-11-14T14:00:45,true,1,,,,,ABATTOIR,56660,SAINT-JEAN-BREVELAY,,,56222,,,,,,,,,,,,,,,,,,,1987-12-25,F,,,,,35.01,NAP,N,-2.7354,47.812137,0.41,locality,Le Petit Moustoir 56660 Saint-Jean-Brévelay,56222_b325,G,LE PETIT MOUSTOIR,
313710907,00012,31371090700012,O,,NN,,,2019-11-14T14:00:45,true,1,,,,,SALLE DE LA MAIRIE,56660,SAINT-JEAN-BREVELAY,,,56222,,,,,,,,,,,,,,,,,,,,F,,,,,96.15,NAP,N,-1.7252864,47.0564887,0.9,poi.community_centre,Salle de la mairie (Salle des fêtes) Saint-Lumine-de-Coutais,https://osm.org/way/72243817,G,,
314027053,00011,31402705300011,O,,NN,,,2019-11-14T14:00:45,true,1,,9,,RUE,ST ARMEL,56660,SAINT-JEAN-BREVELAY,,,56222,,,,,,,,,,,,,,,,,,,1989-03-31,F,,,,,87.01,NAP,N,-2.722796,47.844927,0.82,housenumber,9 Rue Saint Armel 56660 Saint-Jean-Brévelay,56222_0200_00009,G,9 RUE SAINT ARMEL,
314800012,00010,31480001200010,O,,,,,2019-11-14T14:00:45,true,1,,4,,RUE,SAINT ARMEL,56660,SAINT-JEAN-BREVELAY,,,56222,,,,,,,,,,,,,,,,,,,1984-12-25,F,,,,,64.11,NAP,N,-2.722001,47.845097,0.94,housenumber,4 Rue Saint Armel 56660 Saint-Jean-Brévelay,56222_0200_00004,G,4 RUE SAINT ARMEL,
315547737,00090,31554773700090,O,1999-04-06,11,2018,,2020-08-25T10:26:33,false,3,ZI,3,,IMP,RUE DE VANNES,56660,SAINT-JEAN-BREVELAY,,,56222,,,,,,,,,,,,,,,,,,,2008-01-01,A,,,,,49.39A,NAFRev2,O,-2.721489,47.844826,0.85,housenumber,3 Impasse de la Rue de Vannes 56660 Saint-Jean-Brévelay,56222_0241_00003,G,3 IMPASSE DE LA RUE DE VANNES,
315553941,00016,31555394100016,O,,,,,2019-11-14T14:00:45,true,1,,,,,PARCK CHICAN,56660,SAINT-JEAN-BREVELAY,,,56222,,,,,,,,,,,,,,,,,,,1985-12-25,F,,,,,65.06,NAP,N,-2.730241,47.814022,0.74,locality,Park Chican 56660 Saint-Jean-Brévelay,56222_b228,G,PARK CHICAN,
316022441,00018,31602244100018,O,1979-01-01,NN,,,2019-11-14T14:00:45,true,4,,7,,RUE,DE BULEON,56660,SAINT-JEAN-BREVELAY,,,56222,,,,,,,,,,,,,,,,,,,2015-05-29,F,,,,,86.21Z,NAFRev2,N,-2.722015,47.847031,0.94,housenumber,7 Rue de Buleon 56660 Saint-Jean-Brévelay,56222_0033_00007,G,7 RUE DE BULEON,
317586121,00012,31758612100012,O,,NN,,,2019-11-14T14:00:45,true,1,,,,,GUERIHUEL,56660,SAINT-JEAN-BREVELAY,,,56222,,,,,,,,,,,,,,,,,,,1990-02-26,F,,,,,01.07,NAP,N,,,0,,,,,,
317823250,00012,31782325000012,O,1980-01-01,NN,,,2019-11-14T14:00:45,true,3,,,,RUE,DE RENNES,56660,SAINT-JEAN-BREVELAY,,,56222,,,,,,,,,,,,,,,,,,,2008-01-01,A,,,,,94.99Z,NAFRev2,N,-2.721521,47.84531,0.94,street,Rue de Rennes 56660 Saint-Jean-Brévelay,56222_0180,G,RUE DE RENNES,
317992758,00027,31799275800027,O,1987-07-17,NN,,,2019-11-14T14:00:45,false,4,,,,,ZONE INDUSTRIELLE,56660,SAINT-JEAN-BREVELAY,,,56222,,,,,,,,,,,,,,,,,,,1994-12-25,F,,,,,50.2Z,NAF1993,O,-2.727695,47.847578,0.94,locality,Zone Industrielle 56660 Saint-Jean-Brévelay,56222_b322,G,ZONE INDUSTRIELLE,
318322617,00032,31832261700032,O,,NN,,,2019-11-14T14:00:45,true,1,,,,RUE,PENHER PICHON,56660,SAINT-JEAN-BREVELAY,,,56222,,,,,,,,,,,,,,,,,,,1993-04-01,F,,,,,15.8A,NAF1993,N,-2.721334,47.843961,0.94,street,Rue de Penher Pichon 56660 Saint-Jean-Brévelay,56222_0161,G,RUE DE PENHER PICHON,
320267354,00019,32026735400019,O,,NN,,,2019-11-14T14:00:45,true,1,,17,,RUE,SAINT ARMEL,56660,SAINT-JEAN-BREVELAY,,,56222,,,,,,,,,,,,,,,,,,,1991-03-31,F,,,,,67.07,NAP,N,-2.723681,47.844765,0.94,housenumber,17 Rue Saint Armel 56660 Saint-Jean-Brévelay,56222_0200_00017,G,17 RUE SAINT ARMEL,
320710569,00312,32071056900312,O,2011-01-01,NN,,,2019-11-14T14:00:45,false,2,,14,,RUE,CROIX DES VICTIMES,56660,SAINT-JEAN-BREVELAY,,,56222,,,,,,,,,,,,,,,,,,,2013-12-31,F,,,,,47.52B,NAFRev2,N,-2.724987,47.845142,0.9,housenumber,14 Rue de la Croix des Victimes 56660 Saint-Jean-Brévelay,56222_0060_00014,G,14 RUE DE LA CROIX DES VICTIMES,
320955784,00014,32095578400014,O,1981-02-15,NN,,,2019-11-14T14:00:45,true,1,,,,RUE,BELLEVUE,56660,SAINT-JEAN-BREVELAY,,,56222,,,,,,,,,,,,,,,,,,,1999-03-15,F,,,,,45.4C,NAF1993,O,-2.728659,47.844992,0.93,street,Rue de Bellevue 56660 Saint-Jean-Brévelay,56222_0010,G,RUE DE BELLEVUE,
321600009,00013,32160000900013,O,1981-04-02,NN,,,2019-11-14T14:00:45,true,5,,,,,KERIVO,56660,SAINT-JEAN-BREVELAY,,,56222,,,,,,,,,,,,,,,,,,,2008-06-30,F,,,,,43.91B,NAFRev2,O,-2.740328,47.84336,0.94,street,Kerivo 56660 Saint-Jean-Brévelay,56222_ezbrsn,G,KERIVO,
321912693,00017,32191269300017,O,,,,,2019-11-14T14:00:45,true,1,,1,,RUE,SAINT ARMEL,56660,SAINT-JEAN-BREVELAY,,,56222,,,,,,,,,,,,,,,,,,,1987-05-09,F,,,,,67.01,NAP,N,-2.722107,47.845022,0.94,housenumber,1 Rue Saint Armel 56660 Saint-Jean-Brévelay,56222_0200_00001,G,1 RUE SAINT ARMEL,
323133462,00024,32313346200024,O,1989-06-01,01,2018,9522ZB,2020-09-09T19:32:43,true,7,,4,,RUE,DU PARC,56660,SAINT-JEAN-BREVELAY,,,56222,,,,,,,,,,,,,,,,,,,2020-08-08,F,,,,DEPANNAGES BREVELAIS,95.22Z,NAFRev2,N,-2.72462,47.843653,0.94,housenumber,4 Rue du Parc 56660 Saint-Jean-Brévelay,56222_0130_00004,G,4 RUE DU PARC,
323179168,00014,32317916800014,O,1981-12-01,NN,,,2019-11-14T14:00:45,false,5,,2,,ALL,DES BRUYERES KERIVO,56660,SAINT-JEAN-BREVELAY,,,56222,,,,,,,,,,,,,,,,,,,2008-09-01,F,,,,,43.22B,NAFRev2,O,-2.735008,47.843149,0.63,housenumber,2 Allee des Bruyeres 56660 Saint-Jean-Brévelay,56222_0027_00002,G,2 ALLEE DES BRUYERES,
323558122,00012,32355812200012,O,,NN,,,2019-11-14T14:00:45,true,1,,,,,BOVRAS,56660,SAINT-JEAN-BREVELAY,,,56222,,,,,,,,,,,,,,,,,,,1989-12-31,F,,,,,01.80,NAP,N,,,0,,,,,,
324215433,00016,32421543300016,O,1982-06-03,NN,,,2019-11-14T14:00:45,false,4,,,,RTE,DE LOCMINE,56660,SAINT-JEAN-BREVELAY,,,56222,,,,,,,,,,,,,,,,,,,2003-09-01,F,,,,,52.1D,NAFRev1,O,-2.7251,47.844299,0.35,street,Rue de la Croix des Victimes 56660 Saint-Jean-Brévelay,56222_0060,G,RUE DE LA CROIX DES VICTIMES,
324436484,00046,32443648400046,O,2016-01-01,,,,2019-11-14T14:00:45,true,1,,38,,RUE,DE LA RESISTANCE,56660,SAINT-JEAN-BREVELAY,,,56222,,,,,,,,,,,,,,,,,,,2016-01-01,A,,,,,01.49Z,NAFRev2,N,-2.722113,47.838239,0.94,housenumber,38 Rue de la Résistance 56660 Saint-Jean-Brévelay,56222_0185_00038,G,38 RUE DE LA RESISTANCE,