siren,nic,siret,statutDiffusionEtablissement,dateCreationEtablissement,trancheEffectifsEtablissement,anneeEffectifsEtablissement,activitePrincipaleRegistreMetiersEtablissement,dateDernierTraitementEtablissement,etablissementSiege,nombrePeriodesEtablissement,complementAdresseEtablissement,numeroVoieEtablissement,indiceRepetitionEtablissement,typeVoieEtablissement,libelleVoieEtablissement,codePostalEtablissement,libelleCommuneEtablissement,libelleCommuneEtrangerEtablissement,distributionSpecialeEtablissement,codeCommuneEtablissement,codeCedexEtablissement,libelleCedexEtablissement,codePaysEtrangerEtablissement,libellePaysEtrangerEtablissement,complementAdresse2Etablissement,numeroVoie2Etablissement,indiceRepetition2Etablissement,typeVoie2Etablissement,libelleVoie2Etablissement,codePostal2Etablissement,libelleCommune2Etablissement,libelleCommuneEtranger2Etablissement,distributionSpeciale2Etablissement,codeCommune2Etablissement,codeCedex2Etablissement,libelleCedex2Etablissement,codePaysEtranger2Etablissement,libellePaysEtranger2Etablissement,dateDebut,etatAdministratifEtablissement,enseigne1Etablissement,enseigne2Etablissement,enseigne3Etablissement,denominationUsuelleEtablissement,activitePrincipaleEtablissement,nomenclatureActivitePrincipaleEtablissement,caractereEmployeurEtablissement,longitude,latitude,geo_score,geo_type,geo_adresse,geo_id,geo_ligne,geo_l4,geo_l5
217003359,00015,21700335900015,O,1983-03-01,01,2018,,2020-08-25T10:18:44,true,3,,,,,,70230,MAUSSANS,,,70335,,,,,,,,,,,,,,,,,,,2008-01-01,A,MAIRIE,,,,84.11Z,NAFRev2,N,,,0,,,,,,
217003359,00023,21700335900023,O,1997-01-01,NN,,,2008-01-04T18:40:32,false,3,MAIRIE,,,,,70230,MAUSSANS,,,70335,,,,,,,,,,,,,,,,,,,2008-01-01,A,SERVICE DES EAUX,,,,36.00Z,NAFRev2,N,,,0,,,,,,
267003358,00012,26700335800012,O,1983-03-01,NN,,,2010-06-26T03:14:48,true,3,,,,,MAIRIE,70230,MAUSSANS,,,70335,,,,,,,,,,,,,,,,,,,2008-01-01,A,CCAS,,,,88.99B,NAFRev2,N,3.0709671,50.6304695,0.92,poi.townhall,Hôtel de Ville Lille,https://osm.org/way/40917078,G,,
297003352,00012,29700335200012,O,,NN,,,,true,1,,,,,MAIRIE,70230,MAUSSANS,,,70335,,,,,,,,,,,,,,,,,,,1991-12-26,F,,,,,70.1C,NAF1993,N,3.0709671,50.6304695,0.92,poi.townhall,Hôtel de Ville Lille,https://osm.org/way/40917078,G,,
331683441,00017,33168344100017,O,1985-01-01,NN,,,2008-01-04T20:16:14,true,3,,,,,,70230,MAUSSANS,,,70335,,,,,,,,,,,,,,,,,,,2008-01-01,A,,,,,68.20B,NAFRev2,N,,,0,,,,,,
334254505,00012,33425450500012,O,,NN,,,,true,1,,,,,,70230,MAUSSANS,,,70335,,,,,,,,,,,,,,,,,,,,F,,,,,64.23,NAP,N,,,0,,,,,,
344662085,00010,34466208500010,O,,NN,,,,true,1,,,,,,70230,MAUSSANS,,,70335,,,,,,,,,,,,,,,,,,,1993-08-31,F,,,,,01.3Z,NAF1993,N,,,0,,,,,,
352961163,00016,35296116300016,O,,NN,,,,true,1,,,,,,70230,MAUSSANS,,,70335,,,,,,,,,,,,,,,,,,,1991-12-31,F,,,,,01.07,NAP,N,,,0,,,,,,
383261526,00016,38326152600016,O,1991-01-01,NN,,,2006-10-28T00:56:30,true,3,,,,,,70230,MAUSSANS,,,70335,,,,,,,,,,,,,,,,,,,2004-07-31,F,,,,,01.3Z,NAFRev1,N,,,0,,,,,,
392339644,00016,39233964400016,O,,NN,,,,true,1,,,,,,70230,MAUSSANS,,,70335,,,,,,,,,,,,,,,,,,,1994-12-31,F,,,,,01.3Z,NAF1993,N,,,0,,,,,,
395049398,00013,39504939800013,O,1994-04-01,00,2018,,2020-08-25T10:29:37,true,3,,,,CHE,DE LA LOUVIERE,70230,MAUSSANS,,,70335,,,,,,,,,,,,,,,,,,,2008-01-01,A,,,,,01.41Z,NAFRev2,N,6.254802,47.43013,0.78,street,Rue de la Louviere 70230 Maussans,70335_0007,G,RUE DE LA LOUVIERE,
409232337,00017,40923233700017,O,1982-12-31,NN,,,,true,1,,,,,,70230,MAUSSANS,,,70335,,,,,,,,,,,,,,,,,,,1999-12-31,F,,,,,01.1F,NAF1993,N,,,0,,,,,,
428711089,00014,42871108900014,O,2000-01-01,NN,,,2018-07-28T04:05:58,true,4,,,,,,70230,MAUSSANS,,,70335,,,,,,,,,,,,,,,,,,,2018-05-31,F,,,,,01.41Z,NAFRev2,N,,,0,,,,,,
480829373,00012,48082937300012,O,2005-02-01,,,,2009-06-24T05:25:27,true,3,,,,RUE,DE L ECOLE,70230,MAUSSANS,,,70335,,,,,,,,,,,,,,,,,,,2008-01-01,F,,,,,47.89Z,NAFRev2,N,6.253121,47.430182,0.93,street,Rue de l'Ecole 70230 Maussans,70335_0004,G,RUE DE L ECOLE,
494778384,00011,49477838400011,O,2007-03-15,,,,2008-01-05T05:18:45,true,2,,,,,,70230,MAUSSANS,,,70335,,,,,,,,,,,,,,,,,,,2008-01-01,A,,,,,47.79Z,NAFRev2,N,,,0,,,,,,
498209808,00019,49820980800019,O,2007-06-04,,,9511ZZ,2015-03-17T01:37:17,true,2,,,,RTE,DE BESNANS,70230,MAUSSANS,,,70335,,,,,,,,,,,,,,,,,,,2008-01-01,A,,,,,95.11Z,NAFRev2,N,6.251351,47.430831,0.74,street,Rue de Besnans 70230 Maussans,70335_0002,G,RUE DE BESNANS,
512760323,00018,51276032300018,O,2009-06-01,,,,2019-04-03T03:41:58,false,2,,1,,CHE,LES PELLEVIERS,70230,MAUSSANS,,,70335,,,,,,,,,,,,,,,,,,,2019-01-01,F,,,,,47.89Z,NAFRev2,N,,,0,,,,,,
803487032,00010,80348703200010,O,2014-07-01,,,,2014-07-15T08:32:06,true,1,SAINT JACQUES,1,,RUE,SAINT JACQUES,70230,MAUSSANS,,,70335,,,,,,,,,,,,,,,,,,,2014-07-01,A,,,,,33.12Z,NAFRev2,N,6.253009,47.430679,0.93,housenumber,1 Rue Saint Jacques 70230 Maussans,70335_0011_00001,G,1 RUE SAINT JACQUES,
823435128,00025,82343512800025,O,2018-02-19,03,2018,,2020-08-25T11:30:54,true,2,,4,,RUE,DES CRAIES,70230,MAUSSANS,,,70335,,,,,,,,,,,,,,,,,,,2019-07-30,A,LTS,,,,49.41B,NAFRev2,N,6.250322,47.430298,0.93,housenumber,4 Rue des Craies 70230 Maussans,70335_0003_00004,G,4 RUE DES CRAIES,
841333560,00016,84133356000016,O,2018-06-01,,,,2019-10-02T04:04:15,true,1,,2,,RUE,DE LA BERGERE,70230,MAUSSANS,,,70335,,,,,,,,,,,,,,,,,,,2018-06-01,A,,,,,01.41Z,NAFRev2,N,6.25224,47.43093,0.93,housenumber,2 Rue de la Bergere 70230 Maussans,70335_0001_00002,G,2 RUE DE LA BERGERE,
