siren,nic,siret,statutDiffusionEtablissement,dateCreationEtablissement,trancheEffectifsEtablissement,anneeEffectifsEtablissement,activitePrincipaleRegistreMetiersEtablissement,dateDernierTraitementEtablissement,etablissementSiege,nombrePeriodesEtablissement,complementAdresseEtablissement,numeroVoieEtablissement,indiceRepetitionEtablissement,typeVoieEtablissement,libelleVoieEtablissement,codePostalEtablissement,libelleCommuneEtablissement,libelleCommuneEtrangerEtablissement,distributionSpecialeEtablissement,codeCommuneEtablissement,codeCedexEtablissement,libelleCedexEtablissement,codePaysEtrangerEtablissement,libellePaysEtrangerEtablissement,complementAdresse2Etablissement,numeroVoie2Etablissement,indiceRepetition2Etablissement,typeVoie2Etablissement,libelleVoie2Etablissement,codePostal2Etablissement,libelleCommune2Etablissement,libelleCommuneEtranger2Etablissement,distributionSpeciale2Etablissement,codeCommune2Etablissement,codeCedex2Etablissement,libelleCedex2Etablissement,codePaysEtranger2Etablissement,libellePaysEtranger2Etablissement,dateDebut,etatAdministratifEtablissement,enseigne1Etablissement,enseigne2Etablissement,enseigne3Etablissement,denominationUsuelleEtablissement,activitePrincipaleEtablissement,nomenclatureActivitePrincipaleEtablissement,caractereEmployeurEtablissement,longitude,latitude,geo_score,geo_type,geo_adresse,geo_id,geo_ligne,geo_l4,geo_l5
217201417,00011,21720141700011,O,1983-03-01,11,2018,,2020-08-25T10:18:50,true,4,,,,,GRANDE RUE,72130,GESNES-LE-GANDELIN,,,72141,,,,,,,,,,,,,,,,,,,2008-01-01,A,MAIRIE,,,,84.11Z,NAFRev2,O,0.016317,48.355309,0.94,street,Grande Rue 72130 Gesnes-le-Gandelin,72141_0270,G,GRANDE RUE,
217201417,00029,21720141700029,O,1983-12-21,02,2018,,2020-08-25T10:18:50,false,3,,,,RUE,DES TISSERANDS,72130,GESNES-LE-GANDELIN,,,72141,,,,,,,,,,,,,,,,,,,2008-01-01,A,ECOLE PRIMAIRE PUBLIQUE,,,,85.20Z,NAFRev2,N,0.019906,48.355338,0.94,street,Rue des Tisserands 72130 Gesnes-le-Gandelin,72141_0605,G,RUE DES TISSERANDS,
217201417,00037,21720141700037,O,1996-01-01,NN,,,2019-11-14T14:00:56,false,4,,,,LD,LE TALUS,72130,GESNES-LE-GANDELIN,,,72141,,,,,,,,,,,,,,,,,,,2008-01-01,F,LOTISSEMENT COMMUNAL GESNES LE GANDELIN,,,,42.99Z,NAFRev2,N,0.021096,48.349283,0.41,street,Lieu Dit la Taherie 72130 Gesnes-le-Gandelin,72141_ntp5n8,G,LIEU DIT LA TAHERIE,
217201417,00045,21720141700045,O,1996-12-25,NN,,,2019-11-14T14:00:56,false,2,MAIRIE,,,,GRANDE RUE,72130,GESNES-LE-GANDELIN,,,72141,,,,,,,,,,,,,,,,,,,2008-01-01,A,ASSAINISSEMENT GESNES LE GANDELIN,,,,37.00Z,NAFRev2,N,0.016317,48.355309,0.94,street,Grande Rue 72130 Gesnes-le-Gandelin,72141_0270,G,GRANDE RUE,
217201417,00052,21720141700052,O,2001-12-25,NN,,,2019-11-14T14:00:56,false,2,MAIRIE,,,,GRANDE RUE,72130,GESNES-LE-GANDELIN,,,72141,,,,,,,,,,,,,,,,,,,2008-01-01,A,CANTINE,,,,56.29B,NAFRev2,N,0.016317,48.355309,0.94,street,Grande Rue 72130 Gesnes-le-Gandelin,72141_0270,G,GRANDE RUE,
217201417,00060,21720141700060,O,1999-01-01,NN,,,2019-11-14T14:00:56,false,4,MAIRIE,,,,GRANDE RUE,72130,GESNES-LE-GANDELIN,,,72141,,,,,,,,,,,,,,,,,,,2008-01-01,F,LOTISSEMENT LES TISSERANDS,,,,42.99Z,NAFRev2,N,0.016317,48.355309,0.94,street,Grande Rue 72130 Gesnes-le-Gandelin,72141_0270,G,GRANDE RUE,
257200915,00011,25720091500011,O,1983-03-01,NN,,,2019-11-14T14:00:56,true,5,,,,,HOTEL DE VILLE,72130,GESNES-LE-GANDELIN,,,72141,,,,,,,,,,,,,,,,,,,2014-06-01,F,,,,,36.00Z,NAFRev2,O,0.022433,48.354166,0.39,street,Allee Rene de Silly 72130 Gesnes-le-Gandelin,72141_0565,G,ALLEE RENE DE SILLY,
267202489,00014,26720248900014,O,1993-12-24,NN,,,2019-11-14T14:00:56,true,3,,,,,MAIRIE,72130,GESNES-LE-GANDELIN,,,72141,,,,,,,,,,,,,,,,,,,2008-01-01,A,CDE,,,,88.99B,NAFRev2,N,0.021096,48.349283,0.38,street,Lieu Dit la Taherie 72130 Gesnes-le-Gandelin,72141_ntp5n8,G,LIEU DIT LA TAHERIE,
267202497,00017,26720249700017,O,1993-12-24,NN,,,2019-11-14T14:00:56,true,3,,,,,MAIRIE,72130,GESNES-LE-GANDELIN,,,72141,,,,,,,,,,,,,,,,,,,2008-01-01,A,CCAS,,,,88.99B,NAFRev2,N,0.021096,48.349283,0.38,street,Lieu Dit la Taherie 72130 Gesnes-le-Gandelin,72141_ntp5n8,G,LIEU DIT LA TAHERIE,
277200275,00018,27720027500018,O,,,,,2019-11-14T14:00:56,true,1,,,,,MAIRIE,72130,GESNES-LE-GANDELIN,,,72141,,,,,,,,,,,,,,,,,,,1995-12-25,F,,,,,41.0Z,NAF1993,N,0.021096,48.349283,0.38,street,Lieu Dit la Taherie 72130 Gesnes-le-Gandelin,72141_ntp5n8,G,LIEU DIT LA TAHERIE,
297200701,00011,29720070100011,O,1983-08-10,NN,,,2019-11-14T14:00:56,true,1,,,,,HOTEL DE VILLE,72130,GESNES-LE-GANDELIN,,,72141,,,,,,,,,,,,,,,,,,,2002-08-27,F,,,,,70.1C,NAF1993,N,0.022433,48.354166,0.39,street,Allee Rene de Silly 72130 Gesnes-le-Gandelin,72141_0565,G,ALLEE RENE DE SILLY,
302602537,00029,30260253700029,O,,,,,2019-11-14T14:00:56,true,1,,,,,LE BOURG,72130,GESNES-LE-GANDELIN,,,72141,,,,,,,,,,,,,,,,,,,1985-12-25,F,,,,,62.43,NAP,N,0.047593,48.338487,0.51,street,Lieu Dit la Bouffiere 72130 Gesnes-le-Gandelin,72141_39d5gr,G,LIEU DIT LA BOUFFIERE,
311006266,00010,31100626600010,O,,,,,2019-11-14T14:00:56,true,1,,,,,LE BOURG,72130,GESNES-LE-GANDELIN,,,72141,,,,,,,,,,,,,,,,,,,1997-09-30,F,,,,,15.1A,NAF1993,N,0.047593,48.338487,0.51,street,Lieu Dit la Bouffiere 72130 Gesnes-le-Gandelin,72141_39d5gr,G,LIEU DIT LA BOUFFIERE,
311125009,00051,31112500900051,O,,,,,2019-11-14T14:00:56,true,1,,,,LD,LE MOULIN DE VAUX,72130,GESNES-LE-GANDELIN,,,72141,,,,,,,,,,,,,,,,,,,1990-12-05,F,,,,,55.10,NAP,N,0.038543,48.343458,0.88,locality,Le Grand Moulin de Vaux 72130 Gesnes-le-Gandelin,72141_b216,G,LE GRAND MOULIN DE VAUX,
311494496,00020,31149449600020,O,1980-01-01,NN,,,2019-11-14T14:00:56,true,4,,,,,LE CHENE AU SOURD,72130,GESNES-LE-GANDELIN,,,72141,,,,,,,,,,,,,,,,,,,2015-09-30,F,,,,,86.21Z,NAFRev2,N,0.027093,48.357338,0.94,street,Le Chêne au Sourd 72130 Gesnes-le-Gandelin,72141_b138,G,LE CHENE AU SOURD,
314299751,00037,31429975100037,O,,NN,,,2019-11-14T14:00:56,true,1,,,,LD,LA HUTTIERE,72130,GESNES-LE-GANDELIN,,,72141,,,,,,,,,,,,,,,,,,,,F,,,,,55.73,NAP,N,0.014815,48.356114,0.92,street,Rue de la Huttiere 72130 Gesnes-le-Gandelin,72141_0365,G,RUE DE LA HUTTIERE,
316412063,00018,31641206300018,O,,,,,2019-11-14T14:00:56,true,1,,,,,LE PATIS,72130,GESNES-LE-GANDELIN,,,72141,,,,,,,,,,,,,,,,,,,1984-12-25,F,,,,,22.02,NAP,N,0.02252,48.355342,0.94,street,Le Patis 72130 Gesnes-le-Gandelin,72141_oblipd,G,LE PATIS,
320246770,00012,32024677000012,O,1980-10-21,NN,,,2019-11-14T14:00:56,false,3,,,,,LE BOURG,72130,GESNES-LE-GANDELIN,,,72141,,,,,,,,,,,,,,,,,,,1993-09-01,F,,,,,52.1B,NAF1993,N,0.047593,48.338487,0.51,street,Lieu Dit la Bouffiere 72130 Gesnes-le-Gandelin,72141_39d5gr,G,LIEU DIT LA BOUFFIERE,
322038829,00048,32203882900048,O,2006-08-01,,,,2019-11-14T14:00:56,true,3,,24,,CHE,DE LA ROCHE,72130,GESNES-LE-GANDELIN,,,72141,,,,,,,,,,,,,,,,,,,2011-06-16,F,,,,,86.90D,NAFRev2,N,0.030957,48.357208,0.88,housenumber,24 Chemin de la Roche 72130 Gesnes-le-Gandelin,72141_0570_00024,G,24 CHEMIN DE LA ROCHE,
323368977,00019,32336897700019,O,,NN,,,2019-11-14T14:00:56,true,1,,,,,LES TROIS TILLEULS,72130,GESNES-LE-GANDELIN,,,72141,,,,,,,,,,,,,,,,,,,,F,,,,,67.01,NAP,N,0.021234,48.354847,0.57,street,Place des 3 Tilleuls 72130 Gesnes-le-Gandelin,72141_0614,G,PLACE DES 3 TILLEULS,
324166024,00012,32416602400012,O,1982-02-03,NN,,,2020-09-05T03:45:19,true,2,,,,,BOURG,72130,GESNES-LE-GANDELIN,,,72141,,,,,,,,,,,,,,,,,,,1996-12-25,F,,,,,74.8K,NAF1993,N,0.047593,48.338487,0.43,street,Lieu Dit la Bouffiere 72130 Gesnes-le-Gandelin,72141_39d5gr,G,LIEU DIT LA BOUFFIERE,
325850790,00024,32585079000024,O,,NN,,,2019-11-14T14:00:56,true,1,,,,RTE,DE LA MADELEINE,72130,GESNES-LE-GANDELIN,,,72141,,,,,,,,,,,,,,,,,,,1988-08-31,F,,,,,02.20,NAP,N,0.01543,48.356983,0.8,street,Rue de la Madeleine 72130 Gesnes-le-Gandelin,72141_0425,G,RUE DE LA MADELEINE,
326797883,00021,32679788300021,O,1992-12-31,NN,,,2019-11-14T14:00:56,true,4,,,,,LES LOGETTES,72130,GESNES-LE-GANDELIN,,,72141,,,,,,,,,,,,,,,,,,,2013-02-05,F,,,,,01.11Z,NAFRev2,N,0.049583,48.341129,0.92,street,Lieu Dit les Logettes 72130 Gesnes-le-Gandelin,72141_238eaz,G,LIEU DIT LES LOGETTES,
327465597,00026,32746559700026,O,,NN,,,2019-11-14T14:00:56,true,1,,,,,LE BOURG,72130,GESNES-LE-GANDELIN,,,72141,,,,,,,,,,,,,,,,,,,1989-08-31,F,,,,,55.71,NAP,N,0.047593,48.338487,0.51,street,Lieu Dit la Bouffiere 72130 Gesnes-le-Gandelin,72141_39d5gr,G,LIEU DIT LA BOUFFIERE,
328567540,00013,32856754000013,O,,NN,,,2019-11-14T14:00:56,true,1,,,,,GRANDE RUE,72130,GESNES-LE-GANDELIN,,,72141,,,,,,,,,,,,,,,,,,,,F,,,,,62.43,NAP,N,0.016317,48.355309,0.94,street,Grande Rue 72130 Gesnes-le-Gandelin,72141_0270,G,GRANDE RUE,
329535967,00031,32953596700031,O,2001-09-26,NN,,,2019-11-14T14:00:56,false,4,,,,,VALLAS,72130,GESNES-LE-GANDELIN,,,72141,,,,,,,,,,,,,,,,,,,2002-05-01,F,,,,,45.2J,NAF1993,N,0.051967,48.346854,0.92,street,Le Bas Vallas 72130 Gesnes-le-Gandelin,72141_b010,G,LE BAS VALLAS,
329648315,00011,32964831500011,O,,,,,2019-11-14T14:00:56,true,1,,,,RTE,DES MASSICAUDIERES,72130,GESNES-LE-GANDELIN,,,72141,,,,,,,,,,,,,,,,,,,1988-09-30,F,,,,,21.11,NAP,N,0.012383,48.364758,0.69,street,Lieu Dit les Massicaudieres 72130 Gesnes-le-Gandelin,72141_7zffq8,G,LIEU DIT LES MASSICAUDIERES,
331611954,00024,33161195400024,O,,NN,,,2019-11-14T14:00:56,true,1,,,,,LE PATIS,72130,GESNES-LE-GANDELIN,,,72141,,,,,,,,,,,,,,,,,,,1988-03-01,F,,,,,80.04,NAP,N,0.02252,48.355342,0.94,street,Le Patis 72130 Gesnes-le-Gandelin,72141_oblipd,G,LE PATIS,
337978274,00013,33797827400013,O,1986-05-30,NN,,,2019-11-14T14:00:56,true,3,,,,LD,LA BOUFFETIERE,72130,GESNES-LE-GANDELIN,,,72141,,,,,,,,,,,,,,,,,,,2008-01-01,A,,,,,01.50Z,NAFRev2,N,0.047593,48.338487,0.68,street,Lieu Dit la Bouffiere 72130 Gesnes-le-Gandelin,72141_39d5gr,G,LIEU DIT LA BOUFFIERE,
340391549,00011,34039154900011,O,,NN,,,2019-11-14T14:00:56,true,1,,,,,LE PATIS,72130,GESNES-LE-GANDELIN,,,72141,,,,,,,,,,,,,,,,,,,1989-06-30,F,,,,,55.71,NAP,N,0.02252,48.355342,0.94,street,Le Patis 72130 Gesnes-le-Gandelin,72141_oblipd,G,LE PATIS,
340391572,00021,34039157200021,O,,NN,,,2019-11-14T14:00:56,true,1,,,,,LE PARC DE L'ANE,72130,GESNES-LE-GANDELIN,,,72141,,,,,,,,,,,,,,,,,,,1995-12-31,F,,,,,45.4C,NAF1993,O,0.023335,48.364745,0.46,street,Lieu Dit le Parc Erbron 72130 Gesnes-le-Gandelin,72141_b312,G,LIEU DIT LE PARC ERBRON,
340957778,00012,34095777800012,O,1986-12-31,NN,,,2019-11-14T14:00:56,true,3,,,,RTE,D ASSE,72130,GESNES-LE-GANDELIN,,,72141,,,,,,,,,,,,,,,,,,,2005-03-31,F,,,,,45.4J,NAFRev1,N,0.015123,48.355249,0.77,street,Route d'Assé 72130 Gesnes-le-Gandelin,72141_0030,G,ROUTE D ASSE,
340957836,00018,34095783600018,O,1986-12-31,NN,,,2019-11-14T14:00:56,true,3,,,,RTE,D ASSE,72130,GESNES-LE-GANDELIN,,,72141,,,,,,,,,,,,,,,,,,,2005-03-31,F,,,,,45.4J,NAFRev1,N,0.015123,48.355249,0.77,street,Route d'Assé 72130 Gesnes-le-Gandelin,72141_0030,G,ROUTE D ASSE,
350231239,00012,35023123900012,O,1985-01-01,NN,,,2019-11-14T14:00:56,true,3,,,,,GRANDCHAMP,72130,GESNES-LE-GANDELIN,,,72141,,,,,,,,,,,,,,,,,,,2008-01-01,A,,,,,01.50Z,NAFRev2,N,0.031699,48.342712,0.77,street,Grand Champ 72130 Gesnes-le-Gandelin,72141_b211,G,GRAND CHAMP,
350371183,00020,35037118300020,O,2004-10-15,NN,,,2019-11-14T14:00:56,true,3,,,,,LES MARCHAIS,72130,GESNES-LE-GANDELIN,,,72141,,,,,,,,,,,,,,,,,,,2008-01-01,A,,,,,90.01Z,NAFRev2,N,0.040304,48.354105,0.92,street,Lieu Dit les Marchais 72130 Gesnes-le-Gandelin,72141_v2mvs1,G,LIEU DIT LES MARCHAIS,
351012539,00018,35101253900018,O,1989-03-02,NN,,,2019-11-14T14:00:56,true,3,LA GRANDE COUR,,,RUE,LIBERTE,72130,GESNES-LE-GANDELIN,,,72141,,,,,,,,,,,,,,,,,,,2008-01-01,A,,,,,88.99B,NAFRev2,N,0.017849,48.355298,0.93,street,Rue de Liberte 72130 Gesnes-le-Gandelin,72141_0390,G,RUE DE LIBERTE,
351961834,00014,35196183400014,O,1989-09-04,NN,,,2019-11-14T14:00:56,true,3,,,,RUE,DE LA LIBERTE,72130,GESNES-LE-GANDELIN,,,72141,,,,,,,,,,,,,,,,,,,2008-01-01,A,,,,,68.20B,NAFRev2,N,0.017849,48.355298,0.8,street,Rue de Liberte 72130 Gesnes-le-Gandelin,72141_0390,G,RUE DE LIBERTE,
356000521,05877,35600052105877,O,1991-01-01,NN,,,2019-11-14T14:00:56,false,3,,,,,GRANDE RUE,72130,GESNES-LE-GANDELIN,,,72141,,,,,,,,,,,,,,,,,,,2006-06-01,F,BUREAU DE POSTE,,,,64.1A,NAFRev1,O,0.016317,48.355309,0.94,street,Grande Rue 72130 Gesnes-le-Gandelin,72141_0270,G,GRANDE RUE,
377847801,00018,37784780100018,O,1990-04-18,,,,2019-11-14T14:00:56,true,5,,,,,LA HUTTIERE,72130,GESNES-LE-GANDELIN,,,72141,,,,,,,,,,,,,,,,,,,2009-12-31,F,,,,,18.12Z,NAFRev2,N,0.014815,48.356114,0.92,street,Rue de la Huttiere 72130 Gesnes-le-Gandelin,72141_0365,G,RUE DE LA HUTTIERE,
380433383,00011,38043338300011,O,1991-01-01,NN,,,2019-11-14T14:00:56,true,4,,,,LD,LES TROIS TILLEULS,72130,GESNES-LE-GANDELIN,,,72141,,,,,,,,,,,,,,,,,,,2003-06-15,F,,,,,55.1A,NAFRev1,N,0.021234,48.354847,0.57,street,Place des 3 Tilleuls 72130 Gesnes-le-Gandelin,72141_0614,G,PLACE DES 3 TILLEULS,
381093020,00026,38109302000026,O,1999-04-01,NN,,,2019-11-14T14:00:56,true,3,,12,,RUE,DE LA HUTTIERE,72130,GESNES-LE-GANDELIN,,,72141,,,,,,,,,,,,,,,,,,,2005-12-15,F,,,,,45.2V,NAFRev1,O,0.011999,48.355983,0.94,housenumber,12 Rue de la Huttiere 72130 Gesnes-le-Gandelin,72141_0365_00012,G,12 RUE DE LA HUTTIERE,
381945054,00017,38194505400017,O,1991-04-09,NN,,,2019-11-14T14:00:56,true,4,,,,,GRANDE RUE,72130,GESNES-LE-GANDELIN,,,72141,,,,,,,,,,,,,,,,,,,2003-02-09,F,,,,,15.1F,NAFRev1,N,0.016317,48.355309,0.94,street,Grande Rue 72130 Gesnes-le-Gandelin,72141_0270,G,GRANDE RUE,
387833361,00018,38783336100018,O,,,,,2019-11-14T14:00:56,true,1,,,,,LE BOURG,72130,GESNES-LE-GANDELIN,,,72141,,,,,,,,,,,,,,,,,,,1995-12-25,F,,,,,70.2A,NAF1993,N,0.047593,48.338487,0.51,street,Lieu Dit la Bouffiere 72130 Gesnes-le-Gandelin,72141_39d5gr,G,LIEU DIT LA BOUFFIERE,
391732294,00015,39173229400015,O,,NN,,,2019-11-14T14:00:56,true,1,,,,,LA TAHERIE,72130,GESNES-LE-GANDELIN,,,72141,,,,,,,,,,,,,,,,,,,1993-07-30,F,,,,,70.3A,NAF1993,N,0.021096,48.349283,0.92,street,Lieu Dit la Taherie 72130 Gesnes-le-Gandelin,72141_ntp5n8,G,LIEU DIT LA TAHERIE,
391863875,00012,39186387500012,O,,,,,2019-11-14T14:00:56,true,1,,,,,LES EPAULARDS,72130,GESNES-LE-GANDELIN,,,72141,,,,,,,,,,,,,,,,,,,1997-12-31,F,,,,,52.6E,NAF1993,N,0.019939,48.356425,0.35,street,Rue des Saules 72130 Gesnes-le-Gandelin,72141_0587,G,RUE DES SAULES,
392520110,00017,39252011000017,O,,NN,,,2019-11-14T14:00:56,true,1,,,,,LE BOURG,72130,GESNES-LE-GANDELIN,,,72141,,,,,,,,,,,,,,,,,,,1995-05-03,F,,,,,52.1B,NAF1993,N,0.047593,48.338487,0.51,street,Lieu Dit la Bouffiere 72130 Gesnes-le-Gandelin,72141_39d5gr,G,LIEU DIT LA BOUFFIERE,
392684072,00029,39268407200029,O,1994-03-18,NN,,,2019-11-14T14:00:56,true,3,,,,,LE TALUS,72130,GESNES-LE-GANDELIN,,,72141,,,,,,,,,,,,,,,,,,,2006-03-31,F,,,,,45.3F,NAFRev1,N,0.021096,48.349283,0.41,street,Lieu Dit la Taherie 72130 Gesnes-le-Gandelin,72141_ntp5n8,G,LIEU DIT LA TAHERIE,
394453799,00014,39445379900014,O,1993-01-01,NN,,,2019-11-14T14:00:56,true,1,,,,,LA PLANCHE,72130,GESNES-LE-GANDELIN,,,72141,,,,,,,,,,,,,,,,,,,1999-10-31,F,,,,,01.1A,NAF1993,N,0.03809,48.35056,0.92,street,Lieu Dit la Planche 72130 Gesnes-le-Gandelin,72141_jmu5o4,G,LIEU DIT LA PLANCHE,
394520076,00016,39452007600016,O,1993-01-01,,,,2019-11-14T14:00:56,false,3,,,,,LE BOURG,72130,GESNES-LE-GANDELIN,,,72141,,,,,,,,,,,,,,,,,,,1997-07-24,F,,,,,01.2A,NAF1993,N,0.047593,48.338487,0.51,street,Lieu Dit la Bouffiere 72130 Gesnes-le-Gandelin,72141_39d5gr,G,LIEU DIT LA BOUFFIERE,
394726111,00013,39472611100013,O,1993-01-01,NN,,,2019-11-14T14:00:56,true,3,,,,,LA PLANCHE,72130,GESNES-LE-GANDELIN,,,72141,,,,,,,,,,,,,,,,,,,2008-01-01,A,,,,,01.50Z,NAFRev2,N,0.03809,48.35056,0.92,street,Lieu Dit la Planche 72130 Gesnes-le-Gandelin,72141_jmu5o4,G,LIEU DIT LA PLANCHE,
397677246,00035,39767724600035,O,2006-04-01,,,4322AZ,2019-11-14T14:00:56,true,2,,,,,LE GRAND CHAMP,72130,GESNES-LE-GANDELIN,,,72141,,,,,,,,,,,,,,,,,,,2008-01-01,A,,,,,43.22A,NAFRev2,N,0.031699,48.342712,0.9,street,Grand Champ 72130 Gesnes-le-Gandelin,72141_b211,G,GRAND CHAMP,
398106336,00017,39810633600017,O,1956-04-24,NN,,,2020-09-11T03:47:23,true,3,,,,,LES GAUTELLERIES,72130,GESNES-LE-GANDELIN,,,72141,,,,,,,,,,,,,,,,,,,2008-01-01,A,,,,,68.20B,NAFRev2,N,0.032011,48.370592,0.92,street,Lieu Dit les Gautelleries 72130 Gesnes-le-Gandelin,72141_4s2q6e,G,LIEU DIT LES GAUTELLERIES,
399527969,00022,39952796900022,O,1999-05-01,NN,,,2019-11-14T14:00:56,false,4,,,,,LE MORTIER,72130,GESNES-LE-GANDELIN,,,72141,,,,,,,,,,,,,,,,,,,2009-12-31,A,,,,,02.10Z,NAFRev2,N,0.025308,48.364309,0.92,street,Lieu Dit le Mortier 72130 Gesnes-le-Gandelin,72141_t6mblg,G,LIEU DIT LE MORTIER,
400267480,00012,40026748000012,O,1995-03-13,NN,,,2019-11-14T14:00:56,true,3,,,,,LES TROIS TILLEULS,72130,GESNES-LE-GANDELIN,,,72141,,,,,,,,,,,,,,,,,,,1999-12-25,F,,,,,74.8G,NAF1993,N,0.021234,48.354847,0.57,street,Place des 3 Tilleuls 72130 Gesnes-le-Gandelin,72141_0614,G,PLACE DES 3 TILLEULS,
400696126,00012,40069612600012,O,1995-04-01,NN,,,2019-11-14T14:00:56,true,4,,,,,LES BRUYERES,72130,GESNES-LE-GANDELIN,,,72141,,,,,,,,,,,,,,,,,,,1997-12-31,F,,,,,45.1A,NAF1993,O,0.022634,48.35964,0.92,street,Lieu Dit les Bruyeres 72130 Gesnes-le-Gandelin,72141_f0gd06,G,LIEU DIT LES BRUYERES,
401637657,00016,40163765700016,O,1995-06-10,NN,,,2019-11-14T14:00:56,true,1,,,,,GRANDE RUE,72130,GESNES-LE-GANDELIN,,,72141,,,,,,,,,,,,,,,,,,,2001-12-01,F,,,,,52.1B,NAF1993,N,0.016317,48.355309,0.94,street,Grande Rue 72130 Gesnes-le-Gandelin,72141_0270,G,GRANDE RUE,
403901242,00012,40390124200012,O,1996-01-01,NN,,,2019-11-14T14:00:56,true,1,,,,,LE PARC DE L'ANE,72130,GESNES-LE-GANDELIN,,,72141,,,,,,,,,,,,,,,,,,,1999-02-17,F,,,,,45.4C,NAF1993,O,0.023335,48.364745,0.46,street,Lieu Dit le Parc Erbron 72130 Gesnes-le-Gandelin,72141_b312,G,LIEU DIT LE PARC ERBRON,
404047532,00019,40404753200019,O,1978-03-11,NN,,,2019-11-14T14:00:56,true,3,,,,,VAUX,72130,GESNES-LE-GANDELIN,,,72141,,,,,,,,,,,,,,,,,,,2008-01-01,A,,,,,68.20B,NAFRev2,N,0.035844,48.344162,0.9,locality,Le Chateau de Vaux 72130 Gesnes-le-Gandelin,72141_b134,G,LE CHATEAU DE VAUX,
404534356,00013,40453435600013,O,1996-03-01,NN,,,2019-11-14T14:00:56,true,4,,,,,GRANDCHAMP,72130,GESNES-LE-GANDELIN,,,72141,,,,,,,,,,,,,,,,,,,2014-02-28,F,,,,,01.11Z,NAFRev2,N,0.031699,48.342712,0.77,street,Grand Champ 72130 Gesnes-le-Gandelin,72141_b211,G,GRAND CHAMP,
408048478,00049,40804847800049,O,2016-01-01,,,4322AZ,2019-11-14T14:00:56,true,1,,35,,,LA PLANCHE,72130,GESNES-LE-GANDELIN,,,72141,,,,,,,,,,,,,,,,,,,2016-01-01,A,,,,,43.22A,NAFRev2,N,0.03809,48.35056,0.92,housenumber,35 Lieu Dit la Planche 72130 Gesnes-le-Gandelin,72141_jmu5o4_00035,G,35 LIEU DIT LA PLANCHE,
413103516,00014,41310351600014,O,1997-07-07,03,2018,4391AZ,2020-08-25T10:40:54,true,5,,,,,LE BAS VALLAS,72130,GESNES-LE-GANDELIN,,,72141,,,,,,,,,,,,,,,,,,,2015-01-13,A,,,,,43.91A,NAFRev2,N,0.051967,48.346854,0.94,street,Le Bas Vallas 72130 Gesnes-le-Gandelin,72141_b010,G,LE BAS VALLAS,
413338989,00010,41333898900010,O,1984-12-31,NN,,,2019-11-14T14:00:56,true,4,,,,,LA ROCHE,72130,GESNES-LE-GANDELIN,,,72141,,,,,,,,,,,,,,,,,,,2009-12-25,F,,,,,01.11Z,NAFRev2,N,0.039043,48.355476,0.91,street,Lieu Dit la Roche 72130 Gesnes-le-Gandelin,72141_2kumkr,G,LIEU DIT LA ROCHE,
413338997,00013,41333899700013,O,1984-12-31,NN,,,2019-11-14T14:00:56,true,3,,,,,LE HAUT DU BOURG,72130,GESNES-LE-GANDELIN,,,72141,,,,,,,,,,,,,,,,,,,2008-01-01,A,,,,,01.42Z,NAFRev2,N,0.04924,48.346706,0.45,street,Le Haut Vallas 72130 Gesnes-le-Gandelin,72141_d5alp9,G,LE HAUT VALLAS,
413339003,00019,41333900300019,O,1989-12-31,NN,,,2019-11-14T14:00:56,true,3,,,,,LA ROCHE,72130,GESNES-LE-GANDELIN,,,72141,,,,,,,,,,,,,,,,,,,2008-01-01,A,,,,,01.50Z,NAFRev2,N,0.039043,48.355476,0.91,street,Lieu Dit la Roche 72130 Gesnes-le-Gandelin,72141_2kumkr,G,LIEU DIT LA ROCHE,
413339011,00012,41333901100012,O,1985-12-31,NN,,,2019-11-14T14:00:56,true,4,,,,,LES RABLAIS,72130,GESNES-LE-GANDELIN,,,72141,,,,,,,,,,,,,,,,,,,2012-12-11,F,,,,,01.42Z,NAFRev2,N,0.046556,48.336188,0.48,street,Les Rotis 72130 Gesnes-le-Gandelin,72141_4d533a,G,LES ROTIS,
413339029,00014,41333902900014,O,1983-12-31,NN,,,2019-11-14T14:00:56,true,4,,,,,LES MARCHAIS,72130,GESNES-LE-GANDELIN,,,72141,,,,,,,,,,,,,,,,,,,2008-01-01,A,,,,,01.11Z,NAFRev2,N,0.040304,48.354105,0.92,street,Lieu Dit les Marchais 72130 Gesnes-le-Gandelin,72141_v2mvs1,G,LIEU DIT LES MARCHAIS,
413500828,00012,41350082800012,O,1997-08-26,NN,,,2019-11-14T14:00:56,false,5,,,,,GRANDE RUE,72130,GESNES-LE-GANDELIN,,,72141,,,,,,,,,,,,,,,,,,,2013-01-31,F,,,,,96.02A,NAFRev2,O,0.016317,48.355309,0.94,street,Grande Rue 72130 Gesnes-le-Gandelin,72141_0270,G,GRANDE RUE,
413547746,00011,41354774600011,O,1997-08-20,NN,,4399CZ,2020-09-11T10:54:19,true,6,,47,,,LE BAS VALLAS,72130,GESNES-LE-GANDELIN,,,72141,,,,,,,,,,,,,,,,,,,2020-09-01,A,AMS,,,AMS,43.99C,NAFRev2,N,0.051967,48.346854,0.94,street,Le Bas Vallas 72130 Gesnes-le-Gandelin,72141_b010,G,LE BAS VALLAS,
413610700,00010,41361070000010,O,1997-08-21,,,,2019-11-14T14:00:56,true,1,,,,,LE BAS VALLAS,72130,GESNES-LE-GANDELIN,,,72141,,,,,,,,,,,,,,,,,,,1998-11-30,F,,,,,74.1J,NAF1993,N,0.051967,48.346854,0.94,street,Le Bas Vallas 72130 Gesnes-le-Gandelin,72141_b010,G,LE BAS VALLAS,
413943655,00014,41394365500014,O,1997-10-01,NN,,,2019-11-14T14:00:56,true,7,,,,,LA ROUABIERE,72130,GESNES-LE-GANDELIN,,,72141,,,,,,,,,,,,,,,,,,,2015-12-07,F,,,,,43.12A,NAFRev2,O,0.038392,48.352058,0.92,street,Lieu Dit la Rouabiere 72130 Gesnes-le-Gandelin,72141_gs69jc,G,LIEU DIT LA ROUABIERE,
413981754,00018,41398175400018,O,1997-10-03,01,2018,4332BB,2020-08-25T10:41:35,true,5,,4,,,LE CHENE AU SOURD,72130,GESNES-LE-GANDELIN,,,72141,,,,,,,,,,,,,,,,,,,2018-12-31,A,,,,,43.32B,NAFRev2,N,0.027093,48.357338,0.94,street,Le Chêne au Sourd 72130 Gesnes-le-Gandelin,72141_b138,G,LE CHENE AU SOURD,
414928366,00015,41492836600015,O,1991-12-31,NN,,,2019-11-14T14:00:56,true,3,,,,,LA BOUFFETIERE,72130,GESNES-LE-GANDELIN,,,72141,,,,,,,,,,,,,,,,,,,2008-01-01,A,,,,,01.47Z,NAFRev2,N,0.047593,48.338487,0.68,street,Lieu Dit la Bouffiere 72130 Gesnes-le-Gandelin,72141_39d5gr,G,LIEU DIT LA BOUFFIERE,
418244224,00014,41824422400014,O,1998-04-06,,,,2019-11-14T14:00:56,false,3,,6,,RUE,DU MERIDIEN,72130,GESNES-LE-GANDELIN,,,72141,,,,,,,,,,,,,,,,,,,1999-05-31,F,,,,,93.0D,NAF1993,N,0.022377,48.353132,0.94,housenumber,6 Rue du Méridien 72130 Gesnes-le-Gandelin,72141_0450_00006,G,6 RUE DU MERIDIEN,
419531249,00029,41953124900029,O,2011-12-15,,,,2019-11-14T14:00:56,true,3,,4,,PL,DES 3 TILLEULS,72130,GESNES-LE-GANDELIN,,,72141,,,,,,,,,,,,,,,,,,,2013-08-07,F,LES 3 TILLEULS,,,LES 3 TILLEULS,56.10A,NAFRev2,N,0.021268,48.354999,0.85,housenumber,4 Place des 3 Tilleuls 72130 Gesnes-le-Gandelin,72141_0614_00004,G,4 PLACE DES 3 TILLEULS,
421415316,00023,42141531600023,O,1999-10-30,,,,2019-11-14T14:00:56,false,8,,,,LD,LE MORTIER,72130,GESNES-LE-GANDELIN,,,72141,,,,,,,,,,,,,,,,,,,2015-06-01,F,,,,,82.99Z,NAFRev2,O,0.025308,48.364309,0.92,street,Lieu Dit le Mortier 72130 Gesnes-le-Gandelin,72141_t6mblg,G,LIEU DIT LE MORTIER,
422656694,00011,42265669400011,O,1999-03-25,NN,,,2019-11-14T14:00:56,false,4,,2,,IMP,DU MERIDIEN,72130,GESNES-LE-GANDELIN,,,72141,,,,,,,,,,,,,,,,,,,2001-04-01,F,,,,,72.2Z,NAF1993,O,0.022672,48.352822,0.83,housenumber,2 Impasse du Meridien 72130 Gesnes-le-Gandelin,72141_0449_00002,G,2 IMPASSE DU MERIDIEN,
422656694,00029,42265669400029,O,2001-04-01,NN,,,2019-11-14T14:00:56,false,4,,45,,,GRANDE RUE,72130,GESNES-LE-GANDELIN,,,72141,,,,,,,,,,,,,,,,,,,2005-01-01,F,,,,,72.2C,NAFRev1,O,0.020219,48.355166,0.94,housenumber,45 Grande Rue 72130 Gesnes-le-Gandelin,72141_0270_00045,G,45 GRANDE RUE,
422656694,00045,42265669400045,O,2005-01-01,03,2018,,2020-08-25T10:13:32,true,2,,4,,RUE,DES EGLANTIERS,72130,GESNES-LE-GANDELIN,,,72141,,,,,,,,,,,,,,,,,,,2008-01-01,A,,,,,62.01Z,NAFRev2,O,0.021425,48.356333,0.94,housenumber,4 Rue des Eglantiers 72130 Gesnes-le-Gandelin,72141_0152_00004,G,4 RUE DES EGLANTIERS,
422774034,00017,42277403400017,O,1997-11-01,NN,,,2019-11-14T14:00:56,true,4,,,,,LE PARC DE L AIR BRON,72130,GESNES-LE-GANDELIN,,,72141,,,,,,,,,,,,,,,,,,,2015-03-31,F,,,,,01.42Z,NAFRev2,N,,,0,,,,,,