siren,nic,siret,statutDiffusionEtablissement,dateCreationEtablissement,trancheEffectifsEtablissement,anneeEffectifsEtablissement,activitePrincipaleRegistreMetiersEtablissement,dateDernierTraitementEtablissement,etablissementSiege,nombrePeriodesEtablissement,complementAdresseEtablissement,numeroVoieEtablissement,indiceRepetitionEtablissement,typeVoieEtablissement,libelleVoieEtablissement,codePostalEtablissement,libelleCommuneEtablissement,libelleCommuneEtrangerEtablissement,distributionSpecialeEtablissement,codeCommuneEtablissement,codeCedexEtablissement,libelleCedexEtablissement,codePaysEtrangerEtablissement,libellePaysEtrangerEtablissement,complementAdresse2Etablissement,numeroVoie2Etablissement,indiceRepetition2Etablissement,typeVoie2Etablissement,libelleVoie2Etablissement,codePostal2Etablissement,libelleCommune2Etablissement,libelleCommuneEtranger2Etablissement,distributionSpeciale2Etablissement,codeCommune2Etablissement,codeCedex2Etablissement,libelleCedex2Etablissement,codePaysEtranger2Etablissement,libellePaysEtranger2Etablissement,dateDebut,etatAdministratifEtablissement,enseigne1Etablissement,enseigne2Etablissement,enseigne3Etablissement,denominationUsuelleEtablissement,activitePrincipaleEtablissement,nomenclatureActivitePrincipaleEtablissement,caractereEmployeurEtablissement,longitude,latitude,geo_score,geo_type,geo_adresse,geo_id,geo_ligne,geo_l4,geo_l5
219102449,00010,21910244900010,O,1983-03-01,12,2018,,2020-08-25T10:19:39,true,4,,,,RUE,DE LA MAIRIE,91540,FONTENAY-LE-VICOMTE,,,91244,,,,,,,,,,,,,,,,,,,2008-01-01,A,MAIRIE,,,,84.11Z,NAFRev2,O,2.39911,48.547456,0.94,street,Rue de la Mairie 91540 Fontenay-le-Vicomte,91244_0070,G,RUE DE LA MAIRIE,
219102449,00028,21910244900028,O,1983-12-21,03,2018,,2020-08-25T10:19:39,false,3,,4,,RUE,DE LA MAIRIE,91540,FONTENAY-LE-VICOMTE,,,91244,,,,,,,,,,,,,,,,,,,2008-01-01,A,ECOLE PRIMAIRE PUBLIQUE,,,,85.20Z,NAFRev2,N,2.398863,48.547728,0.94,housenumber,4 Rue de la Mairie 91540 Fontenay-le-Vicomte,91244_0070_00004,G,4 RUE DE LA MAIRIE,
219102449,00036,21910244900036,O,1995-01-01,NN,,,2019-11-14T14:01:05,false,3,MAIRIE,,,RUE,DE LA MAIRIE,91540,FONTENAY-LE-VICOMTE,,,91244,,,,,,,,,,,,,,,,,,,2008-01-01,A,SERVICE D'ASSAINISSEMENT,,,,37.00Z,NAFRev2,N,2.39911,48.547456,0.94,street,Rue de la Mairie 91540 Fontenay-le-Vicomte,91244_0070,G,RUE DE LA MAIRIE,
269100558,00015,26910055800015,O,,,,,2019-11-14T14:01:05,true,1,,,,RUE,DE LA MAIRIE,91540,FONTENAY-LE-VICOMTE,,,91244,,,,,,,,,,,,,,,,,,,,F,,,,,95.11,NAP,N,2.39911,48.547456,0.94,street,Rue de la Mairie 91540 Fontenay-le-Vicomte,91244_0070,G,RUE DE LA MAIRIE,
269101549,00013,26910154900013,O,1983-03-01,NN,,,2019-11-14T14:01:05,true,3,,,,RUE,DE LA MAIRIE,91540,FONTENAY-LE-VICOMTE,,,91244,,,,,,,,,,,,,,,,,,,2008-01-01,A,CDE,,,,88.99B,NAFRev2,N,2.39911,48.547456,0.94,street,Rue de la Mairie 91540 Fontenay-le-Vicomte,91244_0070,G,RUE DE LA MAIRIE,
300114162,00039,30011416200039,O,,NN,,,2019-11-14T14:01:05,true,1,,3,,IMP,4 VENTS,91540,FONTENAY-LE-VICOMTE,,,91244,,,,,,,,,,,,,,,,,,,,F,,,,,87.06,NAP,N,2.397756,48.546962,0.8,housenumber,3 Impasse des 4 Vents 91540 Fontenay-le-Vicomte,91244_0080_00003,G,3 IMPASSE DES 4 VENTS,
301851838,00013,30185183800013,O,1975-01-01,NN,,,2019-11-14T14:01:05,true,5,,35,,,GRANDE RUE,91540,FONTENAY-LE-VICOMTE,,,91244,,,,,,,,,,,,,,,,,,,2010-09-15,F,,,,,45.20A,NAFRev2,O,2.401164,48.547805,0.94,housenumber,35 Grande Rue 91540 Fontenay-le-Vicomte,91244_0084_00035,G,35 GRANDE RUE,
302472675,00057,30247267500057,O,1990-03-20,NN,,,2019-11-14T14:01:05,true,4,ZONE D'ACTIVITES,1,,RUE,DE L'ORME,91540,FONTENAY-LE-VICOMTE,,,91244,,,,,,,,,,,,,,,,,,,2008-01-01,A,,,,,64.20Z,NAFRev2,N,2.405487,48.548421,0.94,housenumber,1 Rue de l'Orme 91540 Fontenay-le-Vicomte,91244_0076_00001,G,1 RUE DE L ORME,
303302210,00032,30330221000032,O,1984-07-01,NN,,,2019-11-14T14:01:05,false,4,ZONE ARTISANALE,16,,CHE,ORME,91540,FONTENAY-LE-VICOMTE,,,91244,,,,,,,,,,,,,,,,,,,1998-08-05,F,PLAISIR ET GOURMANDISES,,,,70.3A,NAF1993,O,2.405948,48.546918,0.55,housenumber,16 Rue de l'Orme 91540 Fontenay-le-Vicomte,91244_0076_00016,G,16 RUE DE L ORME,
303302210,00040,30330221000040,O,1996-05-01,NN,,,2019-11-14T14:01:05,false,5,,,,,ZONE ARTISANALE,91540,FONTENAY-LE-VICOMTE,,,91244,,,,,,,,,,,,,,,,,,,2010-07-01,F,,,,,46.36Z,NAFRev2,O,2.7640352,42.6301915,0.9,poi.retail,Zone Artisanale (Zone commerciale) Thuir,https://osm.org/way/191039530,G,,
305609059,00012,30560905900012,O,1976-01-01,NN,,,2019-11-14T14:01:05,false,4,,,,CHE,DE L'ORMELAIS,91540,FONTENAY-LE-VICOMTE,,,91244,,,,,,,,,,,,,,,,,,,2003-09-30,F,,,,,63.1E,NAFRev1,O,2.40626,48.549076,0.58,street,Chemin de l'Orme 91540 Fontenay-le-Vicomte,91244_0075,G,CHEMIN DE L ORME,
306895681,00014,30689568100014,O,1900-01-01,NN,,,2019-11-14T14:01:05,true,3,,,,,ZONE ARTISANALE,91540,FONTENAY-LE-VICOMTE,,,91244,,,,,,,,,,,,,,,,,,,2008-01-01,A,,,,,68.20B,NAFRev2,N,2.7640352,42.6301915,0.9,poi.retail,Zone Artisanale (Zone commerciale) Thuir,https://osm.org/way/191039530,G,,
306904707,00016,30690470700016,O,1900-01-01,,,,2019-11-14T14:01:05,false,4,,,,,ZI FONTENAY LE VICOMTE,91540,FONTENAY-LE-VICOMTE,,,91244,,,,,,,,,,,,,,,,,,,2000-06-15,F,,,,,52.1A,NAF1993,N,2.408446,48.550973,0.84,street,Avenue de Saint Remi 91540 Fontenay-le-Vicomte,91244_0089,G,AVENUE DE SAINT REMI,
308287895,00012,30828789500012,O,,NN,,,2019-11-14T14:01:05,true,1,,,,,MAIRIE,91540,FONTENAY-LE-VICOMTE,,,91244,,,,,,,,,,,,,,,,,,,1988-09-16,F,,,,,96.15,NAP,N,2.39911,48.547456,0.91,street,Rue de la Mairie 91540 Fontenay-le-Vicomte,91244_0070,G,RUE DE LA MAIRIE,
311819841,00017,31181984100017,O,,NN,,,2019-11-14T14:01:05,true,1,,,,CHE,DU MARAIS,91540,FONTENAY-LE-VICOMTE,,,91244,,,,,,,,,,,,,,,,,,,1987-12-25,F,,,,,65.01,NAP,N,2.395743,48.547685,0.61,street,Chemin des Marais 91540 Fontenay-le-Vicomte,91244_0069,G,CHEMIN DES MARAIS,
312309743,00010,31230974300010,O,,NN,,,2019-11-14T14:01:05,true,1,,,,RUE,DU REIGNAULT,91540,FONTENAY-LE-VICOMTE,,,91244,,,,,,,,,,,,,,,,,,,1989-12-31,F,,,,,77.03,NAP,N,2.412238,48.554471,0.94,street,Rue du Reignault 91540 Fontenay-le-Vicomte,91244_0087,G,RUE DU REIGNAULT,
312816986,00029,31281698600029,O,2002-01-17,NN,,,2019-11-14T14:01:05,true,4,,32,,,GRANDE RUE,91540,FONTENAY-LE-VICOMTE,,,91244,,,,,,,,,,,,,,,,,,,2003-12-30,F,,,,,52.6E,NAFRev1,O,2.401074,48.547701,0.94,housenumber,32 Grande Rue 91540 Fontenay-le-Vicomte,91244_0084_00032,G,32 GRANDE RUE,
312910102,00028,31291010200028,O,1971-10-12,NN,,,2019-11-14T14:01:05,true,5,ZA DE LA NOZOLLE,,,RUE,DE L'ORME,91540,FONTENAY-LE-VICOMTE,,,91244,,,,,,,,,,,,,,,,,,,2015-12-31,A,,,,,68.20B,NAFRev2,N,2.405487,48.548421,0.94,street,Rue de l'Orme 91540 Fontenay-le-Vicomte,91244_0076,G,RUE DE L ORME,
313040685,00015,31304068500015,O,,NN,,,2019-11-14T14:01:05,true,1,,,,CHE,DE L ORMELAIS,91540,FONTENAY-LE-VICOMTE,,,91244,,,,,,,,,,,,,,,,,,,1991-01-08,F,,,,,65.02,NAP,N,2.40626,48.549076,0.58,street,Chemin de l'Orme 91540 Fontenay-le-Vicomte,91244_0075,G,CHEMIN DE L ORME,
315029710,00029,31502971000029,O,1991-10-01,NN,,,2019-11-14T14:01:05,true,4,,17,,RUE,DES MESSIS,91540,FONTENAY-LE-VICOMTE,,,91244,,,,,,,,,,,,,,,,,,,2006-12-08,F,,,,,45.2A,NAFRev1,O,2.396274,48.546293,0.94,housenumber,17 Rue des Messis 91540 Fontenay-le-Vicomte,91244_dmlq4w_00017,G,17 RUE DES MESSIS,
315682435,00013,31568243500013,O,,NN,,,2019-11-14T14:01:05,true,1,,14,,,GRANDE RUE,91540,FONTENAY-LE-VICOMTE,,,91244,,,,,,,,,,,,,,,,,,,,F,,,,,55.60,NAP,N,2.40178,48.548019,0.94,housenumber,14 Grande Rue 91540 Fontenay-le-Vicomte,91244_0084_00014,G,14 GRANDE RUE,
315866814,00033,31586681400033,O,1992-09-20,NN,,,2019-11-14T14:01:05,true,4,ZI LA NOZOLLE,,,RUE,DE L ORME,91540,FONTENAY-LE-VICOMTE,,,91244,,,,,,,,,,,,,,,,,,,1997-05-26,F,,,,,31.2A,NAF1993,O,2.405487,48.548421,0.94,street,Rue de l'Orme 91540 Fontenay-le-Vicomte,91244_0076,G,RUE DE L ORME,
317035814,00019,31703581400019,O,1979-01-01,NN,,2512ZZ,2019-11-14T14:01:05,true,3,,,,,ZONE INDUSTRIELLE,91540,FONTENAY-LE-VICOMTE,,,91244,,,,,,,,,,,,,,,,,,,1996-04-01,F,,,,,28.1C,NAF1993,O,5.0269111,45.7705982,0.92,poi.industrial,Zone Industrielle Meyzieu,https://osm.org/way/117589602,G,,
317372852,00010,31737285200010,O,1979-01-01,NN,,,2019-11-14T14:01:05,false,4,,19,,RUE,DE LA SALLE,91540,FONTENAY-LE-VICOMTE,,,91244,,,,,,,,,,,,,,,,,,,2002-01-02,F,,,,,70.2C,NAF1993,N,2.400203,48.548664,0.94,housenumber,19 Rue de la Salle 91540 Fontenay-le-Vicomte,91244_0090_00019,G,19 RUE DE LA SALLE,
318668787,00019,31866878700019,O,,NN,,,2019-11-14T14:01:05,true,1,,1,,RUE,DE LA RUELLE,91540,FONTENAY-LE-VICOMTE,,,91244,,,,,,,,,,,,,,,,,,,1990-12-31,F,,,,,69.12,NAP,N,2.4034,48.549074,0.94,housenumber,1 Rue de la Ruelle 91540 Fontenay-le-Vicomte,91244_0085_00001,G,1 RUE DE LA RUELLE,
320671563,00056,32067156300056,O,1994-08-01,NN,,,2019-11-14T14:01:05,true,4,,16,,RUE,DE L'ORME,91540,FONTENAY-LE-VICOMTE,,,91244,,,,,,,,,,,,,,,,,,,1996-12-25,F,,,,,51.6J,NAF1993,O,2.405948,48.546918,0.94,housenumber,16 Rue de l'Orme 91540 Fontenay-le-Vicomte,91244_0076_00016,G,16 RUE DE L ORME,
320806136,00018,32080613600018,O,,,,,2019-11-14T14:01:05,true,1,,,,RUE,DE LA SALLE,91540,FONTENAY-LE-VICOMTE,,,91244,,,,,,,,,,,,,,,,,,,1990-05-03,F,,,,,67.04,NAP,N,2.404167,48.550975,0.94,street,Rue de la Salle 91540 Fontenay-le-Vicomte,91244_0090,G,RUE DE LA SALLE,
320947005,00015,32094700500015,O,1900-01-01,,,,2019-11-14T14:01:05,false,2,,191,,,RN,91540,FONTENAY-LE-VICOMTE,,,91244,,,,,,,,,,,,,,,,,,,1984-12-25,F,,,,,67.04,NAP,N,2.415113,48.555188,0.77,locality,N Rn 191 91540 Fontenay-le-Vicomte,91244_0073,G,N RN 191,
322054727,00027,32205472700027,O,1982-12-08,02,2018,,2020-08-25T10:29:28,true,4,LOT NÂ°7,,,,ZONE ARTISANALE,91540,FONTENAY-LE-VICOMTE,,,91244,,,,,,,,,,,,,,,,,,,2008-01-01,A,,,,,38.32Z,NAFRev2,O,2.7640352,42.6301915,0.9,poi.retail,Zone Artisanale (Zone commerciale) Thuir,https://osm.org/way/191039530,G,,
323075366,00019,32307536600019,O,,NN,,,2019-11-14T14:01:05,true,1,,34,,,GRANDE RUE,91540,FONTENAY-LE-VICOMTE,,,91244,,,,,,,,,,,,,,,,,,,1988-12-31,F,,,,,67.01,NAP,N,2.400897,48.547637,0.94,housenumber,34 Grande Rue 91540 Fontenay-le-Vicomte,91244_0084_00034,G,34 GRANDE RUE,
324571413,00040,32457141300040,O,1987-04-14,NN,,,2019-11-14T14:01:05,false,5,,,,,ZA DE LA NOZOLLE,91540,FONTENAY-LE-VICOMTE,,,91244,,,,,,,,,,,,,,,,,,,2015-03-01,F,,,,,46.15Z,NAFRev2,O,2.401079,48.546408,0.66,street,Impasse de la Nozole 91540 Fontenay-le-Vicomte,91244_0071,G,IMPASSE DE LA NOZOLE,
326066438,00010,32606643800010,O,,,,,2019-11-14T14:01:05,true,1,,46,,,RUE,91540,FONTENAY-LE-VICOMTE,,,91244,,,,,,,,,,,,,,,,,,,1985-12-25,F,,,,,67.01,NAP,N,2.408779,48.549996,0.9,housenumber,46 Rue du Bois de la Sainte 91540 Fontenay-le-Vicomte,91244_0010_00046,G,46 RUE DU BOIS DE LA SAINTE,
326382892,00015,32638289200015,O,1983-01-01,NN,,,2019-11-14T14:01:05,true,3,,19,,RUE,DE LA SALLE,91540,FONTENAY-LE-VICOMTE,,,91244,,,,,,,,,,,,,,,,,,,2008-01-01,A,,,,,68.20B,NAFRev2,N,2.400203,48.548664,0.94,housenumber,19 Rue de la Salle 91540 Fontenay-le-Vicomte,91244_0090_00019,G,19 RUE DE LA SALLE,
326885100,00023,32688510000023,O,1993-01-01,NN,,,2019-11-14T14:01:05,false,4,,,,,ZI RUE DES ORMES,91540,FONTENAY-LE-VICOMTE,,,91244,,,,,,,,,,,,,,,,,,,2001-12-31,F,,,,,70.2C,NAF1993,N,,,0,,,,,,
327075016,00011,32707501600011,O,,,,,2019-11-14T14:01:05,true,1,,1,,,LA RUELLE,91540,FONTENAY-LE-VICOMTE,,,91244,,,,,,,,,,,,,,,,,,,,F,,,,,65.03,NAP,N,2.4034,48.549074,0.85,housenumber,1 Rue de la Ruelle 91540 Fontenay-le-Vicomte,91244_0085_00001,G,1 RUE DE LA RUELLE,
327680351,00019,32768035100019,O,1983-07-11,NN,,,2019-11-14T14:01:05,true,1,,35,,,GRANDE RUE,91540,FONTENAY-LE-VICOMTE,,,91244,,,,,,,,,,,,,,,,,,,1998-12-31,F,,,,,50.2Z,NAF1993,N,2.401164,48.547805,0.94,housenumber,35 Grande Rue 91540 Fontenay-le-Vicomte,91244_0084_00035,G,35 GRANDE RUE,
328036629,00017,32803662900017,O,,NN,,,2019-11-14T14:01:05,true,1,,,,CHE,DU REIGNAULT,91540,FONTENAY-LE-VICOMTE,,,91244,,,,,,,,,,,,,,,,,,,1990-08-28,F,,,,,51.11,NAP,N,2.412238,48.554471,0.77,street,Rue du Reignault 91540 Fontenay-le-Vicomte,91244_0087,G,RUE DU REIGNAULT,
328042932,00017,32804293200017,O,1983-05-25,NN,,,2019-11-14T14:01:05,true,3,,46,,,GRANDE RUE,91540,FONTENAY-LE-VICOMTE,,,91244,,,,,,,,,,,,,,,,,,,2008-01-01,A,,,,,56.10A,NAFRev2,N,2.399209,48.547057,0.94,housenumber,46 Grande Rue 91540 Fontenay-le-Vicomte,91244_0084_00046,G,46 GRANDE RUE,
328566120,00015,32856612000015,O,1983-10-01,NN,,,2019-11-14T14:01:05,false,4,,19,,RUE,DE LA SALLE,91540,FONTENAY-LE-VICOMTE,,,91244,,,,,,,,,,,,,,,,,,,2002-01-02,F,,,,,74.1J,NAF1993,N,2.400203,48.548664,0.94,housenumber,19 Rue de la Salle 91540 Fontenay-le-Vicomte,91244_0090_00019,G,19 RUE DE LA SALLE,
329088074,00029,32908807400029,O,1999-09-01,12,2018,3312ZA,2020-08-25T10:33:37,true,4,,,,AV,SAINT REMI,91540,FONTENAY-LE-VICOMTE,,,91244,,,,,,,,,,,,,,,,,,,2008-01-01,A,,,,,46.61Z,NAFRev2,O,2.408446,48.550973,0.8,street,Avenue de Saint Remi 91540 Fontenay-le-Vicomte,91244_0089,G,AVENUE DE SAINT REMI,
329632012,00012,32963201200012,O,,NN,,,2019-11-14T14:01:05,true,1,,,,,ZA DE LA NOZOLE,91540,FONTENAY-LE-VICOMTE,,,91244,,,,,,,,,,,,,,,,,,,1990-12-25,F,,,,,77.01,NAP,N,2.403461,48.547223,0.76,street,Rue de la Nozole 91540 Fontenay-le-Vicomte,91244_0074,G,RUE DE LA NOZOLE,
331066571,00026,33106657100026,O,1985-05-21,NN,,,2019-11-14T14:01:05,true,3,,,,,ZONE INDUSTRIELLE CIB,91540,FONTENAY-LE-VICOMTE,,,91244,,,,,,,,,,,,,,,,,,,2008-01-01,A,,,,,71.11Z,NAFRev2,N,4.6943893,50.006908,0.74,poi.industrial,La Fagne (Zone industrielle) Haybes,https://osm.org/way/194008804,G,,
331663062,00015,33166306200015,O,1985-02-05,NN,,,2019-11-14T14:01:05,false,4,,19,,RUE,LA SALLE,91540,FONTENAY-LE-VICOMTE,,,91244,,,,,,,,,,,,,,,,,,,2002-01-02,F,,,,,70.2C,NAF1993,N,2.400203,48.548664,0.93,housenumber,19 Rue de la Salle 91540 Fontenay-le-Vicomte,91244_0090_00019,G,19 RUE DE LA SALLE,
332799261,00026,33279926100026,O,,NN,,,2019-11-14T14:01:05,true,1,,2,,RUE,DE LA MAIRIE,91540,FONTENAY-LE-VICOMTE,,,91244,,,,,,,,,,,,,,,,,,,1995-06-12,F,,,,,52.6E,NAF1993,N,2.399045,48.547441,0.94,housenumber,2 Rue de la Mairie 91540 Fontenay-le-Vicomte,91244_0070_00002,G,2 RUE DE LA MAIRIE,
334099298,00070,33409929800070,O,2001-04-01,NN,,,2019-11-14T14:01:05,false,4,,3,,RUE,DE LA SALLE,91540,FONTENAY-LE-VICOMTE,,,91244,,,,,,,,,,,,,,,,,,,2004-02-26,F,,,,,29.2F,NAFRev1,O,2.403506,48.550619,0.94,housenumber,3 Rue de la Salle 91540 Fontenay-le-Vicomte,91244_0090_00003,G,3 RUE DE LA SALLE,
334383213,00025,33438321300025,O,1991-01-01,02,2018,,2020-08-25T10:36:43,true,4,ZA,16,,RUE,DE L ORGE,91540,FONTENAY-LE-VICOMTE,,,91244,,,,,,,,,,,,,,,,,,,2008-01-01,A,,,,,20.14Z,NAFRev2,O,2.405948,48.546918,0.78,housenumber,16 Rue de l'Orme 91540 Fontenay-le-Vicomte,91244_0076_00016,G,16 RUE DE L ORME,
334837150,00021,33483715000021,O,1989-07-01,NN,,,2019-11-14T14:01:05,false,6,ZA,,,,ZONE ARTISANALE,91540,FONTENAY-LE-VICOMTE,,,91244,,,,,,,,,,,,,,,,,,,2007-03-23,F,,,,,74.1J,NAFRev1,O,2.7640352,42.6301915,0.9,poi.retail,Zone Artisanale (Zone commerciale) Thuir,https://osm.org/way/191039530,G,,
334837150,00336,33483715000336,O,2007-11-01,,,,2019-11-14T14:01:05,false,2,ZAC DE FONTENAY LE VICOMTE,6,,CHE,DE L'ORME,91540,FONTENAY-LE-VICOMTE,,,91244,,,,,,,,,,,,,,,,,,,2010-03-31,F,,,,,49.41B,NAFRev2,O,2.40551,48.547942,0.82,housenumber,6 Chemin de l'Orme 91540 Fontenay-le-Vicomte,91244_0075_00006,G,6 CHEMIN DE L ORME,
334962495,00019,33496249500019,O,1986-03-01,NN,,,2019-11-14T14:01:05,false,6,,,,,ZA DE LA NOZOLLE,91540,FONTENAY-LE-VICOMTE,,,91244,,,,,,,,,,,,,,,,,,,2014-12-05,F,,,,,46.69B,NAFRev2,O,2.401079,48.546408,0.66,street,Impasse de la Nozole 91540 Fontenay-le-Vicomte,91244_0071,G,IMPASSE DE LA NOZOLE,
339151672,00013,33915167200013,O,,NN,,,2019-11-14T14:01:05,true,1,,,,RUE,DE L ORME,91540,FONTENAY-LE-VICOMTE,,,91244,,,,,,,,,,,,,,,,,,,1988-06-02,F,,,,,55.71,NAP,N,2.405487,48.548421,0.94,street,Rue de l'Orme 91540 Fontenay-le-Vicomte,91244_0076,G,RUE DE L ORME,
339797961,00010,33979796100010,O,,,,,2019-11-14T14:01:05,true,1,,,,,ZA DE LA NOZOLE,91540,FONTENAY-LE-VICOMTE,,,91244,,,,,,,,,,,,,,,,,,,1988-12-25,F,,,,,95.22,NAP,N,2.403461,48.547223,0.76,street,Rue de la Nozole 91540 Fontenay-le-Vicomte,91244_0074,G,RUE DE LA NOZOLE,
340268200,00011,34026820000011,O,,NN,,,2019-11-14T14:01:05,true,1,,1,,IMP,DES 4 VENTS,91540,FONTENAY-LE-VICOMTE,,,91244,,,,,,,,,,,,,,,,,,,1996-05-06,F,,,,,52.6H,NAF1993,O,2.397846,48.5468,0.84,housenumber,1 Impasse des 4 Vents 91540 Fontenay-le-Vicomte,91244_0080_00001,G,1 IMPASSE DES 4 VENTS,
341104743,00024,34110474300024,O,,NN,,,2019-11-14T14:01:05,true,1,,3,,CHE,DU COURT FETU,91540,FONTENAY-LE-VICOMTE,,,91244,,,,,,,,,,,,,,,,,,,1989-11-01,F,,,,,77.14,NAP,N,2.406323,48.554309,0.76,housenumber,3 Rue du Court Fetu 91540 Fontenay-le-Vicomte,91244_hkinq1_00003,G,3 RUE DU COURT FETU,
341729275,00022,34172927500022,O,2004-05-01,NN,,,2019-11-14T14:01:05,true,3,,7,,IMP,DES QUATRE VENTS,91540,FONTENAY-LE-VICOMTE,,,91244,,,,,,,,,,,,,,,,,,,2006-10-31,F,,,,,70.2A,NAFRev1,N,2.397611,48.547197,0.58,housenumber,7 Impasse des 4 Vents 91540 Fontenay-le-Vicomte,91244_0080_00007,G,7 IMPASSE DES 4 VENTS,
341973691,00015,34197369100015,O,,,,,2019-11-14T14:01:05,true,1,,34,,,GRANDE RUE,91540,FONTENAY-LE-VICOMTE,,,91244,,,,,,,,,,,,,,,,,,,1988-03-31,F,,,,,64.24,NAP,N,2.400897,48.547637,0.94,housenumber,34 Grande Rue 91540 Fontenay-le-Vicomte,91244_0084_00034,G,34 GRANDE RUE,
342257771,00010,34225777100010,O,1987-09-11,NN,,,2019-11-14T14:01:05,false,5,,35,,,GRANDE RUE,91540,FONTENAY-LE-VICOMTE,,,91244,,,,,,,,,,,,,,,,,,,2013-12-21,F,,,,,68.20B,NAFRev2,N,2.401164,48.547805,0.94,housenumber,35 Grande Rue 91540 Fontenay-le-Vicomte,91244_0084_00035,G,35 GRANDE RUE,
343214037,00016,34321403700016,O,1900-01-01,NN,,,2020-08-21T09:58:15,false,3,,14,,,GRANDE RUE,91540,FONTENAY-LE-VICOMTE,,,91244,,,,,,,,,,,,,,,,,,,1989-12-25,F,,,,,64.25,NAP,N,2.40178,48.548019,0.94,housenumber,14 Grande Rue 91540 Fontenay-le-Vicomte,91244_0084_00014,G,14 GRANDE RUE,
343262622,21525,34326262221525,O,2018-02-21,,,,2019-11-14T14:01:05,false,1,,,,RUE,DE L'ORME ZAC DE LA NOZOLE,91540,FONTENAY-LE-VICOMTE,,,91244,,,,,,,,,,,,,,,,,,,2018-02-21,A,LIDL,,,SNC LIDL,47.11D,NAFRev2,O,,,0,,,,,,
344079181,00014,34407918100014,O,1988-03-03,NN,,,2019-11-14T14:01:05,true,4,CRUS ET CLIMATS DE FRANCE,26,,RUE,DE LA SALLE,91540,FONTENAY-LE-VICOMTE,,,91244,,,,,,,,,,,,,,,,,,,2013-09-27,F,,,,,47.25Z,NAFRev2,N,2.396909,48.548233,0.94,housenumber,26 Rue de la Salle 91540 Fontenay-le-Vicomte,91244_0090_00026,G,26 RUE DE LA SALLE,
344079181,00022,34407918100022,O,1988-03-01,,,,2019-11-14T14:01:05,false,5,ZA FONTENAY LE VICOMTE,,,CHE,DE L ORME,91540,FONTENAY-LE-VICOMTE,,,91244,,,,,,,,,,,,,,,,,,,2013-09-27,F,LA CAVE DE FONTENAY,,,,47.25Z,NAFRev2,N,2.40626,48.549076,0.81,street,Chemin de l'Orme 91540 Fontenay-le-Vicomte,91244_0075,G,CHEMIN DE L ORME,
344119987,00032,34411998700032,O,2010-03-29,02,2018,8292ZZ,2020-08-25T10:41:48,true,1,,33,,RUE,DE LA CROIX BOISSY,91540,FONTENAY-LE-VICOMTE,,,91244,,,,,,,,,,,,,,,,,,,2010-03-29,A,,,,,82.92Z,NAFRev2,O,2.400996,48.5472,0.94,housenumber,33 Rue de la Croix Boissy 91540 Fontenay-le-Vicomte,91244_0033_00033,G,33 RUE DE LA CROIX BOISSY,
344149026,00017,34414902600017,O,,NN,,,2019-11-14T14:01:05,true,1,,1,,,SALLE,91540,FONTENAY-LE-VICOMTE,,,91244,,,,,,,,,,,,,,,,,,,1990-12-25,F,,,,,64.11,NAP,N,2.404167,48.550975,0.8,housenumber,1 Rue de la Salle 91540 Fontenay-le-Vicomte,91244_0090_00001,G,1 RUE DE LA SALLE,
344396569,00024,34439656900024,O,,NN,,,2019-11-14T14:01:05,true,1,,,,RUE,DES ORMES,91540,FONTENAY-LE-VICOMTE,,,91244,,,,,,,,,,,,,,,,,,,1990-02-15,F,,,,,25.2A,NAF1993,N,2.405487,48.548421,0.65,street,Rue de l'Orme 91540 Fontenay-le-Vicomte,91244_0076,G,RUE DE L ORME,
344413539,00018,34441353900018,O,,NN,,,2019-11-14T14:01:05,true,1,,1,,CHE,VERT,91540,FONTENAY-LE-VICOMTE,,,91244,,,,,,,,,,,,,,,,,,,1995-05-29,F,,,,,45.4J,NAF1993,N,2.406618,48.55277,0.75,housenumber,1 Rue du Chemin Vert 91540 Fontenay-le-Vicomte,91244_ujg3i1_00001,G,1 RUE DU CHEMIN VERT,
344564083,00014,34456408300014,O,1988-04-01,,,,2019-11-14T14:01:05,true,3,,,,RTE,DE CHEVANNES,91540,FONTENAY-LE-VICOMTE,,,91244,,,,,,,,,,,,,,,,,,,2004-12-31,F,,,,,01.1C,NAFRev1,N,2.400667,48.546894,0.83,street,Route de Chevannes 91540 Fontenay-le-Vicomte,91244_0031,G,ROUTE DE CHEVANNES,
344572698,00027,34457269800027,O,1990-05-21,NN,,,2019-11-14T14:01:05,false,4,,3,,IMP,DES MARAICHERS,91540,FONTENAY-LE-VICOMTE,,,91244,,,,,,,,,,,,,,,,,,,1993-12-25,F,,,,,45.3A,NAF1993,N,2.403154,48.546496,0.85,housenumber,3 Impasse des Maraichers 91540 Fontenay-le-Vicomte,91244_0068_00003,G,3 IMPASSE DES MARAICHERS,
344572698,00035,34457269800035,O,2006-04-25,,,,2019-11-14T14:01:05,false,3,,6,,RUE,DU CHEMIN VERT,91540,FONTENAY-LE-VICOMTE,,,91244,,,,,,,,,,,,,,,,,,,2011-08-01,F,,,,,43.21A,NAFRev2,N,2.407411,48.553189,0.94,housenumber,6 Rue du Chemin Vert 91540 Fontenay-le-Vicomte,91244_ujg3i1_00006,G,6 RUE DU CHEMIN VERT,
344886270,00018,34488627000018,O,1988-05-19,NN,,,2019-11-14T14:01:05,true,3,,26,,RUE,DE LA SALLE,91540,FONTENAY-LE-VICOMTE,,,91244,,,,,,,,,,,,,,,,,,,2008-01-01,A,,,,,01.11Z,NAFRev2,N,2.396909,48.548233,0.94,housenumber,26 Rue de la Salle 91540 Fontenay-le-Vicomte,91244_0090_00026,G,26 RUE DE LA SALLE,
348117987,00035,34811798700035,O,2015-06-08,,,4322BB,2019-11-14T14:01:05,true,1,,16,,RUE,DE L ORME,91540,FONTENAY-LE-VICOMTE,,,91244,,,,,,,,,,,,,,,,,,,2015-06-08,F,,,,GUNEY,47.11B,NAFRev2,O,2.405948,48.546918,0.94,housenumber,16 Rue de l'Orme 91540 Fontenay-le-Vicomte,91244_0076_00016,G,16 RUE DE L ORME,
349371286,00023,34937128600023,O,1989-09-01,NN,,,2019-11-14T14:01:05,false,4,ZA DE LA NOZOLLE,,,RUE,DE L'ORME,91540,FONTENAY-LE-VICOMTE,,,91244,,,,,,,,,,,,,,,,,,,1999-09-01,F,S A T T,,,,72.3Z,NAF1993,O,2.405487,48.548421,0.94,street,Rue de l'Orme 91540 Fontenay-le-Vicomte,91244_0076,G,RUE DE L ORME,
349548933,00010,34954893300010,O,1989-02-01,NN,,,2019-11-14T14:01:05,true,5,,1,,RUE,LA RUELLE,91540,FONTENAY-LE-VICOMTE,,,91244,,,,,,,,,,,,,,,,,,,2008-03-31,F,,,,,45.11Z,NAFRev2,O,2.4034,48.549074,0.93,housenumber,1 Rue de la Ruelle 91540 Fontenay-le-Vicomte,91244_0085_00001,G,1 RUE DE LA RUELLE,
349882076,00038,34988207600038,O,1991-05-30,NN,,,2019-11-14T14:01:05,true,1,,8,,CHE,DES MESSIS,91540,FONTENAY-LE-VICOMTE,,,91244,,,,,,,,,,,,,,,,,,,2000-11-30,F,,,,,93.0B,NAF1993,N,2.396176,48.546558,0.72,housenumber,8 Rue des Messis 91540 Fontenay-le-Vicomte,91244_dmlq4w_00008,G,8 RUE DES MESSIS,
350144622,00080,35014462200080,O,1999-10-01,,,,2019-11-14T14:01:05,false,4,ZAC DE FONTENAY LE VICOMTE,,,,ZAC,91540,FONTENAY-LE-VICOMTE,,,91244,,,,,,,,,,,,,,,,,,,2007-03-23,F,,,,,74.4B,NAFRev1,N,2.400363,48.54707,0.76,street,Residence Jardins de la Bale 91540 Fontenay-le-Vicomte,91244_a003,D,RESIDENCE JARDINS DE LA BALE,
350145868,00013,35014586800013,O,1989-04-01,,,,2019-11-14T14:01:05,true,4,ZI LA NOZELLE,7,,RUE,DE LA CROIX BOISSY,91540,FONTENAY-LE-VICOMTE,,,91244,,,,,,,,,,,,,,,,,,,1992-12-25,F,,,,,52.4C,NAF1993,N,2.404329,48.548243,0.94,housenumber,7 Rue de la Croix Boissy 91540 Fontenay-le-Vicomte,91244_0033_00007,G,7 RUE DE LA CROIX BOISSY,
352243372,00013,35224337200013,O,1989-11-01,NN,,,2019-11-14T14:01:05,false,4,ZA LA NOZOLLE,,,,ORME,91540,FONTENAY-LE-VICOMTE,,,91244,,,,,,,,,,,,,,,,,,,1993-01-01,F,,,,,01.4B,NAF1993,N,2.405487,48.548421,0.91,street,Rue de l'Orme 91540 Fontenay-le-Vicomte,91244_0076,G,RUE DE L ORME,
352828768,00205,35282876800205,O,1993-03-25,NN,,,2019-11-14T14:01:05,false,3,,,,,ZI,91540,FONTENAY-LE-VICOMTE,,,91244,,,,,,,,,,,,,,,,,,,1995-12-25,F,VIVAMOD,,,,52.4A,NAF1993,O,,,0,,,,,,
352902985,00014,35290298500014,O,1989-12-26,NN,,,2019-11-14T14:01:05,true,4,,1,,RUE,DE L'ORME,91540,FONTENAY-LE-VICOMTE,,,91244,,,,,,,,,,,,,,,,,,,2000-12-31,F,,,,,72.3Z,NAF1993,N,2.405487,48.548421,0.94,housenumber,1 Rue de l'Orme 91540 Fontenay-le-Vicomte,91244_0076_00001,G,1 RUE DE L ORME,