siren,nic,siret,statutDiffusionEtablissement,dateCreationEtablissement,trancheEffectifsEtablissement,anneeEffectifsEtablissement,activitePrincipaleRegistreMetiersEtablissement,dateDernierTraitementEtablissement,etablissementSiege,nombrePeriodesEtablissement,complementAdresseEtablissement,numeroVoieEtablissement,indiceRepetitionEtablissement,typeVoieEtablissement,libelleVoieEtablissement,codePostalEtablissement,libelleCommuneEtablissement,libelleCommuneEtrangerEtablissement,distributionSpecialeEtablissement,codeCommuneEtablissement,codeCedexEtablissement,libelleCedexEtablissement,codePaysEtrangerEtablissement,libellePaysEtrangerEtablissement,complementAdresse2Etablissement,numeroVoie2Etablissement,indiceRepetition2Etablissement,typeVoie2Etablissement,libelleVoie2Etablissement,codePostal2Etablissement,libelleCommune2Etablissement,libelleCommuneEtranger2Etablissement,distributionSpeciale2Etablissement,codeCommune2Etablissement,codeCedex2Etablissement,libelleCedex2Etablissement,codePaysEtranger2Etablissement,libellePaysEtranger2Etablissement,dateDebut,etatAdministratifEtablissement,enseigne1Etablissement,enseigne2Etablissement,enseigne3Etablissement,denominationUsuelleEtablissement,activitePrincipaleEtablissement,nomenclatureActivitePrincipaleEtablissement,caractereEmployeurEtablissement,longitude,latitude,geo_score,geo_type,geo_adresse,geo_id,geo_ligne,geo_l4,geo_l5
009717695,00028,00971769500028,O,2003-07-10,NN,,,2012-10-09T05:22:46,true,3,,,,RUE,DE CLAIRVAUX,10200,BAROVILLE,,,10032,,,,,,,,,,,,,,,,,,,2008-01-01,A,,,,,68.20B,NAFRev2,N,4.7237,48.191271,0.93,street,Rue de Clairvaux 10200 Baroville,10032_0215,G,RUE DE CLAIRVAUX,
095750303,00091,09575030300091,O,1991-07-10,NN,,,2008-01-04T18:11:22,false,3,,,,,LES MIROLAIS,10200,BAROVILLE,,,10032,,,,,,,,,,,,,,,,,,,2008-01-01,A,,,,,11.02A,NAFRev2,N,4.720127,48.193065,0.93,street,Les Mirolais 10200 Baroville,10032_w9mmho,G,LES MIROLAIS,
211000302,00011,21100030200011,O,1983-03-01,01,2018,,2020-08-25T10:15:42,true,3,,,,PL,DE LA MAIRIE,10200,BAROVILLE,,,10032,,,,,,,,,,,,,,,,,,,2008-01-01,A,MAIRIE,,,,84.11Z,NAFRev2,N,4.72208,48.192547,0.82,street,Place de la Mairie 10200 Baroville,10032_tluqqh,G,PLACE DE LA MAIRIE,
211000302,00029,21100030200029,O,1983-12-21,NN,,,2013-05-18T02:11:49,false,3,,,,PL,DE LA MAIRIE,10200,BAROVILLE,,,10032,,,,,,,,,,,,,,,,,,,2008-01-01,A,ECOLE PRIMAIRE PUBLIQUE,,,,85.20Z,NAFRev2,N,4.72208,48.192547,0.82,street,Place de la Mairie 10200 Baroville,10032_tluqqh,G,PLACE DE LA MAIRIE,
211000302,00037,21100030200037,O,1996-05-01,NN,,,2007-05-14T16:53:41,false,3,MAIRIE,,,PL,DE LA MAIRIE,10200,BAROVILLE,,,10032,,,,,,,,,,,,,,,,,,,2007-01-01,F,SERVICE DES EAUX,,,,41.0Z,NAFRev1,N,4.72208,48.192547,0.82,street,Place de la Mairie 10200 Baroville,10032_tluqqh,G,PLACE DE LA MAIRIE,
211000302,00045,21100030200045,O,2002-05-05,,,,2008-01-04T18:25:15,false,4,MAIRIE,,,PL,DE LA MAIRIE,10200,BAROVILLE,,,10032,,,,,,,,,,,,,,,,,,,2008-01-01,A,SCE EAU ET ASSAINISSEMENT,,,,36.00Z,NAFRev2,N,4.72208,48.192547,0.82,street,Place de la Mairie 10200 Baroville,10032_tluqqh,G,PLACE DE LA MAIRIE,
261000301,00018,26100030100018,O,1983-03-01,NN,,,2018-04-11T14:58:00,true,4,MAIRIE,,,PL,DE LA MAIRIE,10200,BAROVILLE,,,10032,,,,,,,,,,,,,,,,,,,2017-12-31,F,CCAS,,,,88.99B,NAFRev2,N,4.72208,48.192547,0.82,street,Place de la Mairie 10200 Baroville,10032_tluqqh,G,PLACE DE LA MAIRIE,
261004600,00019,26100460000019,O,,,,,,true,1,,,,,,10200,BAROVILLE,,,10032,,,,,,,,,,,,,,,,,,,,F,,,,,95.11,NAP,N,,,0,,,,,,
271000176,00013,27100017600013,O,,,,,,true,1,,,,,,10200,BAROVILLE,,,10032,,,,,,,,,,,,,,,,,,,1995-12-25,F,,,,,41.0Z,NAF1993,N,,,0,,,,,,
291002897,00010,29100289700010,O,1987-02-26,NN,,,2012-05-05T00:39:54,true,3,MAIRIE,,,PL,DE LA MAIRIE,10200,BAROVILLE,,,10032,,,,,,,,,,,,,,,,,,,2008-01-01,A,,,,,42.99Z,NAFRev2,N,4.72208,48.192547,0.82,street,Place de la Mairie 10200 Baroville,10032_tluqqh,G,PLACE DE LA MAIRIE,
300865425,00023,30086542500023,O,1999-07-01,NN,,,2008-01-04T19:12:15,true,3,,,,RUE,DE CLAIRVAUX,10200,BAROVILLE,,,10032,,,,,,,,,,,,,,,,,,,2008-01-01,A,,,,,68.20B,NAFRev2,N,4.7237,48.191271,0.93,street,Rue de Clairvaux 10200 Baroville,10032_0215,G,RUE DE CLAIRVAUX,
302755228,00012,30275522800012,O,,,,,2007-01-18T09:10:53,true,1,,,,,,10200,BAROVILLE,,,10032,,,,,,,,,,,,,,,,,,,,F,,,,,01.17,NAP,N,,,0,,,,,,
303974877,00019,30397487700019,O,,NN,,,,true,1,,,,,,10200,BAROVILLE,,,10032,,,,,,,,,,,,,,,,,,,1993-12-31,F,,,,,45.4C,NAF1993,N,,,0,,,,,,
306363664,00013,30636366400013,O,1900-01-01,,,,2016-11-07T17:16:16,false,7,,,,,,10200,BAROVILLE,,,10032,,,,,,,,,,,,,,,,,,,2016-07-31,F,,,,,46.17B,NAFRev2,N,,,0,,,,,,
306363664,00021,30636366400021,O,1980-12-31,NN,,,2008-01-04T19:41:35,false,3,,,,,,10200,BAROVILLE,,,10032,,,,,,,,,,,,,,,,,,,2008-01-01,A,,,,,01.21Z,NAFRev2,N,,,0,,,,,,
306363664,00039,30636366400039,O,2005-01-01,,,,2016-11-07T17:16:16,true,2,,,,,,10200,BAROVILLE,,,10032,,,,,,,,,,,,,,,,,,,2008-01-01,A,,,,,68.20B,NAFRev2,N,,,0,,,,,,
311002265,00016,31100226500016,O,1977-01-01,NN,,,,true,1,,,,,CHAMP DE LA PRAIRIE,10200,BAROVILLE,,,10032,,,,,,,,,,,,,,,,,,,1998-04-30,F,,,,,52.4N,NAF1993,N,5.9057595,47.9052404,0.86,poi.meadow,Champ de la Truie (Prairie) Villars-le-Pautel,https://osm.org/way/175450726,G,,
314042730,00023,31404273000023,O,1991-03-15,NN,,,2012-07-28T11:10:06,true,4,,,,,,10200,BAROVILLE,,,10032,,,,,,,,,,,,,,,,,,,2008-12-25,F,,,,,68.20B,NAFRev2,N,,,0,,,,,,
314208125,00042,31420812500042,O,1998-12-19,02,2018,,2020-08-25T10:25:59,false,4,,,,,,10200,BAROVILLE,,,10032,,,,,,,,,,,,,,,,,,,2009-03-05,A,,,,,01.21Z,NAFRev2,O,,,0,,,,,,
315639963,00026,31563996300026,O,,,,,2006-11-25T09:37:00,true,1,,,,,,10200,BAROVILLE,,,10032,,,,,,,,,,,,,,,,,,,1997-06-01,F,,,,,74.1J,NAF1993,N,,,0,,,,,,
318533494,00015,31853349400015,O,1980-01-01,NN,,,,true,1,,,,,,10200,BAROVILLE,,,10032,,,,,,,,,,,,,,,,,,,1998-07-31,F,,,,,01.1G,NAF1993,N,,,0,,,,,,
320048408,00019,32004840800019,O,1980-10-01,,,,,false,4,,,,,,10200,BAROVILLE,,,10032,,,,,,,,,,,,,,,,,,,1997-06-23,F,,,,,01.1G,NAF1993,N,,,0,,,,,,
329939300,00011,32993930000011,O,,,,,,true,1,,,,,,10200,BAROVILLE,,,10032,,,,,,,,,,,,,,,,,,,1996-07-01,F,,,,,01.1G,NAF1993,N,,,0,,,,,,
330200767,00011,33020076700011,O,1984-06-10,NN,,,2010-04-18T04:23:32,false,4,CHEZ MR HERVE DEBAERE,,,,,10200,BAROVILLE,,,10032,,,,,,,,,,,,,,,,,,,2009-10-15,F,,,,,01.21Z,NAFRev2,N,,,0,,,,,,
330200767,00029,33020076700029,O,2009-10-15,,,,2017-10-02T09:29:40,true,2,,11,,,VOIE DES CHAMPS,10200,BAROVILLE,,,10032,,,,,,,,,,,,,,,,,,,2017-10-02,A,,,,,01.21Z,NAFRev2,N,4.727701,48.194251,0.93,housenumber,11 Voie des Champs 10200 Baroville,10032_0213_00011,G,11 VOIE DES CHAMPS,
331027003,00010,33102700300010,O,,,,,2015-09-01T03:56:02,true,1,,,,,,10200,BAROVILLE,,,10032,,,,,,,,,,,,,,,,,,,1997-11-30,F,,,,,01.1G,NAF1993,N,,,0,,,,,,
331543421,00019,33154342100019,O,,NN,,,,true,1,,,,,,10200,BAROVILLE,,,10032,,,,,,,,,,,,,,,,,,,1993-04-15,F,,,,,01.1G,NAF1993,N,,,0,,,,,,
331556365,00012,33155636500012,O,1985-01-01,NN,,,2008-01-04T20:14:10,true,3,,,,,,10200,BAROVILLE,,,10032,,,,,,,,,,,,,,,,,,,2008-01-01,A,,,,,01.21Z,NAFRev2,N,,,0,,,,,,
331650861,00015,33165086100015,O,1985-01-01,NN,,,2009-07-26T05:35:52,true,4,,,,,,10200,BAROVILLE,,,10032,,,,,,,,,,,,,,,,,,,1998-12-31,F,,,,,01.1G,NAF1993,N,,,0,,,,,,
331932251,00019,33193225100019,O,,NN,,,,true,1,,,,,,10200,BAROVILLE,,,10032,,,,,,,,,,,,,,,,,,,1992-02-18,F,,,,,70.2B,NAF1993,N,,,0,,,,,,
332189596,00015,33218959600015,O,1983-01-01,NN,,,2007-02-16T10:49:28,true,3,,,,,,10200,BAROVILLE,,,10032,,,,,,,,,,,,,,,,,,,2007-02-28,F,,,,,70.2B,NAFRev1,N,,,0,,,,,,
334571684,00011,33457168400011,O,1986-01-16,NN,,,2008-01-04T20:52:11,true,5,,,,,,10200,BAROVILLE,,,10032,,,,,,,,,,,,,,,,,,,2008-01-01,A,,,,,68.20B,NAFRev2,N,,,0,,,,,,
334694080,00014,33469408000014,O,1986-01-01,NN,,,2013-05-18T03:41:43,true,5,,,,,,10200,BAROVILLE,,,10032,,,,,,,,,,,,,,,,,,,2008-01-01,A,,,,,68.20B,NAFRev2,N,,,0,,,,,,
334694098,00016,33469409800016,O,1986-01-01,NN,,,2008-01-04T20:53:36,true,3,,,,,,10200,BAROVILLE,,,10032,,,,,,,,,,,,,,,,,,,2008-01-01,A,,,,,01.21Z,NAFRev2,N,,,0,,,,,,
337280911,00096,33728091100096,O,1987-01-01,NN,,,,false,3,,,,,RLE DES PRESSOIRS,10200,BAROVILLE,,,10032,,,,,,,,,,,,,,,,,,,2000-01-01,F,,,,,15.9F,NAF1993,N,4.723126,48.191787,0.83,street,Ruelle des Pressoirs 10200 Baroville,10032_0300,G,RUELLE DES PRESSOIRS,
337805782,00014,33780578200014,O,,,,,,true,1,,,,,,10200,BAROVILLE,,,10032,,,,,,,,,,,,,,,,,,,,F,,,,,01.17,NAP,N,,,0,,,,,,
339990020,00010,33999002000010,O,1987-01-01,NN,,,2008-01-04T21:36:52,true,4,,,,,GRANDE RUE,10200,BAROVILLE,,,10032,,,,,,,,,,,,,,,,,,,2008-01-01,A,,,,,68.20B,NAFRev2,N,4.721626,48.19228,0.93,street,Grande Rue 10200 Baroville,10032_b080,G,GRANDE RUE,
340097815,00013,34009781500013,O,1978-01-01,NN,,,2010-04-18T04:49:36,true,3,,,,,,10200,BAROVILLE,,,10032,,,,,,,,,,,,,,,,,,,2008-01-01,A,,,,,01.61Z,NAFRev2,N,,,0,,,,,,
340097815,00021,34009781500021,O,1991-02-01,NN,,,2016-01-12T00:12:30,false,3,,,,,,10200,BAROVILLE,,,10032,,,,,,,,,,,,,,,,,,,2008-01-01,A,,,,,68.20B,NAFRev2,N,,,0,,,,,,
340097823,00025,34009782300025,O,1900-01-01,,,,2011-04-28T00:32:17,false,3,,,,,,10200,BAROVILLE,,,10032,,,,,,,,,,,,,,,,,,,1995-12-25,F,,,,,70.2B,NAF1993,N,,,0,,,,,,
340097823,00041,34009782300041,O,2011-01-02,,,5610CR,2020-01-08T11:48:11,true,5,,9,,RUE,DES CRAVATTES,10200,BAROVILLE,,,10032,,,,,,,,,,,,,,,,,,,2020-01-01,A,,,,,56.10C,NAFRev2,O,4.725366,48.192405,0.93,housenumber,9 Rue des Cravattes 10200 Baroville,10032_0232_00009,G,9 RUE DES CRAVATTES,
340201896,00016,34020189600016,O,1982-01-01,NN,,,2012-04-24T08:40:06,true,4,,,,,,10200,BAROVILLE,,,10032,,,,,,,,,,,,,,,,,,,2009-12-31,F,,,,,01.21Z,NAFRev2,N,,,0,,,,,,
340599596,00012,34059959600012,O,,NN,,,,true,1,,,,,,10200,BAROVILLE,,,10032,,,,,,,,,,,,,,,,,,,1989-12-31,F,,,,,01.17,NAP,N,,,0,,,,,,
341455962,00017,34145596200017,O,1987-04-01,NN,,,2014-07-08T00:46:03,true,6,,,,,,10200,BAROVILLE,,,10032,,,,,,,,,,,,,,,,,,,2013-02-23,F,,,,,43.32A,NAFRev2,N,,,0,,,,,,
341753622,00032,34175362200032,O,2006-01-01,,,,2008-01-04T21:55:55,false,2,,,,RTE,DE BAR SUR AUBE,10200,BAROVILLE,,,10032,,,,,,,,,,,,,,,,,,,2008-01-01,A,,,,,01.21Z,NAFRev2,N,4.721758,48.192625,0.8,street,Rue de Bar-sur-aube 10200 Baroville,10032_0200,G,RUE DE BAR SUR AUBE,
342955382,00011,34295538200011,O,,NN,,,,true,1,,,,,,10200,BAROVILLE,,,10032,,,,,,,,,,,,,,,,,,,1995-06-30,F,,,,,01.1G,NAF1993,N,,,0,,,,,,
343570693,00014,34357069300014,O,1988-01-01,NN,,,2020-02-18T04:03:02,true,3,,,,,,10200,BAROVILLE,,,10032,,,,,,,,,,,,,,,,,,,2008-01-01,A,,,,,01.21Z,NAFRev2,N,,,0,,,,,,
347975989,00018,34797598900018,O,,NN,,,,true,1,,,,,,10200,BAROVILLE,,,10032,,,,,,,,,,,,,,,,,,,1991-12-02,F,,,,,81.99,NAP,N,,,0,,,,,,
348481573,00015,34848157300015,O,1988-10-01,NN,,,2007-01-18T09:26:21,true,4,,,,,FERME DE BAROVILLE,10200,BAROVILLE,,,10032,,,,,,,,,,,,,,,,,,,1991-12-25,F,,,,,01.1A,NAF1993,N,,,0,,,,,,
349557207,00017,34955720700017,O,1988-09-07,NN,,,2008-01-04T23:05:58,true,3,,,,,,10200,BAROVILLE,,,10032,,,,,,,,,,,,,,,,,,,2008-01-01,A,,,,,01.21Z,NAFRev2,N,,,0,,,,,,
352666309,00013,35266630900013,O,1989-12-05,NN,,,2013-02-02T12:14:43,true,4,,,,,,10200,BAROVILLE,,,10032,,,,,,,,,,,,,,,,,,,2010-10-20,F,,,,,68.20B,NAFRev2,N,,,0,,,,,,
352666325,00019,35266632500019,O,1989-12-05,NN,,,2008-01-04T23:45:10,true,3,,,,,,10200,BAROVILLE,,,10032,,,,,,,,,,,,,,,,,,,2008-01-01,A,,,,,68.20B,NAFRev2,N,,,0,,,,,,
352666374,00017,35266637400017,O,1989-12-05,NN,,,2008-01-04T23:45:10,true,3,,,,,LES CHARMOUSES,10200,BAROVILLE,,,10032,,,,,,,,,,,,,,,,,,,2008-01-01,A,,,,,68.20B,NAFRev2,N,,,0,,,,,,
353043268,00013,35304326800013,O,1990-01-01,NN,,,2006-10-28T00:01:33,true,4,,,,,,10200,BAROVILLE,,,10032,,,,,,,,,,,,,,,,,,,2004-10-01,F,,,,,70.2B,NAFRev1,N,,,0,,,,,,
378033757,00014,37803375700014,O,1990-05-11,01,2018,,2020-08-25T10:15:02,true,5,,18,,,VOIE DES CHAMPS,10200,BAROVILLE,,,10032,,,,,,,,,,,,,,,,,,,2012-12-31,A,,,,,01.21Z,NAFRev2,O,4.727597,48.194213,0.93,housenumber,18 Voie des Champs 10200 Baroville,10032_0213_00018,G,18 VOIE DES CHAMPS,
378033757,00022,37803375700022,O,2002-06-26,NN,,,2012-05-05T03:38:06,false,4,,,,CHE,DU TOUR DU VILLAGE,10200,BAROVILLE,,,10032,,,,,,,,,,,,,,,,,,,2010-12-15,F,,,,,01.21Z,NAFRev2,O,4.718298,48.192926,0.85,locality,Chemin du Tour du Village 10200 Baroville,10032_0315,G,CHEMIN DU TOUR DU VILLAGE,
379274491,00016,37927449100016,O,1990-08-01,NN,,,,true,1,,,,,,10200,BAROVILLE,,,10032,,,,,,,,,,,,,,,,,,,1999-09-11,F,,,,,70.2B,NAF1993,N,,,0,,,,,,
379932684,00010,37993268400010,O,1990-11-12,NN,,,,false,3,,,,,,10200,BAROVILLE,,,10032,,,,,,,,,,,,,,,,,,,1995-08-31,F,,,,,01.1A,NAF1993,N,,,0,,,,,,
380099242,00014,38009924200014,O,1990-12-01,02,2018,,2020-08-25T10:17:01,true,4,,,,,,10200,BAROVILLE,,,10032,,,,,,,,,,,,,,,,,,,2013-12-31,A,,,,,01.21Z,NAFRev2,O,,,0,,,,,,
380311670,00018,38031167000018,O,1990-12-12,NN,,,,false,4,MR ET MME MARTIN DANIEL,,,,,10200,BAROVILLE,,,10032,,,,,,,,,,,,,,,,,,,1993-12-25,F,,,,,01.1G,NAF1993,N,,,0,,,,,,
380311670,00026,38031167000026,O,1993-03-08,NN,,,2018-09-07T11:46:01,true,4,MR & MME MARTIN-MILLON D.,,,RUE,DU TROU CHAILLOU,10200,BAROVILLE,,,10032,,,,,,,,,,,,,,,,,,,2018-05-01,F,,,,,01.21Z,NAFRev2,N,4.725168,48.19376,0.88,street,Rue du Trou Chaillon 10200 Baroville,10032_0320,G,RUE DU TROU CHAILLON,
380362699,00015,38036269900015,O,,NN,,,,true,1,,,,,,10200,BAROVILLE,,,10032,,,,,,,,,,,,,,,,,,,1994-09-30,F,,,,,01.1G,NAF1993,N,,,0,,,,,,
380394148,00015,38039414800015,O,1990-12-01,01,2018,,2020-08-25T10:17:22,true,4,,,,RUE,SAINTS PERES,10200,BAROVILLE,,,10032,,,,,,,,,,,,,,,,,,,2010-12-31,A,,,,,01.21Z,NAFRev2,O,4.723233,48.191099,0.88,street,Rue des Saints Pères 10200 Baroville,10032_0310,G,RUE DES SAINTS PERES,
380428649,00012,38042864900012,O,1990-12-01,NN,,,,true,3,,,,,,10200,BAROVILLE,,,10032,,,,,,,,,,,,,,,,,,,2000-11-30,F,,,,,70.2B,NAF1993,N,,,0,,,,,,
380710079,00019,38071007900019,O,1990-01-01,NN,,,2008-01-04T21:46:33,true,3,,,,,,10200,BAROVILLE,,,10032,,,,,,,,,,,,,,,,,,,2008-01-01,A,,,,,68.20B,NAFRev2,N,,,0,,,,,,
380711341,00012,38071134100012,O,,NN,,,,true,1,,,,,,10200,BAROVILLE,,,10032,,,,,,,,,,,,,,,,,,,1991-09-01,F,,,,,81.99,NAP,N,,,0,,,,,,
380711663,00019,38071166300019,O,1991-01-01,NN,,,,true,3,,,,,,10200,BAROVILLE,,,10032,,,,,,,,,,,,,,,,,,,2002-12-31,F,,,,,70.2B,NAF1993,N,,,0,,,,,,
380889485,00013,38088948500013,O,1991-01-01,NN,,,2006-10-28T00:38:41,true,3,,,,,,10200,BAROVILLE,,,10032,,,,,,,,,,,,,,,,,,,2006-03-31,F,,,,,70.2B,NAFRev1,N,,,0,,,,,,
380980367,00011,38098036700011,O,,,,,,true,1,,,,,,10200,BAROVILLE,,,10032,,,,,,,,,,,,,,,,,,,1997-01-09,F,,,,,70.2B,NAF1993,N,,,0,,,,,,
381034065,00015,38103406500015,O,1991-02-01,02,2018,,2020-08-25T10:18:04,true,4,,,,,LES FACHES,10200,BAROVILLE,,,10032,,,,,,,,,,,,,,,,,,,2010-12-31,A,,,,,01.21Z,NAFRev2,O,4.721322,48.193824,0.92,street,Les Basses Faches 10200 Baroville,10032_b011,G,LES BASSES FACHES,
381859792,00016,38185979200016,O,1991-04-30,NN,,,,true,1,,,,,,10200,BAROVILLE,,,10032,,,,,,,,,,,,,,,,,,,1999-08-30,F,,,,,01.1G,NAF1993,N,,,0,,,,,,
382205730,00015,38220573000015,O,1991-03-15,NN,,,2009-06-27T06:31:19,true,3,,,,,,10200,BAROVILLE,,,10032,,,,,,,,,,,,,,,,,,,2008-01-01,A,,,,,01.11Z,NAFRev2,N,,,0,,,,,,
382270072,00012,38227007200012,O,1991-05-01,NN,,,2018-02-06T03:53:05,true,4,,,,,,10200,BAROVILLE,,,10032,,,,,,,,,,,,,,,,,,,2008-01-01,A,,,,,01.21Z,NAFRev2,N,,,0,,,,,,
382729945,00016,38272994500016,O,1991-07-31,NN,,,2017-03-03T08:56:46,true,4,BAROVILLE,,,,COOPERATIVE DE BAROVILLE,10200,BAROVILLE,,,10032,,,,,,,,,,,,,,,,,,,2016-12-22,F,,,,,01.61Z,NAFRev2,N,,,0,,,,,,
383809860,00018,38380986000018,O,1991-12-01,NN,,,2008-01-04T22:29:36,true,3,,,,,,10200,BAROVILLE,,,10032,,,,,,,,,,,,,,,,,,,2008-01-01,A,,,,,68.20B,NAFRev2,N,,,0,,,,,,
383810173,00013,38381017300013,O,1991-12-04,03,2018,,2020-08-25T10:20:50,true,4,CHEZ MR ET MME URBAIN M.,,,,,10200,BAROVILLE,,,10032,,,,,,,,,,,,,,,,,,,2012-12-31,A,,,,,01.21Z,NAFRev2,O,,,0,,,,,,
383951068,00014,38395106800014,O,1991-12-16,NN,,,2018-09-29T12:12:57,false,4,,,,,,10200,BAROVILLE,,,10032,,,,,,,,,,,,,,,,,,,2012-12-31,A,,,,,01.11Z,NAFRev2,O,,,0,,,,,,
383951068,00022,38395106800022,O,1998-06-20,NN,,,2008-01-04T22:31:37,true,3,,,,,,10200,BAROVILLE,,,10032,,,,,,,,,,,,,,,,,,,2008-01-01,A,,,,,01.61Z,NAFRev2,N,,,0,,,,,,
384339768,00010,38433976800010,O,1992-01-01,NN,,,2017-05-04T02:49:03,true,3,,,,,,10200,BAROVILLE,,,10032,,,,,,,,,,,,,,,,,,,2008-01-01,A,,,,,01.21Z,NAFRev2,N,,,0,,,,,,
384341061,00016,38434106100016,O,,,,,2017-08-06T04:17:40,true,1,,,,,,10200,BAROVILLE,,,10032,,,,,,,,,,,,,,,,,,,1997-09-30,F,,,,,01.1G,NAF1993,N,,,0,,,,,,
384341368,00015,38434136800015,O,1992-01-01,NN,,,2016-04-26T02:22:51,true,3,,11,,RUE,DE COUVIGNON,10200,BAROVILLE,,,10032,,,,,,,,,,,,,,,,,,,2008-01-01,A,,,,,01.21Z,NAFRev2,N,4.719967,48.192902,0.93,housenumber,11 Rue de Couvignon 10200 Baroville,10032_b128_00011,G,11 RUE DE COUVIGNON,
384341368,00023,38434136800023,O,2014-02-25,,,,2014-10-08T04:45:21,false,1,,11,,RUE,DE COUVIGNON,10200,BAROVILLE,,,10032,,,,,,,,,,,,,,,,,,,2014-02-25,A,,,,,68.20B,NAFRev2,N,4.719967,48.192902,0.93,housenumber,11 Rue de Couvignon 10200 Baroville,10032_b128_00011,G,11 RUE DE COUVIGNON,
384798658,00017,38479865800017,O,1992-03-01,NN,,,2017-05-04T02:53:38,false,4,,,,,,10200,BAROVILLE,,,10032,,,,,,,,,,,,,,,,,,,2016-09-15,F,,,,,01.21Z,NAFRev2,N,,,0,,,,,,
385112719,00013,38511271900013,O,1992-02-19,NN,,,2006-10-28T01:11:30,true,3,,,,,,10200,BAROVILLE,,,10032,,,,,,,,,,,,,,,,,,,2005-11-30,F,,,,,70.2B,NAFRev1,N,,,0,,,,,,
388430365,00022,38843036500022,O,1993-10-01,NN,,,,false,3,,,,RTE,DE BAR SUR AUBE,10200,BAROVILLE,,,10032,,,,,,,,,,,,,,,,,,,1994-04-01,F,,,,,85.1G,NAF1993,N,4.721758,48.192625,0.8,street,Rue de Bar-sur-aube 10200 Baroville,10032_0200,G,RUE DE BAR SUR AUBE,
389092156,00014,38909215600014,O,1992-11-01,NN,,,2007-10-03T13:54:25,true,3,,,,,,10200,BAROVILLE,,,10032,,,,,,,,,,,,,,,,,,,2007-10-30,F,,,,,70.2B,NAFRev1,N,,,0,,,,,,
389092321,00014,38909232100014,O,1992-11-01,NN,,,2007-10-03T13:53:37,true,3,,,,,,10200,BAROVILLE,,,10032,,,,,,,,,,,,,,,,,,,2007-10-30,F,,,,,70.2B,NAFRev1,N,,,0,,,,,,
389092677,00019,38909267700019,O,1992-11-01,NN,,,2007-10-03T13:53:20,true,3,,,,,,10200,BAROVILLE,,,10032,,,,,,,,,,,,,,,,,,,2007-10-30,F,,,,,70.2B,NAFRev1,N,,,0,,,,,,
389107590,00017,38910759000017,O,1984-01-01,NN,,,2008-01-04T23:19:16,true,3,,,,,,10200,BAROVILLE,,,10032,,,,,,,,,,,,,,,,,,,2008-01-01,A,,,,,68.20B,NAFRev2,N,,,0,,,,,,
389532623,00011,38953262300011,O,1992-12-05,NN,,,2008-01-04T23:25:53,true,3,,,,,,10200,BAROVILLE,,,10032,,,,,,,,,,,,,,,,,,,2008-01-01,A,,,,,68.20B,NAFRev2,N,,,0,,,,,,
389682279,00010,38968227900010,O,1992-12-01,NN,,,2008-01-04T23:28:15,true,3,,,,,,10200,BAROVILLE,,,10032,,,,,,,,,,,,,,,,,,,2008-01-01,A,,,,,68.20B,NAFRev2,N,,,0,,,,,,
389682857,00013,38968285700013,O,1992-12-01,NN,,,2008-01-04T23:28:16,true,3,,,,,,10200,BAROVILLE,,,10032,,,,,,,,,,,,,,,,,,,2008-01-01,A,,,,,68.20B,NAFRev2,N,,,0,,,,,,
389979501,00019,38997950100019,O,1990-04-03,NN,,,2008-01-04T23:32:57,true,3,,,,,,10200,BAROVILLE,,,10032,,,,,,,,,,,,,,,,,,,2007-11-30,F,,,,,01.1G,NAFRev1,N,,,0,,,,,,
390404754,00017,39040475400017,O,1993-01-01,NN,,,,true,1,,,,,,10200,BAROVILLE,,,10032,,,,,,,,,,,,,,,,,,,2002-12-31,F,,,,,70.2B,NAF1993,N,,,0,,,,,,
390592798,00016,39059279800016,O,1993-03-08,NN,,,2020-01-30T09:10:24,false,3,,,,,,10200,BAROVILLE,,,10032,,,,,,,,,,,,,,,,,,,2003-03-08,F,,,,,01.1G,NAFRev1,N,,,0,,,,,,
390593044,00014,39059304400014,O,1993-03-08,NN,,,2018-10-03T07:27:31,true,4,,,,,,10200,BAROVILLE,,,10032,,,,,,,,,,,,,,,,,,,2018-11-01,A,,,,,01.21Z,NAFRev2,N,,,0,,,,,,
391157526,00016,39115752600016,O,1993-01-01,NN,,,2007-10-03T13:53:53,true,3,,,,,,10200,BAROVILLE,,,10032,,,,,,,,,,,,,,,,,,,2007-10-30,F,,,,,70.2B,NAFRev1,N,,,0,,,,,,
391466562,00017,39146656200017,O,1993-05-01,NN,,,2008-01-04T23:53:05,true,3,,,,,,10200,BAROVILLE,,,10032,,,,,,,,,,,,,,,,,,,2008-01-01,A,,,,,01.61Z,NAFRev2,N,,,0,,,,,,
391992500,00010,39199250000010,O,1993-07-26,NN,,,2014-12-11T13:55:55,true,3,MR & MME FOURRIER PH.,,,,LES FACHES,10200,BAROVILLE,,,10032,,,,,,,,,,,,,,,,,,,2008-01-01,A,,,,,01.21Z,NAFRev2,N,4.721322,48.193824,0.92,street,Les Basses Faches 10200 Baroville,10032_b011,G,LES BASSES FACHES,
392683462,00015,39268346200015,O,1993-09-04,NN,,,2013-06-06T03:21:42,true,4,,,,,,10200,BAROVILLE,,,10032,,,,,,,,,,,,,,,,,,,2012-12-31,F,,,,,01.11Z,NAFRev2,N,,,0,,,,,,
393023510,00018,39302351000018,O,1993-09-01,NN,,,,true,1,,,,,,10200,BAROVILLE,,,10032,,,,,,,,,,,,,,,,,,,2001-12-31,F,,,,,15.9F,NAF1993,N,,,0,,,,,,
393648548,00013,39364854800013,O,,NN,,,,true,1,,,,,,10200,BAROVILLE,,,10032,,,,,,,,,,,,,,,,,,,1997-12-31,F,,,,,01.1G,NAF1993,N,,,0,,,,,,
394075618,00014,39407561800014,O,1994-02-02,NN,,,2008-01-04T17:59:27,true,3,,,,,,10200,BAROVILLE,,,10032,,,,,,,,,,,,,,,,,,,2008-01-01,A,,,,,68.20B,NAFRev2,N,,,0,,,,,,
394133029,00014,39413302900014,O,1994-01-01,02,2018,,2020-08-25T10:28:51,true,4,,,,RTE,DE BAR SUR AUBE,10200,BAROVILLE,,,10032,,,,,,,,,,,,,,,,,,,2008-01-01,A,,,,,01.21Z,NAFRev2,O,4.721758,48.192625,0.8,street,Rue de Bar-sur-aube 10200 Baroville,10032_0200,G,RUE DE BAR SUR AUBE,
394395727,00016,39439572700016,O,1993-01-01,NN,,,2012-01-27T06:28:18,true,4,,,,,,10200,BAROVILLE,,,10032,,,,,,,,,,,,,,,,,,,2011-12-01,F,,,,,01.21Z,NAFRev2,N,,,0,,,,,,
394550743,00014,39455074300014,O,1994-04-05,NN,,,2017-01-24T10:49:24,true,4,,,,,,10200,BAROVILLE,,,10032,,,,,,,,,,,,,,,,,,,2016-12-31,F,,,,,01.21Z,NAFRev2,N,,,0,,,,,,
394579254,00019,39457925400019,O,1994-04-01,,,,2016-04-26T03:05:57,false,4,,,,,,10200,BAROVILLE,,,10032,,,,,,,,,,,,,,,,,,,2014-09-10,F,,,,,01.21Z,NAFRev2,N,,,0,,,,,,
394905376,00015,39490537600015,O,1994-01-01,NN,,,2008-01-04T18:16:05,true,3,,,,,,10200,BAROVILLE,,,10032,,,,,,,,,,,,,,,,,,,2008-01-01,A,,,,,68.20B,NAFRev2,N,,,0,,,,,,
399263763,00019,39926376300019,O,1994-12-05,NN,,,2006-10-28T02:41:13,true,3,,,,,,10200,BAROVILLE,,,10032,,,,,,,,,,,,,,,,,,,2004-12-05,F,,,,,70.2B,NAFRev1,N,,,0,,,,,,
399430701,00017,39943070100017,O,,NN,,,,true,1,,,,,,10200,BAROVILLE,,,10032,,,,,,,,,,,,,,,,,,,1993-12-31,F,,,,,74.8K,NAF1993,N,,,0,,,,,,
400430252,00017,40043025200017,O,1994-01-01,NN,,,2013-05-18T03:43:31,true,3,,,,,,10200,BAROVILLE,,,10032,,,,,,,,,,,,,,,,,,,2008-01-01,A,,,,,01.21Z,NAFRev2,N,,,0,,,,,,
400430518,00011,40043051800011,O,1994-01-01,NN,,,2013-05-22T04:57:49,true,3,,,,,,10200,BAROVILLE,,,10032,,,,,,,,,,,,,,,,,,,2008-01-01,A,,,,,01.21Z,NAFRev2,N,,,0,,,,,,
400710885,00015,40071088500015,O,1995-04-10,NN,,,2018-10-19T14:36:29,true,3,,,,RUE,PRINCIPALE,10200,BAROVILLE,,,10032,,,,,,,,,,,,,,,,,,,2008-01-01,A,,,,,68.20B,NAFRev2,N,2.061661,50.820766,0.9,poi,Rue Principale (Pont) Zouafques,https://osm.org/way/111379934,G,,
401150073,00013,40115007300013,O,1995-04-01,NN,,,2011-03-03T17:14:18,true,3,,,,,,10200,BAROVILLE,,,10032,,,,,,,,,,,,,,,,,,,2008-01-01,A,,,,,01.21Z,NAFRev2,N,,,0,,,,,,
402885271,00013,40288527100013,O,1983-01-01,NN,,,2006-10-28T03:10:26,true,3,,,,,,10200,BAROVILLE,,,10032,,,,,,,,,,,,,,,,,,,2006-03-31,F,,,,,70.2B,NAFRev1,N,,,0,,,,,,
403409261,00019,40340926100019,O,1995-12-01,NN,,,2012-01-22T05:22:51,true,3,,,,,,10200,BAROVILLE,,,10032,,,,,,,,,,,,,,,,,,,2008-01-01,A,,,,,01.21Z,NAFRev2,N,,,0,,,,,,
403739899,00017,40373989900017,O,1995-11-23,NN,,,,true,3,,,,,,10200,BAROVILLE,,,10032,,,,,,,,,,,,,,,,,,,2000-12-01,F,,,,,70.2B,NAF1993,N,,,0,,,,,,
404425308,00016,40442530800016,O,1996-03-01,00,2017,,2019-06-24T13:26:29,false,5,,,,,TROUCHAILLOU,10200,BAROVILLE,,,10032,,,,,,,,,,,,,,,,,,,2017-10-31,F,,,,,01.21Z,NAFRev2,O,,,0,,,,,,
404425308,00024,40442530800024,O,2017-10-31,00,2018,,2020-08-25T10:36:14,true,1,,4,,RUE,DE COUVIGNON,10200,BAROVILLE,,,10032,,,,,,,,,,,,,,,,,,,2017-10-31,A,,,,,01.21Z,NAFRev2,N,4.721001,48.192975,0.93,housenumber,4 Rue de Couvignon 10200 Baroville,10032_b128_00004,G,4 RUE DE COUVIGNON,
404708539,00014,40470853900014,O,1996-04-01,02,2018,,2020-08-25T10:36:23,true,4,,,,,,10200,BAROVILLE,,,10032,,,,,,,,,,,,,,,,,,,2008-01-01,A,,,,,01.21Z,NAFRev2,O,,,0,,,,,,