siren,nic,siret,statutDiffusionEtablissement,dateCreationEtablissement,trancheEffectifsEtablissement,anneeEffectifsEtablissement,activitePrincipaleRegistreMetiersEtablissement,dateDernierTraitementEtablissement,etablissementSiege,nombrePeriodesEtablissement,complementAdresseEtablissement,numeroVoieEtablissement,indiceRepetitionEtablissement,typeVoieEtablissement,libelleVoieEtablissement,codePostalEtablissement,libelleCommuneEtablissement,libelleCommuneEtrangerEtablissement,distributionSpecialeEtablissement,codeCommuneEtablissement,codeCedexEtablissement,libelleCedexEtablissement,codePaysEtrangerEtablissement,libellePaysEtrangerEtablissement,complementAdresse2Etablissement,numeroVoie2Etablissement,indiceRepetition2Etablissement,typeVoie2Etablissement,libelleVoie2Etablissement,codePostal2Etablissement,libelleCommune2Etablissement,libelleCommuneEtranger2Etablissement,distributionSpeciale2Etablissement,codeCommune2Etablissement,codeCedex2Etablissement,libelleCedex2Etablissement,codePaysEtranger2Etablissement,libellePaysEtranger2Etablissement,dateDebut,etatAdministratifEtablissement,enseigne1Etablissement,enseigne2Etablissement,enseigne3Etablissement,denominationUsuelleEtablissement,activitePrincipaleEtablissement,nomenclatureActivitePrincipaleEtablissement,caractereEmployeurEtablissement,longitude,latitude,geo_score,geo_type,geo_adresse,geo_id,geo_ligne,geo_l4,geo_l5
212703045,00014,21270304500014,O,1983-03-01,02,2018,,2020-08-25T10:16:29,true,4,,15,,RUE,DE L'EGLISE,27720,GUERNY,,,27304,,,,,,,,,,,,,,,,,,,2008-01-01,A,MAIRIE,,,,84.11Z,NAFRev2,O,1.678576,49.221802,0.93,housenumber,15 Rue de l'Eglise 27720 Guerny,27304_0030_00015,G,15 RUE DE L EGLISE,
212703045,00030,21270304500030,O,1999-12-25,NN,,,2008-01-04T18:29:41,false,2,MAIRIE,15,,RUE,DE L'EGLISE,27720,GUERNY,,,27304,,,,,,,,,,,,,,,,,,,2008-01-01,A,SERVICE D'EAU,,,,36.00Z,NAFRev2,N,1.678576,49.221802,0.93,housenumber,15 Rue de l'Eglise 27720 Guerny,27304_0030_00015,G,15 RUE DE L EGLISE,
212703045,00048,21270304500048,O,1993-09-01,NN,,,2015-05-14T03:33:07,false,4,,37,,RUE,DES SORBIERS,27720,GUERNY,,,27304,,,,,,,,,,,,,,,,,,,2008-01-01,A,ECOLE ELEMENTAIRE PUBLIQUE,,,,85.20Z,NAFRev2,N,1.691234,49.225972,0.93,housenumber,37 Rue des Sorbiers 27720 Guerny,27304_0050_00037,G,37 RUE DES SORBIERS,
252701131,00010,25270113100010,O,,NN,,,,true,1,,,,,,27720,GUERNY,,,27304,,,,,,,,,,,,,,,,,,,1993-12-31,F,,,,,41.0Z,NAF1993,N,,,0,,,,,,
262707359,00010,26270735900010,O,1995-12-25,,,,2010-06-26T03:07:25,true,2,MAIRIE,15,,RUE,DE L EGLISE,27720,GUERNY,,,27304,,,,,,,,,,,,,,,,,,,2008-01-01,A,CCAS,,,,88.99B,NAFRev2,N,1.678576,49.221802,0.93,housenumber,15 Rue de l'Eglise 27720 Guerny,27304_0030_00015,G,15 RUE DE L EGLISE,
309109247,00010,30910924700010,O,1993-12-31,,,4399CZ,2016-04-26T01:56:30,true,4,,,,,,27720,GUERNY,,,27304,,,,,,,,,,,,,,,,,,,2014-07-31,F,,,,,43.99C,NAFRev2,O,,,0,,,,,,
316345479,00018,31634547900018,O,,NN,,,,true,1,,31,,RTE,DE PARIS,27720,GUERNY,,,27304,,,,,,,,,,,,,,,,,,,,F,,,,,01.00,NAP,N,1.672815,49.205228,0.82,housenumber,31 Route de Paris 27720 Guerny,27304_0156_00031,G,31 ROUTE DE PARIS,
318153541,00038,31815354100038,O,2000-04-01,NN,,,2013-02-26T13:47:40,true,3,GISANCOURT,1,,IMP,DU VIEUX MANOIR,27720,GUERNY,,,27304,,,,,,,,,,,,,,,,,,,2008-01-01,A,,,,,90.03B,NAFRev2,N,1.695289,49.228044,0.85,housenumber,1 Impasse du Vieux Manoir 27720 Guerny,27304_0001_00001,G,1 IMPASSE DU VIEUX MANOIR,
318153541,00046,31815354100046,O,2012-01-01,,,,2013-03-06T00:10:10,false,2,,1,,IMP,DU VIEUX MANOIR,27720,GUERNY,,,27304,,,,,,,,,,,,,,,,,,,2012-02-07,F,,,,,43.34Z,NAFRev2,N,1.695289,49.228044,0.85,housenumber,1 Impasse du Vieux Manoir 27720 Guerny,27304_0001_00001,G,1 IMPASSE DU VIEUX MANOIR,
324349794,00010,32434979400010,O,,NN,,,,true,1,,,,,,27720,GUERNY,,,27304,,,,,,,,,,,,,,,,,,,,F,,,,,78.02,NAP,N,,,0,,,,,,
324515576,00027,32451557600027,O,,NN,,,,true,1,,5,,RUE,DES SORBIERS,27720,GUERNY,,,27304,,,,,,,,,,,,,,,,,,,1989-06-30,F,,,,,64.49,NAP,N,1.694279,49.228897,0.93,housenumber,5 Rue des Sorbiers 27720 Guerny,27304_0050_00005,G,5 RUE DES SORBIERS,
328000864,00012,32800086400012,O,,,,,,true,1,,,,RUE,DE LA FONTAINE ST LEGER,27720,GUERNY,,,27304,,,,,,,,,,,,,,,,,,,1985-12-25,F,,,,,60.10,NAP,N,-1.7266378,47.1343594,0.81,poi,Rue de la Fontaine (Pont) Saint-Léger-les-Vignes,https://osm.org/way/42279580,G,,
328720149,00025,32872014900025,O,,NN,,,,true,1,,31,,RUE,DE PARIS,27720,GUERNY,,,27304,,,,,,,,,,,,,,,,,,,1992-09-01,F,,,,,50.2Z,NAF1993,N,1.672815,49.205228,0.76,housenumber,31 Route de Paris 27720 Guerny,27304_0156_00031,G,31 ROUTE DE PARIS,
333292399,00032,33329239900032,O,1999-02-15,NN,,,2006-11-25T10:22:24,true,3,,,,,MAISON DU PETIT CLOS,27720,GUERNY,,,27304,,,,,,,,,,,,,,,,,,,2005-06-30,F,,,,,52.6E,NAFRev1,N,1.9053975,47.609743,0.75,poi.guest_house,Le Petit Clos (Maison d'hôte) Chaumont-sur-Tharonne,https://osm.org/way/172302089,G,,
341462133,00032,34146213300032,O,2014-01-01,,,,2018-04-27T11:01:50,false,1,GISANCOURT,1,,IMP,DU MANOIR,27720,GUERNY,,,27304,,,,,,,,,,,,,,,,,,,2014-01-01,A,,,,,68.20A,NAFRev2,N,1.695289,49.228044,0.75,housenumber,1 Impasse du Vieux Manoir 27720 Guerny,27304_0001_00001,G,1 IMPASSE DU VIEUX MANOIR,
341462133,00040,34146213300040,O,2018-04-01,,,4334ZC,2018-10-01T12:09:36,true,1,,1,,IMP,DU MANOIR,27720,GUERNY,,,27304,,,,,,,,,,,,,,,,,,,2018-04-01,A,LAVOIR SELF,,,MATHEY SERVICE,43.22A,NAFRev2,N,1.695289,49.228044,0.75,housenumber,1 Impasse du Vieux Manoir 27720 Guerny,27304_0001_00001,G,1 IMPASSE DU VIEUX MANOIR,
343163101,00045,34316310100045,O,1992-04-27,NN,,,2006-11-25T10:47:26,true,1,,31,,RUE,DES SORBIERS,27720,GUERNY,,,27304,,,,,,,,,,,,,,,,,,,2001-04-28,F,,,,,74.1J,NAF1993,N,1.692217,49.226195,0.93,housenumber,31 Rue des Sorbiers 27720 Guerny,27304_0050_00031,G,31 RUE DES SORBIERS,
349016279,00029,34901627900029,O,2018-04-01,,,,2019-03-19T19:33:49,true,2,,31,,RTE,DE PARIS,27720,GUERNY,,,27304,,,,,,,,,,,,,,,,,,,2018-12-31,F,,,,,45.32Z,NAFRev2,N,1.672815,49.205228,0.82,housenumber,31 Route de Paris 27720 Guerny,27304_0156_00031,G,31 ROUTE DE PARIS,
350509360,00011,35050936000011,O,,NN,,,,true,1,,8,,RUE,DE LA FONTAINE ST LEGER,27720,GUERNY,,,27304,,,,,,,,,,,,,,,,,,,1990-02-27,F,,,,,55.72,NAP,N,-1.7266378,47.1343594,0.81,poi,Rue de la Fontaine (Pont) Saint-Léger-les-Vignes,https://osm.org/way/42279580,G,,
350621165,00017,35062116500017,O,,NN,,,2006-11-25T11:06:27,true,1,,8,,RUE,DE LA FONTAINE SAINT LEGER,27720,GUERNY,,,27304,,,,,,,,,,,,,,,,,,,1990-02-27,F,,,,,55.72,NAP,N,1.691734,49.227022,0.75,housenumber,8 Rue Fontaine Saint Leger 27720 Guerny,27304_0020_00008,G,8 RUE FONTAINE SAINT LEGER,
382363588,00015,38236358800015,O,1991-05-17,NN,,,2008-01-04T22:08:56,true,3,GISANCOURT,31,,RUE,DES SORBIERS,27720,GUERNY,,,27304,,,,,,,,,,,,,,,,,,,2008-01-01,A,,,,,68.20A,NAFRev2,N,1.692217,49.226195,0.93,housenumber,31 Rue des Sorbiers 27720 Guerny,27304_0050_00031,G,31 RUE DES SORBIERS,
383777588,00013,38377758800013,O,1991-08-20,NN,,,2012-04-08T05:24:15,true,4,HAMEAU DE GISANCOURT,,,IMP,DU VIEUX MOULIN,27720,GUERNY,,,27304,,,,,,,,,,,,,,,,,,,2012-01-03,F,,,,,68.20B,NAFRev2,N,6.6118444,46.4004555,0.81,poi.footway,Impasse du Vieux Moulin (Chemin piéton) Évian-les-Bains,https://osm.org/way/172914676,G,,
391046380,00039,39104638000039,O,1996-06-01,NN,,4932ZA,2015-03-17T00:39:07,true,5,GISANCOURT,35,,RUE,DES SORBIERS,27720,GUERNY,,,27304,,,,,,,,,,,,,,,,,,,2010-06-18,A,,,,,49.32Z,NAFRev2,N,1.69209,49.226132,0.93,housenumber,35 Rue des Sorbiers 27720 Guerny,27304_0050_00035,G,35 RUE DES SORBIERS,
392700043,00012,39270004300012,O,1993-10-01,01,2018,,2020-08-25T10:27:32,true,3,,,,,,27720,GUERNY,,,27304,,,,,,,,,,,,,,,,,,,2008-01-01,A,,,,,01.50Z,NAFRev2,N,,,0,,,,,,
394285118,00011,39428511800011,O,1989-01-01,NN,,,2008-01-04T18:03:38,true,3,,28,,RTE,DE LA VALLEE,27720,GUERNY,,,27304,,,,,,,,,,,,,,,,,,,2008-01-01,A,,,,,01.11Z,NAFRev2,N,1.681195,49.22116,0.8,housenumber,28 Rue de la Vallée 27720 Guerny,27304_0180_00028,G,28 RUE DE LA VALLEE,
394507321,00013,39450732100013,O,1994-04-05,,,,2008-11-08T01:00:05,false,5,GISANCOURT,18,,RUE,DE LA FONTAINE ST LEGER,27720,GUERNY,,,27304,,,,,,,,,,,,,,,,,,,2000-08-01,F,MENUIS'ARTI,,,,45.4C,NAF1993,N,-1.7266378,47.1343594,0.81,poi,Rue de la Fontaine (Pont) Saint-Léger-les-Vignes,https://osm.org/way/42279580,G,,
394719629,00013,39471962900013,O,1994-04-01,,,,2008-01-04T18:12:12,true,4,HAMEAU DE GISANCOURT,31,,RUE,DES SORBIERS,27720,GUERNY,,,27304,,,,,,,,,,,,,,,,,,,2008-01-01,A,,,,,71.12B,NAFRev2,N,1.692217,49.226195,0.93,housenumber,31 Rue des Sorbiers 27720 Guerny,27304_0050_00031,G,31 RUE DES SORBIERS,
395023591,00021,39502359100021,O,1999-01-01,00,2018,,2020-08-25T10:29:36,false,5,,31,,RTE,DE PARIS,27720,GUERNY,,,27304,,,,,,,,,,,,,,,,,,,2018-04-01,F,GARAGE SAINT CLAIR,,,,45.11Z,NAFRev2,O,1.672815,49.205228,0.82,housenumber,31 Route de Paris 27720 Guerny,27304_0156_00031,G,31 ROUTE DE PARIS,
401106323,00017,40110632300017,O,1995-05-01,NN,,,2006-11-25T14:43:18,false,3,CHEZ MR CARDET,12,,RUE,FONTAINE SAINT LEGER,27720,GUERNY,,,27304,,,,,,,,,,,,,,,,,,,2006-09-16,F,,,,,92.6C,NAFRev1,N,1.692269,49.227791,0.93,housenumber,12 Rue Fontaine Saint Leger 27720 Guerny,27304_0020_00012,G,12 RUE FONTAINE SAINT LEGER,
402156004,00010,40215600400010,O,1991-01-01,NN,,,2006-11-25T14:55:16,true,1,,25,,RUE,DES SORBIERS,27720,GUERNY,,,27304,,,,,,,,,,,,,,,,,,,1999-11-02,F,,,,,51.1T,NAF1993,N,1.692874,49.226588,0.93,housenumber,25 Rue des Sorbiers 27720 Guerny,27304_0050_00025,G,25 RUE DES SORBIERS,
403139769,00042,40313976900042,O,2008-04-15,,,,2011-10-25T19:27:59,true,3,,,,,MOULIN ROUGE RD 146,27720,GUERNY,,,27304,,,,,,,,,,,,,,,,,,,2008-08-31,F,MXP RACING,,,,45.40Z,NAFRev2,N,,,0,,,,,,
404664351,00016,40466435100016,O,,NN,,,,true,1,,,,,,27720,GUERNY,,,27304,,,,,,,,,,,,,,,,,,,1997-12-31,F,,,,,01.1A,NAF1993,N,,,0,,,,,,
404664369,00018,40466436900018,O,,NN,,,,true,1,,,,,,27720,GUERNY,,,27304,,,,,,,,,,,,,,,,,,,1997-12-23,F,,,,,01.1A,NAF1993,N,,,0,,,,,,
410358790,00021,41035879000021,O,2005-07-02,,,,2008-01-04T21:42:06,true,2,& 12,10,,CHE,DE L'EPTE,27720,GUERNY,,,27304,,,,,,,,,,,,,,,,,,,2008-01-01,A,,,,,64.20Z,NAFRev2,N,1.680485,49.220428,0.82,housenumber,10 Chemin de l'Epte 27720 Guerny,27304_0033_00010,G,10 CHEMIN DE L EPTE,
415026210,00013,41502621000013,O,1997-12-23,01,2018,,2020-08-25T10:42:32,true,4,,,,,,27720,GUERNY,,,27304,,,,,,,,,,,,,,,,,,,2009-12-31,A,,,,,01.11Z,NAFRev2,O,,,0,,,,,,
418753539,00018,41875353900018,O,1997-04-11,NN,,,2008-01-04T23:26:11,true,3,,31,,RUE,DES SORBIERS,27720,GUERNY,,,27304,,,,,,,,,,,,,,,,,,,2008-01-01,A,,,,,94.99Z,NAFRev2,N,1.692217,49.226195,0.93,housenumber,31 Rue des Sorbiers 27720 Guerny,27304_0050_00031,G,31 RUE DES SORBIERS,
418755930,00017,41875593000017,O,1997-01-01,NN,,,2006-11-25T15:59:40,false,3,,2,,IMP,DU VIEUX MANOIR,27720,GUERNY,,,27304,,,,,,,,,,,,,,,,,,,2004-11-01,F,,,,,92.3A,NAFRev1,N,1.696424,49.22786,0.85,housenumber,2 Impasse du Vieux Manoir 27720 Guerny,27304_0001_00002,G,2 IMPASSE DU VIEUX MANOIR,
433137403,00013,43313740300013,O,2000-08-30,,,,2006-11-25T17:07:51,true,1,,31,,RUE,SORBIERS,27720,GUERNY,,,27304,,,,,,,,,,,,,,,,,,,2000-08-30,F,,,,,74.1J,NAF1993,N,1.692217,49.226195,0.87,housenumber,31 Rue des Sorbiers 27720 Guerny,27304_0050_00031,G,31 RUE DES SORBIERS,
438091068,00025,43809106800025,O,2003-10-01,NN,,2822ZB,2015-03-17T01:04:35,true,3,GISANCOURT,13,,RUE,DE LA FONTAINE SAINT LEGER,27720,GUERNY,,,27304,,,,,,,,,,,,,,,,,,,2008-01-01,A,,,,,28.22Z,NAFRev2,N,1.69246,49.227984,0.76,housenumber,13 Rue Fontaine Saint Leger 27720 Guerny,27304_0020_00013,G,13 RUE FONTAINE SAINT LEGER,
441491461,00014,44149146100014,O,2002-04-04,NN,,,2017-05-04T04:51:51,false,4,,18,,RUE,DE L'EGLISE,27720,GUERNY,,,27304,,,,,,,,,,,,,,,,,,,2016-09-16,F,,,,,90.01Z,NAFRev2,O,1.677913,49.222298,0.93,housenumber,18 Rue de l'Eglise 27720 Guerny,27304_0030_00018,G,18 RUE DE L EGLISE,
441491461,00022,44149146100022,O,2016-09-16,02,2018,,2020-08-25T10:28:47,false,2,,15,,RUE,DE L EGLISE,27720,GUERNY,,,27304,,,,,,,,,,,,,,,,,,,2019-01-19,F,,,,,90.01Z,NAFRev2,O,1.678576,49.221802,0.93,housenumber,15 Rue de l'Eglise 27720 Guerny,27304_0030_00015,G,15 RUE DE L EGLISE,
441913670,00010,44191367000010,O,2002-05-06,NN,,,2019-06-04T04:10:43,true,3,,4,,RUE,DE L'EGLISE,27720,GUERNY,,,27304,,,,,,,,,,,,,,,,,,,2008-01-01,A,,,,,68.20A,NAFRev2,N,1.679877,49.220922,0.93,housenumber,4 Rue de l'Eglise 27720 Guerny,27304_0030_00004,G,4 RUE DE L EGLISE,
442013140,00029,44201314000029,O,2003-04-01,NN,,,2008-09-09T20:17:00,false,4,,1,,RUE,DE L EGLISE,27720,GUERNY,,,27304,,,,,,,,,,,,,,,,,,,2008-07-01,F,LA FERME DE GUERNY,,,,47.81Z,NAFRev2,N,1.680092,49.220635,0.93,housenumber,1 Rue de l'Eglise 27720 Guerny,27304_0030_00001,G,1 RUE DE L EGLISE,
449686583,00039,44968658300039,O,2009-02-01,,,,2010-02-11T11:24:57,false,2,HAMEAU DE GISANCOURT,3,,IMP,DU VIEUX MANOIR,27720,GUERNY,,,27304,,,,,,,,,,,,,,,,,,,2009-11-01,F,,,,,70.22Z,NAFRev2,N,1.696201,49.22784,0.85,housenumber,3 Impasse du Vieux Manoir 27720 Guerny,27304_0001_00003,G,3 IMPASSE DU VIEUX MANOIR,
478514284,00015,47851428400015,O,2004-08-25,NN,,,2008-01-05T03:44:16,false,3,,1,,RUE,DE L EGLISE,27720,GUERNY,,,27304,,,,,,,,,,,,,,,,,,,2008-01-01,A,,,,,68.20B,NAFRev2,N,1.680092,49.220635,0.93,housenumber,1 Rue de l'Eglise 27720 Guerny,27304_0030_00001,G,1 RUE DE L EGLISE,
483847125,00018,48384712500018,O,2005-09-01,NN,,,2014-07-10T00:15:02,true,4,,31,,RTE,DE PARIS,27720,GUERNY,,,27304,,,,,,,,,,,,,,,,,,,2009-01-31,F,,,,,45.11Z,NAFRev2,O,1.672815,49.205228,0.82,housenumber,31 Route de Paris 27720 Guerny,27304_0156_00031,G,31 ROUTE DE PARIS,
488982851,00013,48898285100013,O,2006-04-01,,,,2013-06-04T19:25:30,true,3,,4,,RUE,DE L'EGLISE,27720,GUERNY,,,27304,,,,,,,,,,,,,,,,,,,2013-05-31,F,,,,,77.34Z,NAFRev2,N,1.679877,49.220922,0.93,housenumber,4 Rue de l'Eglise 27720 Guerny,27304_0030_00004,G,4 RUE DE L EGLISE,
498888221,00013,49888822100013,O,2007-05-02,,,,2008-01-05T01:06:12,true,2,HAMEAU DE GISANCOURT,8,,RUE,DES SORBIERS,27720,GUERNY,,,27304,,,,,,,,,,,,,,,,,,,2008-01-01,A,,,,,68.32B,NAFRev2,N,1.694738,49.228208,0.93,housenumber,8 Rue des Sorbiers 27720 Guerny,27304_0050_00008,G,8 RUE DES SORBIERS,
520285628,00019,52028562800019,O,2010-02-08,,,,2019-09-11T03:37:08,true,3,GISANCOURT,25,,RUE,DES SORBIERS,27720,GUERNY,,,27304,,,,,,,,,,,,,,,,,,,2019-09-30,A,,,,,18.13Z,NAFRev2,N,1.692874,49.226588,0.93,housenumber,25 Rue des Sorbiers 27720 Guerny,27304_0050_00025,G,25 RUE DES SORBIERS,
522950591,00019,52295059100019,O,2010-01-01,,,,2012-09-19T04:54:43,true,2,HAMEAU DE GISANCOURT,21,,RUE,DES SORBIERS,27720,GUERNY,,,27304,,,,,,,,,,,,,,,,,,,2012-09-01,F,ELEVAGE DE LA DIVINE IDYLLE,,,,01.49Z,NAFRev2,N,1.69386,49.226963,0.93,housenumber,21 Rue des Sorbiers 27720 Guerny,27304_0050_00021,G,21 RUE DES SORBIERS,
533475083,00010,53347508300010,O,2011-06-09,,,,2015-11-12T13:03:49,true,3,,3,,IMP,IMPASSE DU VIEUX MANOIR,27720,GUERNY,,,27304,,,,,,,,,,,,,,,,,,,2015-11-05,A,,,,,63.99Z,NAFRev2,N,1.696201,49.22784,0.87,housenumber,3 Impasse du Vieux Manoir 27720 Guerny,27304_0001_00003,G,3 IMPASSE DU VIEUX MANOIR,
534515390,00019,53451539000019,O,2011-08-01,NN,,7410ZP,2019-08-02T04:07:12,true,6,,2,,IMP,DU VIEUX MANOIR,27720,GUERNY,,,27304,,,,,,,,,,,,,,,,,,,2017-12-27,A,,,,,74.90B,NAFRev2,N,1.696424,49.22786,0.85,housenumber,2 Impasse du Vieux Manoir 27720 Guerny,27304_0001_00002,G,2 IMPASSE DU VIEUX MANOIR,
552049447,29690,55204944729690,O,1986-06-23,NN,,,,false,4,,,,LD,EMPRISE SNCF,27720,GUERNY,,,27304,,,,,,,,,,,,,,,,,,,1993-07-01,F,ROUEN     SECTION D EVREUX,,,,60.1Z,NAF1993,N,,,0,,,,,,
780817383,00018,78081738300018,O,,,,,,true,1,,,,,,27720,GUERNY,,,27304,,,,,,,,,,,,,,,,,,,,F,,,,,45.23,NAP,N,,,0,,,,,,
811022755,00011,81102275500011,O,2015-03-30,,,,2015-04-24T04:45:59,true,1,,,,LD,LES BORDEAUX,27720,GUERNY,,,27304,,,,,,,,,,,,,,,,,,,2015-03-30,A,,,,,68.20B,NAFRev2,N,-0.5632471,44.8341074,0.89,poi.bar,Les runes (Bar) Bordeaux,https://osm.org/node/3396563166,G,,
814318580,00028,81431858000028,O,2015-12-16,,,,2017-08-18T03:23:57,true,2,HAMEAU DE GISANCOURT,11,,RUE,FONTAINE SAINT LEGER,27720,GUERNY,,,27304,,,,,,,,,,,,,,,,,,,2016-10-07,F,,,,,68.31Z,NAFRev2,N,1.692061,49.227588,0.93,housenumber,11 Rue Fontaine Saint Leger 27720 Guerny,27304_0020_00011,G,11 RUE FONTAINE SAINT LEGER,
815004841,00012,81500484100012,O,2015-12-01,,,,2017-06-16T11:25:40,true,2,,32,,RUE,DES SORBIERS,27720,GUERNY,,,27304,,,,,,,,,,,,,,,,,,,2016-12-19,F,,,,,68.31Z,NAFRev2,N,1.691391,49.226069,0.93,housenumber,32 Rue des Sorbiers 27720 Guerny,27304_0050_00032,G,32 RUE DES SORBIERS,
823014402,00015,82301440200015,O,2016-10-01,,,,2016-10-11T03:57:55,true,1,,6,,RUE,DE L'EGLISE,27720,GUERNY,,,27304,,,,,,,,,,,,,,,,,,,2016-10-01,A,,,,,68.20A,NAFRev2,N,1.679504,49.221208,0.93,housenumber,6 Rue de l'Eglise 27720 Guerny,27304_0030_00006,G,6 RUE DE L EGLISE,
824346613,00014,82434661300014,O,2016-12-12,,,,2016-12-22T19:28:27,true,1,,2,,IMP,DU VIEUX MANOIR,27720,GUERNY,,,27304,,,,,,,,,,,,,,,,,,,2016-12-12,A,,,,,63.11Z,NAFRev2,N,1.696424,49.22786,0.85,housenumber,2 Impasse du Vieux Manoir 27720 Guerny,27304_0001_00002,G,2 IMPASSE DU VIEUX MANOIR,
827665191,00017,82766519100017,O,2017-02-11,,,4321AB,2019-07-13T03:43:05,true,2,HAMEAU DE GISANCOURT,17,,RUE,FONTAINE SAINT LEGER,27720,GUERNY,,,27304,,,,,,,,,,,,,,,,,,,2017-08-20,A,,,,HELTECH,43.21A,NAFRev2,O,1.693007,49.228789,0.93,housenumber,17 Rue Fontaine Saint Leger 27720 Guerny,27304_0020_00017,G,17 RUE FONTAINE SAINT LEGER,
837617299,00016,83761729900016,O,2018-02-01,,,,2018-11-07T13:59:22,false,1,,1,,RUE,DE L'EGLISE,27720,GUERNY,,,27304,,,,,,,,,,,,,,,,,,,2018-02-01,A,,,,,68.20A,NAFRev2,N,1.680092,49.220635,0.93,housenumber,1 Rue de l'Eglise 27720 Guerny,27304_0030_00001,G,1 RUE DE L EGLISE,
837921238,00015,83792123800015,O,2018-03-01,,,,2018-03-06T03:58:22,true,1,,13,,RUE,DE L'EGLISE,27720,GUERNY,,,27304,,,,,,,,,,,,,,,,,,,2018-03-01,A,,,,,01.11Z,NAFRev2,N,1.678828,49.221614,0.93,housenumber,13 Rue de l'Eglise 27720 Guerny,27304_0030_00013,G,13 RUE DE L EGLISE,
839536992,00010,83953699200010,O,2018-04-24,01,2018,1610BZ,2020-08-25T11:41:27,true,2,LE HAMEAU DE GISANCOURT,7,,RUE,DE LA FONTAINE SAINT LEGER,27720,GUERNY,,,27304,,,,,,,,,,,,,,,,,,,2018-07-01,A,,,,,16.10B,NAFRev2,O,1.69178,49.227096,0.75,housenumber,7 Rue Fontaine Saint Leger 27720 Guerny,27304_0020_00007,G,7 RUE FONTAINE SAINT LEGER,
848705547,00018,84870554700018,O,2019-02-11,,,,2019-10-03T03:37:02,true,1,,4,B,IMP,DU VIEUX MANOIR,27720,GUERNY,,,27304,,,,,,,,,,,,,,,,,,,2019-02-11,A,,,,,68.20B,NAFRev2,N,1.695696,49.228056,0.74,housenumber,4 bis Impasse du Vieux Manoir 27720 Guerny,27304_0001_00004_bis,G,4 BIS IMPASSE DU VIEUX MANOIR,
853033397,00011,85303339700011,O,2019-08-02,,,4932ZB,2020-07-24T04:00:43,true,2,,,,RUE,DE LA VALLEE,27720,GUERNY,,,27304,,,,,,,,,,,,,,,,,,,2020-07-01,A,,,,WATTSATTITUDE,47.91B,NAFRev2,O,1.68112,49.22091,0.93,street,Rue de la Vallée 27720 Guerny,27304_0180,G,RUE DE LA VALLEE,
950617704,00099,95061770400099,O,2019-10-10,,,9602AB,2019-10-11T10:06:43,true,1,,1,,IMP,DU VIEUX MANOIR,27720,GUERNY,,,27304,,,,,,,,,,,,,,,,,,,2019-10-10,A,,,,CISEAUX2MAINS,96.02A,NAFRev2,N,1.695289,49.228044,0.85,housenumber,1 Impasse du Vieux Manoir 27720 Guerny,27304_0001_00001,G,1 IMPASSE DU VIEUX MANOIR,
