siren,nic,siret,statutDiffusionEtablissement,dateCreationEtablissement,trancheEffectifsEtablissement,anneeEffectifsEtablissement,activitePrincipaleRegistreMetiersEtablissement,dateDernierTraitementEtablissement,etablissementSiege,nombrePeriodesEtablissement,complementAdresseEtablissement,numeroVoieEtablissement,indiceRepetitionEtablissement,typeVoieEtablissement,libelleVoieEtablissement,codePostalEtablissement,libelleCommuneEtablissement,libelleCommuneEtrangerEtablissement,distributionSpecialeEtablissement,codeCommuneEtablissement,codeCedexEtablissement,libelleCedexEtablissement,codePaysEtrangerEtablissement,libellePaysEtrangerEtablissement,complementAdresse2Etablissement,numeroVoie2Etablissement,indiceRepetition2Etablissement,typeVoie2Etablissement,libelleVoie2Etablissement,codePostal2Etablissement,libelleCommune2Etablissement,libelleCommuneEtranger2Etablissement,distributionSpeciale2Etablissement,codeCommune2Etablissement,codeCedex2Etablissement,libelleCedex2Etablissement,codePaysEtranger2Etablissement,libellePaysEtranger2Etablissement,dateDebut,etatAdministratifEtablissement,enseigne1Etablissement,enseigne2Etablissement,enseigne3Etablissement,denominationUsuelleEtablissement,activitePrincipaleEtablissement,nomenclatureActivitePrincipaleEtablissement,caractereEmployeurEtablissement,longitude,latitude,geo_score,geo_type,geo_adresse,geo_id,geo_ligne,geo_l4,geo_l5
185703048,00016,18570304800016,O,1985-10-28,,,,2008-01-04T18:18:29,true,3,,,,,,57970,INGLANGE,,,57345,,,,,,,,,,,,,,,,,,,2008-01-01,A,,,,,94.91Z,NAFRev2,N,,,0,,,,,,
215703455,00018,21570345500018,O,1983-03-01,01,2018,,2020-08-25T10:17:53,true,4,,54,,RUE,DU CALVAIRE,57970,INGLANGE,,,57345,,,,,,,,,,,,,,,,,,,2008-01-01,A,MAIRIE,,,,84.11Z,NAFRev2,O,6.298825,49.347157,0.93,housenumber,54 Rue du Calvaire 57970 Inglange,57345_0020_00054,G,54 RUE DU CALVAIRE,
215703455,00026,21570345500026,O,1983-12-21,NN,,,,false,4,,54,,RUE,DU CALVAIRE,57970,INGLANGE,,,57345,,,,,,,,,,,,,,,,,,,1996-12-25,F,ECOLE PRIMAIRE PUBLIQUE,,,,80.1Z,NAF1993,N,6.298825,49.347157,0.93,housenumber,54 Rue du Calvaire 57970 Inglange,57345_0020_00054,G,54 RUE DU CALVAIRE,
215703455,00034,21570345500034,O,1995-01-01,NN,,,2008-01-04T18:36:57,false,3,,54,,RUE,DU CALVAIRE,57970,INGLANGE,,,57345,,,,,,,,,,,,,,,,,,,2008-01-01,A,SCE ASSAINISSEMENT,,,,37.00Z,NAFRev2,N,6.298825,49.347157,0.93,housenumber,54 Rue du Calvaire 57970 Inglange,57345_0020_00054,G,54 RUE DU CALVAIRE,
215703455,00042,21570345500042,O,1997-10-01,NN,,,2008-01-04T18:36:57,false,3,,54,,RUE,DU CALVAIRE,57970,INGLANGE,,,57345,,,,,,,,,,,,,,,,,,,2008-01-01,A,LOTISSEMENT COMMUNAL,,,,42.99Z,NAFRev2,N,6.298825,49.347157,0.93,housenumber,54 Rue du Calvaire 57970 Inglange,57345_0020_00054,G,54 RUE DU CALVAIRE,
215703455,00059,21570345500059,O,2000-05-05,NN,,,2010-11-19T09:40:57,false,4,MAIRIE,54,,RUE,DU CALVAIRE,57970,INGLANGE,,,57345,,,,,,,,,,,,,,,,,,,2010-11-18,F,LOTISSEMENT ALERIONS,,,,42.99Z,NAFRev2,N,6.298825,49.347157,0.93,housenumber,54 Rue du Calvaire 57970 Inglange,57345_0020_00054,G,54 RUE DU CALVAIRE,
265702241,00018,26570224100018,O,1983-03-01,NN,,,2010-06-26T03:12:23,true,3,,54,,RUE,DU CALVAIRE,57970,INGLANGE,,,57345,,,,,,,,,,,,,,,,,,,2008-01-01,A,CCAS,,,,88.99B,NAFRev2,N,6.298825,49.347157,0.93,housenumber,54 Rue du Calvaire 57970 Inglange,57345_0020_00054,G,54 RUE DU CALVAIRE,
295703623,00013,29570362300013,O,1995-12-25,NN,,,,true,1,MAIRIE,54,,RUE,DU CALVAIRE,57970,INGLANGE,,,57345,,,,,,,,,,,,,,,,,,,1995-12-25,F,AFR,,,,70.1C,NAF1993,N,6.298825,49.347157,0.93,housenumber,54 Rue du Calvaire 57970 Inglange,57345_0020_00054,G,54 RUE DU CALVAIRE,
311083042,00037,31108304200037,O,1984-03-01,NN,,,2014-07-08T00:15:24,true,4,,,,LD,MOULIN HAUT,57970,INGLANGE,,,57345,,,,,,,,,,,,,,,,,,,2010-12-01,F,,,,,43.29A,NAFRev2,O,6.309396,49.343821,0.93,street,Moulin Haut 57970 Inglange,57345_b148,G,MOULIN HAUT,
311499610,00013,31149961000013,O,,NN,,,,true,1,,16,,RTE,D'ELZANGE,57970,INGLANGE,,,57345,,,,,,,,,,,,,,,,,,,1991-12-31,F,,,,,67.01,NAP,N,6.299123,49.350048,0.83,housenumber,16 Route d'Elzange 57970 Inglange,57345_0045_00016,G,16 ROUTE D ELZANGE,
318374592,00018,31837459200018,O,,NN,,,,true,1,,21,,,GRAND RUE,57970,INGLANGE,,,57345,,,,,,,,,,,,,,,,,,,1990-10-31,F,,,,,64.43,NAP,N,6.299703,49.345729,0.43,housenumber,21 Rue Principale 57970 Inglange,57345_0115_00021,G,21 RUE PRINCIPALE,
332299650,00025,33229965000025,O,2009-09-01,,,,2012-11-09T00:29:02,true,2,,4,,LOT,DOMAINE DES ALERIONS,57970,INGLANGE,,,57345,,,,,,,,,,,,,,,,,,,2009-11-27,F,,,,,96.09Z,NAFRev2,N,6.305569,49.346251,0.78,housenumber,4 Domaine des Alerions 57970 Inglange,57345_0010_00004,G,4 DOMAINE DES ALERIONS,
333780179,00011,33378017900011,O,1985-09-16,NN,,,,true,1,,49,,RUE,DU CHATEAU,57970,INGLANGE,,,57345,,,,,,,,,,,,,,,,,,,2000-12-31,F,,,,,01.2J,NAF1993,N,6.297586,49.345638,0.93,housenumber,49 Rue du Chateau 57970 Inglange,57345_0025_00049,G,49 RUE DU CHATEAU,
343442968,00016,34344296800016,O,1988-01-01,NN,,,2007-01-18T09:24:48,true,3,,35,,RUE,DE LA CANNER,57970,INGLANGE,,,57345,,,,,,,,,,,,,,,,,,,1991-03-01,F,,,,,01.1A,NAF1993,N,6.300064,49.346968,0.93,housenumber,35 Rue de la Canner 57970 Inglange,57345_0021_00035,G,35 RUE DE LA CANNER,
349317495,00027,34931749500027,O,1991-04-29,,,,,true,3,,15,,RUE,PRINCIPALE,57970,INGLANGE,,,57345,,,,,,,,,,,,,,,,,,,1992-12-25,F,,,,,60.2P,NAF1993,N,6.300093,49.345413,0.93,housenumber,15 Rue Principale 57970 Inglange,57345_0115_00015,G,15 RUE PRINCIPALE,
353089204,00021,35308920400021,O,2000-06-05,NN,,,2008-11-08T00:30:32,false,4,,4,,RUE,THEODORE DE PUYMAIGRE,57970,INGLANGE,,,57345,,,,,,,,,,,,,,,,,,,2003-01-31,F,,,,,28.3C,NAFRev1,O,6.30326,49.346703,0.93,housenumber,4 Rue Theodore de Puymaigre 57970 Inglange,57345_0150_00004,G,4 RUE THEODORE DE PUYMAIGRE,
381542315,00019,38154231500019,O,1991-03-01,NN,,,2008-01-04T21:57:30,true,3,,35,,RUE,DE LA CANNER,57970,INGLANGE,,,57345,,,,,,,,,,,,,,,,,,,2008-01-01,A,,,,,01.42Z,NAFRev2,N,6.300064,49.346968,0.93,housenumber,35 Rue de la Canner 57970 Inglange,57345_0021_00035,G,35 RUE DE LA CANNER,
388943532,00027,38894353200027,O,1995-12-15,NN,,,,true,1,,,,RTE,DE METZERVISSE,57970,INGLANGE,,,57345,,,,,,,,,,,,,,,,,,,1996-09-30,F,,,,,28.5D,NAF1993,N,6.305392,49.34158,0.84,street,Route de Metzervisse 57970 Inglange,57345_cf7f5a,G,ROUTE DE METZERVISSE,
393796040,00029,39379604000029,O,2001-07-01,NN,,,2008-11-08T00:58:50,false,4,,6,,RTE,D'ELZANGE,57970,INGLANGE,,,57345,,,,,,,,,,,,,,,,,,,2004-03-31,F,,,,,45.3F,NAFRev1,N,6.299937,49.348936,0.82,housenumber,6 Route d'Elzange 57970 Inglange,57345_0045_00006,G,6 ROUTE D ELZANGE,
393796040,00052,39379604000052,O,2012-08-01,,,,2012-10-31T10:18:07,false,2,,6,B,RTE,D'ELZANGE,57970,INGLANGE,,,57345,,,,,,,,,,,,,,,,,,,2012-10-31,F,,,,,82.99Z,NAFRev2,N,6.299823,49.349015,0.67,housenumber,6 bis Route d'Elzange 57970 Inglange,57345_0045_00006_bis,G,6 BIS ROUTE D ELZANGE,
393796040,00060,39379604000060,O,2012-01-01,,,4322BA,2015-05-21T10:38:48,false,2,,6,B,RTE,D'ELZANGE,57970,INGLANGE,,,57345,,,,,,,,,,,,,,,,,,,2015-05-20,F,,,,,43.21A,NAFRev2,N,6.299823,49.349015,0.67,housenumber,6 bis Route d'Elzange 57970 Inglange,57345_0045_00006_bis,G,6 BIS ROUTE D ELZANGE,
393796040,00078,39379604000078,O,2012-01-01,,,,2012-12-12T09:00:27,false,1,,6,B,RTE,D'ELZANGE,57970,INGLANGE,,,57345,,,,,,,,,,,,,,,,,,,2012-01-01,A,,,,,68.20A,NAFRev2,N,6.299823,49.349015,0.67,housenumber,6 bis Route d'Elzange 57970 Inglange,57345_0045_00006_bis,G,6 BIS ROUTE D ELZANGE,
400222162,00010,40022216200010,O,1900-01-01,NN,,,2012-05-10T10:11:58,false,4,,5,,RUE,PRINCIPLE,57970,INGLANGE,,,57345,,,,,,,,,,,,,,,,,,,1997-01-01,F,,,,,45.3C,NAF1993,O,6.299928,49.345163,0.82,housenumber,5 Rue Principale 57970 Inglange,57345_0115_00005,G,5 RUE PRINCIPALE,
408929396,00013,40892939600013,O,1980-01-01,NN,,,2008-01-04T21:18:38,true,3,,34,,RTE,D'ELZANGE,57970,INGLANGE,,,57345,,,,,,,,,,,,,,,,,,,2008-01-01,A,,,,,01.41Z,NAFRev2,N,6.296985,49.355745,0.83,housenumber,34 Route d'Elzange 57970 Inglange,57345_0045_00034,G,34 ROUTE D ELZANGE,
409520764,00013,40952076400013,O,1996-09-23,NN,,,2013-07-08T09:07:34,true,4,3-5,3,,RUE,PRINCIPALE,57970,INGLANGE,,,57345,,,,,,,,,,,,,,,,,,,2013-04-18,F,,,,,68.20A,NAFRev2,N,6.299869,49.345125,0.93,housenumber,3 Rue Principale 57970 Inglange,57345_0115_00003,G,3 RUE PRINCIPALE,
410401087,00011,41040108700011,O,1980-01-01,NN,,,2011-12-06T08:44:53,true,4,,20,,GR,RUE,57970,INGLANGE,,,57345,,,,,,,,,,,,,,,,,,,2011-12-31,F,,,,,01.50Z,NAFRev2,N,6.29984,49.345809,0.54,housenumber,20 Rue Principale 57970 Inglange,57345_0115_00020,G,20 RUE PRINCIPALE,
411957137,00010,41195713700010,O,,,,,,true,1,,59,,RUE,DU CALVAIRE,57970,INGLANGE,,,57345,,,,,,,,,,,,,,,,,,,1997-12-31,F,,,,,01.1A,NAF1993,N,6.297595,49.347423,0.93,housenumber,59 Rue du Calvaire 57970 Inglange,57345_0020_00059,G,59 RUE DU CALVAIRE,
414983411,00029,41498341100029,O,2005-05-28,,,,2006-11-25T15:49:42,false,2,,6,,RTE,D ELZANGE,57970,INGLANGE,,,57345,,,,,,,,,,,,,,,,,,,2006-03-31,F,IPIL,,,,85.1G,NAFRev1,N,6.299937,49.348936,0.82,housenumber,6 Route d'Elzange 57970 Inglange,57345_0045_00006,G,6 ROUTE D ELZANGE,
428014286,00010,42801428600010,O,1979-01-01,NN,,,,true,1,,,,,,57970,INGLANGE,,,57345,,,,,,,,,,,,,,,,,,,2000-05-03,F,,,,,93.0N,NAF1993,N,,,0,,,,,,
440706406,00012,44070640600012,O,2002-01-01,NN,,,2014-07-08T02:20:48,true,5,,12,,RUE,THEODORE DU PUYMAIGRE,57970,INGLANGE,,,57345,,,,,,,,,,,,,,,,,,,2012-06-29,F,,,,,43.12A,NAFRev2,N,6.304663,49.345603,0.84,housenumber,12 Rue Theodore de Puymaigre 57970 Inglange,57345_0150_00012,G,12 RUE THEODORE DE PUYMAIGRE,
442747903,00015,44274790300015,O,2002-05-06,NN,,,2008-01-04T21:48:49,true,3,,,,,,57970,INGLANGE,,,57345,,,,,,,,,,,,,,,,,,,2008-01-01,A,,,,,68.20A,NAFRev2,N,,,0,,,,,,
448884718,00017,44888471800017,O,1992-01-01,NN,,,2008-01-04T23:32:16,true,3,,63,,RUE,DU CALVAIRE,57970,INGLANGE,,,57345,,,,,,,,,,,,,,,,,,,2008-01-01,A,,,,,01.42Z,NAFRev2,N,6.296903,49.347839,0.93,housenumber,63 Rue du Calvaire 57970 Inglange,57345_0020_00063,G,63 RUE DU CALVAIRE,
450126339,00016,45012633900016,O,2003-09-05,NN,,,2008-01-05T21:28:59,true,3,,6,,RTE,D'ELZANGE,57970,INGLANGE,,,57345,,,,,,,,,,,,,,,,,,,2008-01-01,A,,,,,68.20B,NAFRev2,N,6.299937,49.348936,0.82,housenumber,6 Route d'Elzange 57970 Inglange,57345_0045_00006,G,6 ROUTE D ELZANGE,
456500537,04226,45650053704226,O,2014-06-01,21,2018,,2020-08-25T10:20:18,false,1,,,,RTE,DE METZERVISSE,57970,INGLANGE,,,57345,,,,,,,,,,,,,,,,,,,2014-06-01,A,,,,,35.30Z,NAFRev2,O,6.305392,49.34158,0.84,street,Route de Metzervisse 57970 Inglange,57345_cf7f5a,G,ROUTE DE METZERVISSE,
480438183,00026,48043818300026,O,2016-03-22,,,,2020-11-17T10:45:45,false,2,,12,,RTE,DE KEDANGE,57970,INGLANGE,,,57345,,,,,,,,,,,,,,,,,,,2020-11-16,F,,,,,66.21Z,NAFRev2,N,6.30282,49.347189,0.83,housenumber,12 Route de Kedange 57970 Inglange,57345_0089_00012,G,12 ROUTE DE KEDANGE,
488488982,00023,48848898200023,O,2009-07-24,03,2018,4932ZA,2020-08-25T10:32:45,false,2,,3,,RTE,D'ELZANGE,57970,INGLANGE,,,57345,,,,,,,,,,,,,,,,,,,2019-12-03,F,,,,,49.32Z,NAFRev2,O,6.300907,49.348382,0.82,housenumber,3 Route d'Elzange 57970 Inglange,57345_0045_00003,G,3 ROUTE D ELZANGE,
489213512,00028,48921351200028,O,2010-03-10,,,,2014-12-09T09:56:27,false,2,,33,,RTE,D ELZANGE,57970,INGLANGE,,,57345,,,,,,,,,,,,,,,,,,,2014-04-10,F,,,,,86.90D,NAFRev2,N,6.297731,49.352084,0.83,housenumber,33 Route d'Elzange 57970 Inglange,57345_0045_00033,G,33 ROUTE D ELZANGE,
489602474,00012,48960247400012,O,2006-04-03,,,,2008-07-29T06:05:26,true,3,,6,,RTE,D ELZANGE,57970,INGLANGE,,,57345,,,,,,,,,,,,,,,,,,,2008-07-01,F,,,,,96.04Z,NAFRev2,N,6.299937,49.348936,0.82,housenumber,6 Route d'Elzange 57970 Inglange,57345_0045_00006,G,6 ROUTE D ELZANGE,
501873483,00017,50187348300017,O,2008-01-01,,,,2014-07-10T01:07:43,false,2,,6,,RTE,D'ELZANGE,57970,INGLANGE,,,57345,,,,,,,,,,,,,,,,,,,2009-01-01,F,,,,,96.02B,NAFRev2,N,6.299937,49.348936,0.82,housenumber,6 Route d'Elzange 57970 Inglange,57345_0045_00006,G,6 ROUTE D ELZANGE,
503561425,00011,50356142500011,O,2008-04-01,02,2018,4932ZA,2020-08-25T10:16:48,true,2,,31,,RTE,D'ELZANGE,57970,INGLANGE,,,57345,,,,,,,,,,,,,,,,,,,2008-11-01,A,,,,,49.32Z,NAFRev2,O,6.297846,49.351797,0.83,housenumber,31 Route d'Elzange 57970 Inglange,57345_0045_00031,G,31 ROUTE D ELZANGE,
511638371,00019,51163837100019,O,2009-01-26,,,,2009-04-06T12:16:20,true,1,,,,RTE,DE METZERVISSE,57970,INGLANGE,,,57345,,,,,,,,,,,,,,,,,,,2009-01-26,A,,,,,68.20B,NAFRev2,N,6.305392,49.34158,0.84,street,Route de Metzervisse 57970 Inglange,57345_cf7f5a,G,ROUTE DE METZERVISSE,
518607189,00017,51860718900017,O,2009-12-07,,,,2013-09-26T03:35:04,true,2,,32,,RUE,PRINCIPALE,57970,INGLANGE,,,57345,,,,,,,,,,,,,,,,,,,2013-08-31,F,,,,,96.02A,NAFRev2,N,6.299441,49.346285,0.93,housenumber,32 Rue Principale 57970 Inglange,57345_0115_00032,G,32 RUE PRINCIPALE,
521126672,00018,52112667200018,O,2010-01-10,,,,2017-11-02T11:02:07,false,2,,33,,RTE,D'ELZANGE,57970,INGLANGE,,,57345,,,,,,,,,,,,,,,,,,,2017-10-24,F,,,,,86.90D,NAFRev2,N,6.297731,49.352084,0.83,housenumber,33 Route d'Elzange 57970 Inglange,57345_0045_00033,G,33 ROUTE D ELZANGE,
531478675,00014,53147867500014,O,2010-12-15,,,,2011-04-05T08:22:31,true,1,,5,,DOM,LES ALERIONS,57970,INGLANGE,,,57345,,,,,,,,,,,,,,,,,,,2010-12-15,A,,,,,68.20B,NAFRev2,N,6.305683,49.346302,0.74,housenumber,5 Domaine des Alerions 57970 Inglange,57345_0010_00005,G,5 DOMAINE DES ALERIONS,
532423472,00010,53242347200010,O,2011-05-01,,,,2011-05-18T10:52:33,true,1,,2,,RUE,PRINCIPALE,57970,INGLANGE,,,57345,,,,,,,,,,,,,,,,,,,2011-05-01,A,,,,,01.24Z,NAFRev2,N,6.299908,49.344998,0.93,housenumber,2 Rue Principale 57970 Inglange,57345_0115_00002,G,2 RUE PRINCIPALE,
538284225,00017,53828422500017,O,2012-01-01,,,,2011-12-06T08:44:53,true,1,,20,,RUE,PRINCIPALE,57970,INGLANGE,,,57345,,,,,,,,,,,,,,,,,,,2012-01-01,A,,,,,01.50Z,NAFRev2,N,6.29984,49.345809,0.93,housenumber,20 Rue Principale 57970 Inglange,57345_0115_00020,G,20 RUE PRINCIPALE,
539423889,00010,53942388900010,O,2012-01-01,,,,2013-09-26T08:54:43,false,2,,13,,,DOMAINE DES ALERIONS,57970,INGLANGE,,,57345,,,,,,,,,,,,,,,,,,,2013-08-30,F,,,,,85.59B,NAFRev2,N,6.304511,49.347679,0.93,housenumber,13 Domaine des Alerions 57970 Inglange,57345_0010_00013,G,13 DOMAINE DES ALERIONS,
539707430,00028,53970743000028,O,2014-06-02,,,,2017-11-06T09:16:39,false,2,,33,,RTE,D'ELZANGE,57970,INGLANGE,,,57345,,,,,,,,,,,,,,,,,,,2017-10-24,F,,,,,86.90D,NAFRev2,N,6.297731,49.352084,0.83,housenumber,33 Route d'Elzange 57970 Inglange,57345_0045_00033,G,33 ROUTE D ELZANGE,
752021881,00046,75202188100046,O,2016-03-01,,,,2016-09-01T09:32:20,false,2,APPART B,9,,,DOMAINE DES ALERIONS,57970,INGLANGE,,,57345,,,,,,,,,,,,,,,,,,,2016-07-01,F,,,,,86.90D,NAFRev2,N,6.305294,49.346922,0.93,housenumber,9 Domaine des Alerions 57970 Inglange,57345_0010_00009,G,9 DOMAINE DES ALERIONS,
775619596,00106,77561959600106,O,1900-01-01,21,2018,,2020-08-25T10:56:55,false,4,,,,LD,LE CHATEAU,57970,INGLANGE,,,57345,,,,,,,,,,,,,,,,,,,2008-01-01,A,CENTRE MEDICO EDUCATIF,,,,87.10B,NAFRev2,O,6.295443,49.344658,0.67,street,Rue du Chateau 57970 Inglange,57345_0025,G,RUE DU CHATEAU,
779977420,00016,77997742000016,O,1900-01-01,NN,,,2008-01-05T03:12:06,true,3,,,,,MAIRIE D'INGLANGE,57970,INGLANGE,,,57345,,,,,,,,,,,,,,,,,,,2008-01-01,A,,,,,90.02Z,NAFRev2,N,6.305296,49.346526,0.58,street,Domaine des Alerions 57970 Inglange,57345_0010,G,DOMAINE DES ALERIONS,
780041992,00063,78004199200063,O,2016-03-01,,,,2016-03-03T11:16:48,true,1,,15,,RUE,PRINCIPALE,57970,INGLANGE,,,57345,,,,,,,,,,,,,,,,,,,2016-03-01,A,,,,,86.21Z,NAFRev2,N,6.300093,49.345413,0.93,housenumber,15 Rue Principale 57970 Inglange,57345_0115_00015,G,15 RUE PRINCIPALE,
785773243,00015,78577324300015,O,,NN,,,,true,1,,,,,MOU DU HAUT,57970,INGLANGE,,,57345,,,,,,,,,,,,,,,,,,,,F,,,,,57.06,NAP,N,6.309396,49.343821,0.54,street,Moulin Haut 57970 Inglange,57345_b148,G,MOULIN HAUT,
786480186,00018,78648018600018,O,1964-01-01,NN,,2511ZZ,2015-03-18T00:49:46,false,5,,,,RTE,DE METZERVISSE,57970,INGLANGE,,,57345,,,,,,,,,,,,,,,,,,,2011-09-29,F,,,,,25.11Z,NAFRev2,O,6.305392,49.34158,0.84,street,Route de Metzervisse 57970 Inglange,57345_cf7f5a,G,ROUTE DE METZERVISSE,
787170109,00013,78717010900013,O,,NN,,,,true,1,,1,,RUE,PRINCIPALE,57970,INGLANGE,,,57345,,,,,,,,,,,,,,,,,,,1995-10-01,F,,,,,45.4C,NAF1993,N,6.299745,49.344932,0.93,housenumber,1 Rue Principale 57970 Inglange,57345_0115_00001,G,1 RUE PRINCIPALE,
787280312,00010,78728031200010,O,,NN,,,,true,1,,4,B,RTE,DE METZERVISSE,57970,INGLANGE,,,57345,,,,,,,,,,,,,,,,,,,1997-02-28,F,,,,,45.2L,NAF1993,O,6.305392,49.34158,0.73,street,Route de Metzervisse 57970 Inglange,57345_cf7f5a,G,ROUTE DE METZERVISSE,
789552817,00015,78955281700015,O,2012-09-26,,,,2015-11-05T09:39:33,false,2,,6,,,BIS ROUTE D'ELZANGE,57970,INGLANGE,,,57345,,,,,,,,,,,,,,,,,,,2015-10-01,F,,,,,70.10Z,NAFRev2,N,6.299823,49.349015,0.93,housenumber,6 bis Route d'Elzange 57970 Inglange,57345_0045_00006_bis,G,6 BIS ROUTE D ELZANGE,
790769178,00019,79076917800019,O,2013-01-08,,,,2016-01-21T08:18:56,true,3,,3,,RUE,MOULIN-HAUT,57970,INGLANGE,,,57345,,,,,,,,,,,,,,,,,,,2016-01-19,F,,,,,96.02A,NAFRev2,N,6.308519,49.343975,0.7,housenumber,3 Moulin Haut 57970 Inglange,57345_b148_00003,G,3 MOULIN HAUT,
792706517,00028,79270651700028,O,2013-05-28,,,2341ZZ,2016-09-05T19:26:52,true,3,,58,,RTE,DU CALVAIRE,57970,INGLANGE,,,57345,,,,,,,,,,,,,,,,,,,2016-07-01,A,,,,DE PLUME ET DE CROCS CERAMIQUE,23.41Z,NAFRev2,N,6.297561,49.347335,0.79,housenumber,58 Rue du Calvaire 57970 Inglange,57345_0020_00058,G,58 RUE DU CALVAIRE,
794494294,00026,79449429400026,O,2019-03-19,,,,2019-08-12T11:40:43,true,1,,54,,RUE,DU CALVAIRE,57970,INGLANGE,,,57345,,,,,,,,,,,,,,,,,,,2019-03-19,A,,,,,94.99Z,NAFRev2,N,6.298825,49.347157,0.93,housenumber,54 Rue du Calvaire 57970 Inglange,57345_0020_00054,G,54 RUE DU CALVAIRE,
808832703,00017,80883270300017,O,2015-01-06,,,4776ZP,2018-11-29T20:05:41,true,2,,3,,RUE,THEODORE DE PUYMAIGRE,57970,INGLANGE,,,57345,,,,,,,,,,,,,,,,,,,2018-10-29,F,,,,,47.76Z,NAFRev2,N,6.303061,49.346828,0.93,housenumber,3 Rue Theodore de Puymaigre 57970 Inglange,57345_0150_00003,G,3 RUE THEODORE DE PUYMAIGRE,
810399097,00015,81039909700015,O,2015-02-17,,,,2015-03-24T12:23:22,true,1,,9,,RUE,SAINT MICHEL,57970,INGLANGE,,,57345,,,,,,,,,,,,,,,,,,,2015-02-17,A,,,,,47.99A,NAFRev2,N,6.299789,49.352221,0.69,housenumber,9 Clos Saint Michel 57970 Inglange,57345_bbwfgb_00009,G,9 CLOS SAINT MICHEL,
813317120,00018,81331712000018,O,2015-09-01,,,,2018-04-10T16:03:38,true,1,,4,,RUE,PRINCIPALE,57970,INGLANGE,,,57345,,,,,,,,,,,,,,,,,,,2015-09-01,A,,,,KAT IMMOBILIER,68.20B,NAFRev2,N,6.300195,49.345134,0.93,housenumber,4 Rue Principale 57970 Inglange,57345_0115_00004,G,4 RUE PRINCIPALE,
824402739,00034,82440273900034,O,2020-08-01,,,,2020-09-02T08:34:57,true,1,,18,,RUE,PRINCIPALE,57970,INGLANGE,,,57345,,,,,,,,,,,,,,,,,,,2020-08-01,A,,,,,74.10Z,NAFRev2,N,6.299886,49.345565,0.93,housenumber,18 Rue Principale 57970 Inglange,57345_0115_00018,G,18 RUE PRINCIPALE,
829480011,00016,82948001100016,O,2017-05-01,,,,2017-10-19T14:55:32,true,1,,11,,RUE,THEODORE DE PUYMAIGRE,57970,INGLANGE,,,57345,,,,,,,,,,,,,,,,,,,2017-05-01,A,,,,,86.90F,NAFRev2,N,6.304585,49.3455,0.93,housenumber,11 Rue Theodore de Puymaigre 57970 Inglange,57345_0150_00011,G,11 RUE THEODORE DE PUYMAIGRE,
833976327,00019,83397632700019,O,2017-12-01,,,,2017-12-15T04:39:32,true,1,,1,,RUE,PRINCIPALE,57970,INGLANGE,,,57345,,,,,,,,,,,,,,,,,,,2017-12-01,A,,,,,01.13Z,NAFRev2,N,6.299745,49.344932,0.93,housenumber,1 Rue Principale 57970 Inglange,57345_0115_00001,G,1 RUE PRINCIPALE,
842229007,00013,84222900700013,O,2018-08-30,,,,2018-09-11T09:54:10,true,1,,5,,RUE,ST MICHEL,57970,INGLANGE,,,57345,,,,,,,,,,,,,,,,,,,2018-08-30,A,,,,,47.99A,NAFRev2,N,6.299794,49.351827,0.53,housenumber,5 Clos Saint Michel 57970 Inglange,57345_bbwfgb_00005,G,5 CLOS SAINT MICHEL,
851240168,00019,85124016800019,O,2019-05-16,,,,2019-06-03T09:29:35,true,1,,33,,RTE,D'ELZANGE,57970,INGLANGE,,,57345,,,,,,,,,,,,,,,,,,,2019-05-16,A,,,,,68.20B,NAFRev2,N,6.297731,49.352084,0.83,housenumber,33 Route d'Elzange 57970 Inglange,57345_0045_00033,G,33 ROUTE D ELZANGE,
878340827,00012,87834082700012,O,2019-09-01,,,,2019-10-23T08:58:28,true,1,,47,,RUE,DU CHATEAU,57970,INGLANGE,,,57345,,,,,,,,,,,,,,,,,,,2019-09-01,A,,,,,68.20B,NAFRev2,N,6.295443,49.344658,0.93,housenumber,47 Rue du Chateau 57970 Inglange,57345_0025_00047,G,47 RUE DU CHATEAU,
882978034,00016,88297803400016,O,2020-05-04,,,,2020-05-26T15:39:41,true,1,,15,,RUE,PRINCIPALE,57970,INGLANGE,,,57345,,,,,,,,,,,,,,,,,,,2020-05-04,A,,,,,68.20B,NAFRev2,N,6.300093,49.345413,0.93,housenumber,15 Rue Principale 57970 Inglange,57345_0115_00015,G,15 RUE PRINCIPALE,
884444498,00015,88444449800015,O,2020-06-01,,,,2020-06-23T03:43:32,true,1,,,,,16 RUE SAINT MICHEL,57970,INGLANGE,,,57345,,,,,,,,,,,,,,,,,,,2020-06-01,A,,,,,68.20B,NAFRev2,N,6.2988,49.351988,0.7,housenumber,16 Clos Saint Michel 57970 Inglange,57345_bbwfgb_00016,G,16 CLOS SAINT MICHEL,
