siren,nic,siret,statutDiffusionEtablissement,dateCreationEtablissement,trancheEffectifsEtablissement,anneeEffectifsEtablissement,activitePrincipaleRegistreMetiersEtablissement,dateDernierTraitementEtablissement,etablissementSiege,nombrePeriodesEtablissement,complementAdresseEtablissement,numeroVoieEtablissement,indiceRepetitionEtablissement,typeVoieEtablissement,libelleVoieEtablissement,codePostalEtablissement,libelleCommuneEtablissement,libelleCommuneEtrangerEtablissement,distributionSpecialeEtablissement,codeCommuneEtablissement,codeCedexEtablissement,libelleCedexEtablissement,codePaysEtrangerEtablissement,libellePaysEtrangerEtablissement,complementAdresse2Etablissement,numeroVoie2Etablissement,indiceRepetition2Etablissement,typeVoie2Etablissement,libelleVoie2Etablissement,codePostal2Etablissement,libelleCommune2Etablissement,libelleCommuneEtranger2Etablissement,distributionSpeciale2Etablissement,codeCommune2Etablissement,codeCedex2Etablissement,libelleCedex2Etablissement,codePaysEtranger2Etablissement,libellePaysEtranger2Etablissement,dateDebut,etatAdministratifEtablissement,enseigne1Etablissement,enseigne2Etablissement,enseigne3Etablissement,denominationUsuelleEtablissement,activitePrincipaleEtablissement,nomenclatureActivitePrincipaleEtablissement,caractereEmployeurEtablissement,longitude,latitude,geo_score,geo_type,geo_adresse,geo_id,geo_ligne,geo_l4,geo_l5
215800715,00017,21580071500017,O,1983-03-01,02,2018,,2020-08-25T10:17:58,true,3,,,,,,58420,CHEVANNES-CHANGY,,,58071,,,,,,,,,,,,,,,,,,,2008-01-01,A,MAIRIE,,,,84.11Z,NAFRev2,N,,,0,,,,,,
215800715,00025,21580071500025,O,1983-12-21,NN,,,2019-11-14T14:00:46,false,3,,,,,,58420,CHEVANNES-CHANGY,,,58071,,,,,,,,,,,,,,,,,,,2008-01-01,A,ECOLE PRIMAIRE PUBLIQUE,,,,85.20Z,NAFRev2,N,,,0,,,,,,
255801342,00015,25580134200015,O,1984-04-09,01,2018,,2020-08-25T10:20:30,true,4,,,,,MAIRIE,58420,CHEVANNES-CHANGY,,,58071,,,,,,,,,,,,,,,,,,,2008-01-01,A,,,,,42.99Z,NAFRev2,N,3.0709671,50.6304695,0.92,poi.townhall,Hôtel de Ville Lille,https://osm.org/way/40917078,G,,
265800714,00015,26580071400015,O,1983-03-01,NN,,,2019-11-14T14:00:46,true,4,,,,,MAIRIE,58420,CHEVANNES-CHANGY,,,58071,,,,,,,,,,,,,,,,,,,2015-09-28,F,CCAS,,,,88.99B,NAFRev2,N,3.0709671,50.6304695,0.92,poi.townhall,Hôtel de Ville Lille,https://osm.org/way/40917078,G,,
295800718,00013,29580071800013,O,,NN,,,2019-11-14T14:00:46,true,1,,,,,MAIRIE,58420,CHEVANNES-CHANGY,,,58071,,,,,,,,,,,,,,,,,,,1989-12-15,F,,,,,70.1C,NAF1993,N,3.0709671,50.6304695,0.92,poi.townhall,Hôtel de Ville Lille,https://osm.org/way/40917078,G,,
308981695,00015,30898169500015,O,,NN,,,2019-11-14T14:00:46,true,1,,,,,,58420,CHEVANNES-CHANGY,,,58071,,,,,,,,,,,,,,,,,,,1996-12-31,F,,,,,60.2M,NAF1993,O,,,0,,,,,,
309926103,00016,30992610300016,O,,NN,,,2019-11-14T14:00:46,true,1,,,,,,58420,CHEVANNES-CHANGY,,,58071,,,,,,,,,,,,,,,,,,,,F,,,,,54.07,NAP,N,,,0,,,,,,
311958698,00012,31195869800012,O,1978-01-01,NN,,,2019-11-14T14:00:46,true,4,,,,,,58420,CHEVANNES-CHANGY,,,58071,,,,,,,,,,,,,,,,,,,2014-12-31,F,,,,,01.61Z,NAFRev2,N,,,0,,,,,,
313467649,00015,31346764900015,O,1978-01-01,NN,,,2019-11-14T14:00:46,true,4,,,,HAM,TREIGNY,58420,CHEVANNES-CHANGY,,,58071,,,,,,,,,,,,,,,,,,,2011-09-29,A,,,,,68.20B,NAFRev2,N,3.452604,47.27349,0.93,street,Treigny 58420 Chevannes-Changy,58071_90etsi,G,TREIGNY,
315101469,00023,31510146900023,O,2010-09-15,,,,2019-11-14T14:00:46,true,2,,5,,,LES MASSERONS,58420,CHEVANNES-CHANGY,,,58071,,,,,,,,,,,,,,,,,,,2015-03-26,F,,,,,95.25Z,NAFRev2,N,3.445253,47.315388,0.93,housenumber,5 Les Masserons 58420 Chevannes-Changy,58071_1t99r3_00005,G,5 LES MASSERONS,
315955088,00010,31595508800010,O,1979-01-01,NN,,,2019-11-14T14:00:46,true,1,,,,,,58420,CHEVANNES-CHANGY,,,58071,,,,,,,,,,,,,,,,,,,1998-12-31,F,,,,,55.4B,NAF1993,N,,,0,,,,,,
316803758,00010,31680375800010,O,,NN,,,2019-11-14T14:00:46,true,1,,,,,,58420,CHEVANNES-CHANGY,,,58071,,,,,,,,,,,,,,,,,,,1996-04-02,F,,,,,45.4A,NAF1993,N,,,0,,,,,,
321478109,00010,32147810900010,O,1981-03-01,NN,,,2019-11-14T14:00:46,true,3,,,,,,58420,CHEVANNES-CHANGY,,,58071,,,,,,,,,,,,,,,,,,,2008-01-01,A,,,,,70.10Z,NAFRev2,N,,,0,,,,,,
323068106,00018,32306810600018,O,1981-09-15,NN,,,2019-11-14T14:00:46,true,3,,,,,FERME DES PIONS,58420,CHEVANNES-CHANGY,,,58071,,,,,,,,,,,,,,,,,,,2008-01-01,A,,,,,68.20B,NAFRev2,N,,,0,,,,,,
326238706,00013,32623870600013,O,,NN,,,2019-11-14T14:00:46,true,1,,,,,,58420,CHEVANNES-CHANGY,,,58071,,,,,,,,,,,,,,,,,,,1991-02-25,F,,,,,01.00,NAP,N,,,0,,,,,,
332424324,00025,33242432400025,O,,NN,,,2019-11-14T14:00:46,true,1,,,,,LES OUCHERONS,58420,CHEVANNES-CHANGY,,,58071,,,,,,,,,,,,,,,,,,,1987-05-17,F,,,,,02.20,NAP,N,3.436154,47.275804,0.93,street,Les Oucherons 58420 Chevannes-Changy,58071_h8ibht,G,LES OUCHERONS,
333960243,00017,33396024300017,O,,NN,,,2019-11-14T14:00:46,true,1,,,,,,58420,CHEVANNES-CHANGY,,,58071,,,,,,,,,,,,,,,,,,,1990-05-31,F,,,,,02.20,NAP,N,,,0,,,,,,
338270200,00011,33827020000011,O,1986-07-01,NN,,,2019-11-14T14:00:46,true,5,,4,,RTE,DE PREVENT,58420,CHEVANNES-CHANGY,,,58071,,,,,,,,,,,,,,,,,,,2015-12-31,F,,,,,85.52Z,NAFRev2,N,,,0,,,,,,
341146827,00017,34114682700017,O,,NN,,,2019-11-14T14:00:46,true,1,,,,,,58420,CHEVANNES-CHANGY,,,58071,,,,,,,,,,,,,,,,,,,1988-12-31,F,,,,,01.07,NAP,N,,,0,,,,,,
345078042,00024,34507804200024,O,2001-06-22,NN,,,2019-11-14T14:00:46,true,3,,,,RTE,DE BRINON,58420,CHEVANNES-CHANGY,,,58071,,,,,,,,,,,,,,,,,,,2008-01-01,A,,,,,68.20A,NAFRev2,N,3.450123,47.288393,0.8,street,Route de Brinon 58420 Chevannes-Changy,58071_0016,G,ROUTE DE BRINON,
356000265,01961,35600026501961,O,1991-01-01,NN,,,2019-11-14T14:00:46,false,3,,,,,AU BOURG,58420,CHEVANNES-CHANGY,,,58071,,,,,,,,,,,,,,,,,,,2006-05-01,F,BUREAU DE POSTE,,,,64.1A,NAFRev1,O,-1.9115621,47.1089349,0.88,poi.track,Chemin du Breil au Bourg Chaumes-en-Retz,https://osm.org/way/283246644,G,,
379203961,00014,37920396100014,O,1990-08-01,NN,,,2019-11-14T14:00:46,true,3,,,,,,58420,CHEVANNES-CHANGY,,,58071,,,,,,,,,,,,,,,,,,,2008-01-01,A,,,,,01.11Z,NAFRev2,N,,,0,,,,,,
381899384,00014,38189938400014,O,1991-03-15,03,2018,,2020-08-25T10:18:54,true,5,LES PIONS,,,,LES PIONS,58420,CHEVANNES-CHANGY,,,58071,,,,,,,,,,,,,,,,,,,2008-12-31,A,,,,,01.49Z,NAFRev2,O,3.444203,47.308462,0.93,street,Les Pions 58420 Chevannes-Changy,58071_fe6is8,G,LES PIONS,
382398121,00014,38239812100014,O,,NN,,,2019-11-14T14:00:46,true,1,,,,,,58420,CHEVANNES-CHANGY,,,58071,,,,,,,,,,,,,,,,,,,1996-12-20,F,,,,,70.2B,NAF1993,N,,,0,,,,,,
384498994,00019,38449899400019,O,,NN,,,2019-11-14T14:00:46,true,1,,,,,,58420,CHEVANNES-CHANGY,,,58071,,,,,,,,,,,,,,,,,,,1991-12-31,F,,,,,86.07,NAP,N,,,0,,,,,,
388704199,00016,38870419900016,O,1992-06-30,NN,,,2019-11-14T14:00:46,true,3,,,,,,58420,CHEVANNES-CHANGY,,,58071,,,,,,,,,,,,,,,,,,,2008-01-01,A,,,,,01.11Z,NAFRev2,N,,,0,,,,,,
391452901,00021,39145290100021,O,1995-01-01,NN,,,2019-11-14T14:00:46,true,4,,,,LD,PREVENT,58420,CHEVANNES-CHANGY,,,58071,,,,,,,,,,,,,,,,,,,2001-03-31,F,,,,,74.1J,NAF1993,O,3.443091,47.30456,0.93,street,Prevent 58420 Chevannes-Changy,58071_b0kv7x,G,PREVENT,
393001532,00018,39300153200018,O,1981-01-01,NN,,,2019-11-14T14:00:46,true,5,,,,,LES CHAZEAUX,58420,CHEVANNES-CHANGY,,,58071,,,,,,,,,,,,,,,,,,,2016-06-30,F,,,,,01.11Z,NAFRev2,N,3.446605,47.317979,0.93,street,Les Chazeaux 58420 Chevannes-Changy,58071_lsmvl3,G,LES CHAZEAUX,
393001623,00015,39300162300015,O,1973-01-01,NN,,,2019-11-14T14:00:46,true,5,,,,,,58420,CHEVANNES-CHANGY,,,58071,,,,,,,,,,,,,,,,,,,2008-05-13,F,,,,,01.50Z,NAFRev2,N,,,0,,,,,,
393162029,00010,39316202900010,O,1978-01-01,NN,,,2019-11-14T14:00:46,true,3,,,,,PREVENT,58420,CHEVANNES-CHANGY,,,58071,,,,,,,,,,,,,,,,,,,2004-12-31,F,,,,,02.0A,NAFRev1,N,3.443091,47.30456,0.93,street,Prevent 58420 Chevannes-Changy,58071_b0kv7x,G,PREVENT,
393162052,00012,39316205200012,O,1968-01-01,NN,,,2019-11-14T14:00:46,true,1,,,,,PREVENT,58420,CHEVANNES-CHANGY,,,58071,,,,,,,,,,,,,,,,,,,1993-01-01,F,,,,,01.2A,NAF1993,N,3.443091,47.30456,0.93,street,Prevent 58420 Chevannes-Changy,58071_b0kv7x,G,PREVENT,
397487901,00019,39748790100019,O,1994-05-25,NN,,,2019-11-14T14:00:46,true,4,,,,,CHANGY,58420,CHEVANNES-CHANGY,,,58071,,,,,,,,,,,,,,,,,,,2019-06-26,F,,,,,68.20B,NAFRev2,N,3.452404,47.311083,0.93,street,Changy 58420 Chevannes-Changy,58071_osy1oh,G,CHANGY,
404364986,00012,40436498600012,O,1996-03-21,NN,,,2019-11-14T14:00:46,false,4,,,,,LE BOURG,58420,CHEVANNES-CHANGY,,,58071,,,,,,,,,,,,,,,,,,,1998-09-01,F,PHIL DESIGN,,,,36.1G,NAF1993,N,3.452999,47.289236,0.9,street,Rue de Troie le Bourg 58420 Chevannes-Changy,58071_0134,G,RUE DE TROIE LE BOURG,
407881028,00010,40788102800010,O,1996-06-07,NN,,,2019-11-14T14:00:46,true,3,,,,,LA NOUE,58420,CHEVANNES-CHANGY,,,58071,,,,,,,,,,,,,,,,,,,2008-01-01,A,,,,,93.29Z,NAFRev2,N,3.454152,47.301328,0.93,street,La Noue 58420 Chevannes-Changy,58071_r17q5g,G,LA NOUE,
408339315,00017,40833931500017,O,1996-04-01,NN,,,2019-11-14T14:00:46,true,4,,,,,LES PIONS,58420,CHEVANNES-CHANGY,,,58071,,,,,,,,,,,,,,,,,,,2008-01-01,F,,,,,68.20B,NAFRev2,N,3.444203,47.308462,0.93,street,Les Pions 58420 Chevannes-Changy,58071_fe6is8,G,LES PIONS,
410028104,00017,41002810400017,O,1989-09-01,NN,,,2019-11-14T14:00:46,true,3,,,,,,58420,CHEVANNES-CHANGY,,,58071,,,,,,,,,,,,,,,,,,,2008-01-01,A,,,,,01.42Z,NAFRev2,N,,,0,,,,,,
412576928,00011,41257692800011,O,1997-01-01,NN,,,2019-11-14T14:00:46,true,4,,,,,,58420,CHEVANNES-CHANGY,,,58071,,,,,,,,,,,,,,,,,,,2011-03-01,F,,,,,68.20B,NAFRev2,N,,,0,,,,,,
419098025,00051,41909802500051,O,2012-05-15,NN,,,2019-11-14T14:00:46,true,1,,,,,LA NOUE,58420,CHEVANNES-CHANGY,,,58071,,,,,,,,,,,,,,,,,,,2012-05-15,A,,,,,93.29Z,NAFRev2,O,3.454152,47.301328,0.93,street,La Noue 58420 Chevannes-Changy,58071_r17q5g,G,LA NOUE,
421982992,00016,42198299200016,O,1999-02-27,,,,2019-11-14T14:00:46,true,1,,,,,,58420,CHEVANNES-CHANGY,,,58071,,,,,,,,,,,,,,,,,,,2000-10-27,F,,,,,55.3A,NAF1993,N,,,0,,,,,,
422538314,00010,42253831400010,O,1999-04-01,NN,,,2019-11-14T14:00:46,true,3,,,,LD,TREIGNY,58420,CHEVANNES-CHANGY,,,58071,,,,,,,,,,,,,,,,,,,2008-01-01,A,,,,,52.10B,NAFRev2,N,3.452604,47.27349,0.93,street,Treigny 58420 Chevannes-Changy,58071_90etsi,G,TREIGNY,
431991694,00016,43199169400016,O,1978-05-11,NN,,,2019-11-14T14:00:46,true,4,,,,,LE BOURG,58420,CHEVANNES-CHANGY,,,58071,,,,,,,,,,,,,,,,,,,2011-02-01,F,,,,,02.40Z,NAFRev2,N,3.452999,47.289236,0.9,street,Rue de Troie le Bourg 58420 Chevannes-Changy,58071_0134,G,RUE DE TROIE LE BOURG,
434645115,00016,43464511500016,O,2001-03-01,NN,,,2019-11-14T14:00:46,true,4,,,,RTE,DE BRINON,58420,CHEVANNES-CHANGY,,,58071,,,,,,,,,,,,,,,,,,,2010-02-28,F,,,,,56.10A,NAFRev2,N,3.450123,47.288393,0.8,street,Route de Brinon 58420 Chevannes-Changy,58071_0016,G,ROUTE DE BRINON,
507896546,00011,50789654600011,O,2008-09-01,,,,2019-11-14T14:00:46,true,1,LE BOURG,,,RUE,TROIE,58420,CHEVANNES-CHANGY,,,58071,,,,,,,,,,,,,,,,,,,2008-09-01,A,,,,,01.11Z,NAFRev2,N,3.452996,47.289096,0.92,street,Rue de Troie 58420 Chevannes-Changy,58071_0ak19x,G,RUE DE TROIE,
510826233,00015,51082623300015,O,2008-12-01,,,,2019-11-14T14:00:46,true,1,,,,,BOIS THERIAT,58420,CHEVANNES-CHANGY,,,58071,,,,,,,,,,,,,,,,,,,2008-12-01,A,,,,,02.10Z,NAFRev2,N,,,0,,,,,,
517938080,00010,51793808000010,O,2009-11-01,,,,2019-11-14T14:00:46,false,2,,,,RUE,TROIE LE BOURG,58420,CHEVANNES-CHANGY,,,58071,,,,,,,,,,,,,,,,,,,2011-09-30,F,,,,,96.02B,NAFRev2,N,3.452999,47.289236,0.92,street,Rue de Troie le Bourg 58420 Chevannes-Changy,58071_0134,G,RUE DE TROIE LE BOURG,
519239073,00017,51923907300017,O,2010-01-01,,,,2019-11-14T14:00:46,true,2,,,,,LA TUILERIE,58420,CHEVANNES-CHANGY,,,58071,,,,,,,,,,,,,,,,,,,2015-10-31,F,,,,,01.45Z,NAFRev2,N,3.445608,47.285094,0.93,street,La Tuilerie 58420 Chevannes-Changy,58071_s4uno4,G,LA TUILERIE,
520664855,00019,52066485500019,O,2010-03-01,,,,2019-11-14T14:00:46,true,1,,,,,LE BOURG,58420,CHEVANNES-CHANGY,,,58071,,,,,,,,,,,,,,,,,,,2010-03-01,A,,,,,56.30Z,NAFRev2,N,3.452999,47.289236,0.9,street,Rue de Troie le Bourg 58420 Chevannes-Changy,58071_0134,G,RUE DE TROIE LE BOURG,
528207988,00015,52820798800015,O,2010-04-02,,,,2019-11-14T14:00:46,true,1,,4,,RTE,DE VARZY,58420,CHEVANNES-CHANGY,,,58071,,,,,,,,,,,,,,,,,,,2010-04-02,A,,,,,94.99Z,NAFRev2,N,3.450247,47.289463,0.81,housenumber,4 Route de Varzy 58420 Chevannes-Changy,58071_0138_00004,G,4 ROUTE DE VARZY,
532172608,00020,53217260800020,O,2015-06-01,,,,2019-11-14T14:00:46,true,1,,,,,LA TUILERIE,58420,CHEVANNES-CHANGY,,,58071,,,,,,,,,,,,,,,,,,,2015-06-01,A,,,,,01.45Z,NAFRev2,N,3.445608,47.285094,0.93,street,La Tuilerie 58420 Chevannes-Changy,58071_s4uno4,G,LA TUILERIE,
535146575,00019,53514657500019,O,2011-09-15,02,2018,,2020-08-25T10:47:42,true,1,,,,,TREIGNY,58420,CHEVANNES-CHANGY,,,58071,,,,,,,,,,,,,,,,,,,2011-09-15,A,,,,,01.11Z,NAFRev2,N,3.452604,47.27349,0.93,street,Treigny 58420 Chevannes-Changy,58071_90etsi,G,TREIGNY,
751042151,00017,75104215100017,O,2012-05-01,,,,2019-11-14T14:00:46,true,3,,4,,RTE,DE PARIGNY,58420,CHEVANNES-CHANGY,,,58071,,,,,,,,,,,,,,,,,,,2016-04-01,A,,,,,01.43Z,NAFRev2,N,3.449898,47.292428,0.82,housenumber,4 Route de Parigny 58420 Chevannes-Changy,58071_0120_00004,G,4 ROUTE DE PARIGNY,
753975994,00017,75397599400017,O,2012-09-24,11,2018,,2020-08-25T10:56:31,true,2,,3,,RTE,DE LATUILERIE,58420,CHEVANNES-CHANGY,,,58071,,,,,,,,,,,,,,,,,,,2012-10-01,A,,,,,49.41B,NAFRev2,O,3.444152,47.284592,0.75,housenumber,3 Route de la Tuilerie 58420 Chevannes-Changy,58071_0136_00003,G,3 ROUTE DE LA TUILERIE,
778443796,00017,77844379600017,O,,NN,,,2019-11-14T14:00:46,true,1,,,,,,58420,CHEVANNES-CHANGY,,,58071,,,,,,,,,,,,,,,,,,,1992-03-31,F,,,,,02.0B,NAF1993,N,,,0,,,,,,
778443804,00019,77844380400019,O,,NN,,,2019-11-14T14:00:46,true,1,,,,,,58420,CHEVANNES-CHANGY,,,58071,,,,,,,,,,,,,,,,,,,1976-07-15,F,,,,,01.4A,NAF1993,N,,,0,,,,,,
778443812,00012,77844381200012,O,,,,,2019-11-14T14:00:46,true,1,,,,,,58420,CHEVANNES-CHANGY,,,58071,,,,,,,,,,,,,,,,,,,1984-12-25,F,,,,,22.02,NAP,N,,,0,,,,,,
790731277,00014,79073127700014,O,2013-01-01,01,2018,,2020-08-25T11:01:08,true,2,,1,,RTE,DE BRINON,58420,CHEVANNES-CHANGY,,,58071,,,,,,,,,,,,,,,,,,,2014-08-01,A,L'AIRE DE RIEN,,,EIRL WARGNIER,56.30Z,NAFRev2,O,3.450123,47.288393,0.82,housenumber,1 Route de Brinon 58420 Chevannes-Changy,58071_0016_00001,G,1 ROUTE DE BRINON,
799229554,00016,79922955400016,O,2014-01-01,,,,2019-11-14T14:00:46,false,2,,6,,RTE,VARZY,58420,CHEVANNES-CHANGY,,,58071,,,,,,,,,,,,,,,,,,,2014-09-01,F,,,,,93.29Z,NAFRev2,N,3.449632,47.290224,0.77,housenumber,6 Route de Varzy 58420 Chevannes-Changy,58071_0138_00006,G,6 ROUTE DE VARZY,
811785690,00017,81178569000017,O,2015-06-01,,,,2019-11-14T14:00:46,true,2,,2,,,CHANGY,58420,CHEVANNES-CHANGY,,,58071,,,,,,,,,,,,,,,,,,,2015-09-26,F,,,,,86.21Z,NAFRev2,N,3.455055,47.312988,0.93,housenumber,2 Changy 58420 Chevannes-Changy,58071_osy1oh_00002,G,2 CHANGY,
818465320,00013,81846532000013,O,2016-01-05,,,,2019-11-14T14:00:46,false,2,,2,,,CHANGY,58420,CHEVANNES-CHANGY,,,58071,,,,,,,,,,,,,,,,,,,2016-07-07,F,,,,,86.21Z,NAFRev2,N,3.455055,47.312988,0.93,housenumber,2 Changy 58420 Chevannes-Changy,58071_osy1oh_00002,G,2 CHANGY,
819483975,00010,81948397500010,O,2016-04-01,,,,2019-11-14T14:00:46,true,1,,,,,LES CHAZEAUX,58420,CHEVANNES-CHANGY,,,58071,,,,,,,,,,,,,,,,,,,2016-04-01,A,,,,,01.11Z,NAFRev2,N,3.446605,47.317979,0.93,street,Les Chazeaux 58420 Chevannes-Changy,58071_lsmvl3,G,LES CHAZEAUX,
822558185,00010,82255818500010,O,2016-09-12,,,,2019-11-14T14:00:46,true,1,,,,,LES MASSERONS,58420,CHEVANNES-CHANGY,,,58071,,,,,,,,,,,,,,,,,,,2016-09-12,A,,,,,81.30Z,NAFRev2,N,3.445013,47.313605,0.93,street,Les Masserons 58420 Chevannes-Changy,58071_1t99r3,G,LES MASSERONS,
878455930,00023,87845593000023,O,2019-05-16,,,,2019-11-14T14:00:46,false,1,,,,,,58420,CHEVANNES-CHANGY,,,58071,,,,,,,,,,,,,,,,,,,2019-05-16,A,,,,,02.10Z,NAFRev2,N,,,0,,,,,,
883098071,00011,88309807100011,O,2020-04-10,,,,2020-04-29T07:23:32,true,1,4 LES MASSERONS,,,,,58420,CHEVANNES-CHANGY,,,58071,,,,,,,,,,,,,,,,,,,2020-04-10,A,,,,,68.20B,NAFRev2,N,3.445796,47.312761,0.93,housenumber,4 Les Masserons 58420 Chevannes-Changy,58071_1t99r3_00004,D,4 LES MASSERONS,
