siren,nic,siret,statutDiffusionEtablissement,dateCreationEtablissement,trancheEffectifsEtablissement,anneeEffectifsEtablissement,activitePrincipaleRegistreMetiersEtablissement,dateDernierTraitementEtablissement,etablissementSiege,nombrePeriodesEtablissement,complementAdresseEtablissement,numeroVoieEtablissement,indiceRepetitionEtablissement,typeVoieEtablissement,libelleVoieEtablissement,codePostalEtablissement,libelleCommuneEtablissement,libelleCommuneEtrangerEtablissement,distributionSpecialeEtablissement,codeCommuneEtablissement,codeCedexEtablissement,libelleCedexEtablissement,codePaysEtrangerEtablissement,libellePaysEtrangerEtablissement,complementAdresse2Etablissement,numeroVoie2Etablissement,indiceRepetition2Etablissement,typeVoie2Etablissement,libelleVoie2Etablissement,codePostal2Etablissement,libelleCommune2Etablissement,libelleCommuneEtranger2Etablissement,distributionSpeciale2Etablissement,codeCommune2Etablissement,codeCedex2Etablissement,libelleCedex2Etablissement,codePaysEtranger2Etablissement,libellePaysEtranger2Etablissement,dateDebut,etatAdministratifEtablissement,enseigne1Etablissement,enseigne2Etablissement,enseigne3Etablissement,denominationUsuelleEtablissement,activitePrincipaleEtablissement,nomenclatureActivitePrincipaleEtablissement,caractereEmployeurEtablissement,longitude,latitude,geo_score,geo_type,geo_adresse,geo_id,geo_ligne,geo_l4,geo_l5
216503672,00018,21650367200018,O,1983-03-01,03,2018,,2020-08-25T10:18:31,true,3,,,,,,65190,POUMAROUS,,,65367,,,,,,,,,,,,,,,,,,,2008-01-01,A,MAIRIE,,,,84.11Z,NAFRev2,N,,,0,,,,,,
266504661,00015,26650466100015,O,1984-11-20,NN,,,2010-06-26T03:14:08,true,3,,,,,MAIRIE,65190,POUMAROUS,,,65367,,,,,,,,,,,,,,,,,,,2008-01-01,A,CCAS,,,,88.99B,NAFRev2,N,3.0709671,50.6304695,0.92,poi.townhall,Hôtel de Ville Lille,https://osm.org/way/40917078,G,,
330159831,00016,33015983100016,O,1984-05-15,NN,,,2008-01-04T19:56:55,true,3,,,,,,65190,POUMAROUS,,,65367,,,,,,,,,,,,,,,,,,,2008-01-01,A,,,,,01.61Z,NAFRev2,N,,,0,,,,,,
382848869,00030,38284886900030,O,1997-06-01,,,,2016-05-26T15:37:49,false,3,,,,,,65190,POUMAROUS,,,65367,,,,,,,,,,,,,,,,,,,1998-09-30,F,,,,,71.4B,NAF1993,N,,,0,,,,,,
385089776,00012,38508977600012,O,1992-01-01,NN,,,2013-12-22T03:24:38,true,4,,,,,,65190,POUMAROUS,,,65367,,,,,,,,,,,,,,,,,,,2013-12-31,F,,,,,01.42Z,NAFRev2,N,,,0,,,,,,
390003010,00019,39000301000019,O,1993-01-01,NN,,4339ZZ,2019-02-02T03:40:18,true,3,,,,,,65190,POUMAROUS,,,65367,,,,,,,,,,,,,,,,,,,2008-01-01,A,,,,,01.42Z,NAFRev2,N,,,0,,,,,,
391354941,00018,39135494100018,O,1992-01-01,NN,,,2008-01-04T23:51:45,true,3,,,,,,65190,POUMAROUS,,,65367,,,,,,,,,,,,,,,,,,,2008-01-01,A,,,,,01.42Z,NAFRev2,N,,,0,,,,,,
407534650,00012,40753465000012,O,,NN,,,,true,1,,,,,,65190,POUMAROUS,,,65367,,,,,,,,,,,,,,,,,,,1997-09-30,F,,,,,92.3B,NAF1993,N,,,0,,,,,,
408465136,00013,40846513600013,O,1996-04-01,NN,,,2008-01-04T21:10:45,true,3,,,,,,65190,POUMAROUS,,,65367,,,,,,,,,,,,,,,,,,,2008-01-01,A,,,,,01.42Z,NAFRev2,N,,,0,,,,,,
411794993,00013,41179499300013,O,1997-04-02,NN,,4322BB,2019-07-01T11:30:04,true,3,,68,,RUE,DU PIC DU MIDI,65190,POUMAROUS,,,65367,,,,,,,,,,,,,,,,,,,2008-01-01,A,,,,,01.42Z,NAFRev2,N,0.212571,43.14471,0.93,housenumber,68 Rue du Pic du Midi 65190 Poumarous,65367_0060_00068,G,68 RUE DU PIC DU MIDI,
414999003,00018,41499900300018,O,1998-01-02,NN,,,2014-06-14T05:05:31,true,6,,,,,CAP DU VILLAGE,65190,POUMAROUS,,,65367,,,,,,,,,,,,,,,,,,,2012-05-31,F,,,,,43.33Z,NAFRev2,O,-0.6799123,44.7866557,0.7,poi.bus_stop,Village Cap de Bos (Arrêt de bus) Pessac,https://osm.org/node/820916234,G,,
419148788,00013,41914878800013,O,1972-01-01,NN,,,2012-07-28T12:22:57,true,4,,,,,,65190,POUMAROUS,,,65367,,,,,,,,,,,,,,,,,,,2009-12-25,F,,,,,01.42Z,NAFRev2,N,,,0,,,,,,
419148796,00016,41914879600016,O,1982-12-31,NN,,,2006-10-28T04:40:51,true,3,,,,,,65190,POUMAROUS,,,65367,,,,,,,,,,,,,,,,,,,2005-11-30,F,,,,,01.1G,NAFRev1,N,,,0,,,,,,
419148804,00018,41914880400018,O,1982-12-31,NN,,,2012-01-02T14:25:51,true,4,,,,,,65190,POUMAROUS,,,65367,,,,,,,,,,,,,,,,,,,2011-12-31,F,,,,,01.42Z,NAFRev2,N,,,0,,,,,,
419148812,00011,41914881200011,O,1982-12-31,NN,,,2008-01-04T23:31:49,true,3,,,,,,65190,POUMAROUS,,,65367,,,,,,,,,,,,,,,,,,,2008-01-01,A,,,,,01.45Z,NAFRev2,N,,,0,,,,,,
419148820,00014,41914882000014,O,1982-12-31,NN,,,2008-01-04T23:31:49,true,3,,,,,,65190,POUMAROUS,,,65367,,,,,,,,,,,,,,,,,,,2008-01-01,A,,,,,01.43Z,NAFRev2,N,,,0,,,,,,
419148838,00016,41914883800016,O,1982-12-31,NN,,,2008-01-04T23:31:49,true,3,,,,,,65190,POUMAROUS,,,65367,,,,,,,,,,,,,,,,,,,2008-01-01,A,,,,,01.42Z,NAFRev2,N,,,0,,,,,,
419148846,00019,41914884600019,O,1990-01-01,NN,,,2020-09-11T04:04:01,true,3,,,,,,65190,POUMAROUS,,,65367,,,,,,,,,,,,,,,,,,,2008-01-01,A,,,,,01.42Z,NAFRev2,N,,,0,,,,,,
419148853,00015,41914885300015,O,1990-01-01,NN,,,,true,1,,,,,,65190,POUMAROUS,,,65367,,,,,,,,,,,,,,,,,,,2000-03-31,F,,,,,01.1A,NAF1993,N,,,0,,,,,,
419148861,00018,41914886100018,O,1982-12-31,NN,,,2018-12-21T10:28:06,true,3,,,,,,65190,POUMAROUS,,,65367,,,,,,,,,,,,,,,,,,,2008-01-01,A,,,,,01.41Z,NAFRev2,N,,,0,,,,,,
419148879,00010,41914887900010,O,1984-12-31,NN,,,2012-12-17T15:08:01,true,4,,,,,,65190,POUMAROUS,,,65367,,,,,,,,,,,,,,,,,,,2012-12-01,A,,,,,01.11Z,NAFRev2,N,,,0,,,,,,
420358301,00018,42035830100018,O,1988-12-31,NN,,,2008-01-04T23:50:44,true,3,,,,,,65190,POUMAROUS,,,65367,,,,,,,,,,,,,,,,,,,2008-01-01,A,,,,,01.11Z,NAFRev2,N,,,0,,,,,,
420358319,00010,42035831900010,O,1982-12-31,NN,,,2012-07-28T14:39:12,true,4,,,,,,65190,POUMAROUS,,,65367,,,,,,,,,,,,,,,,,,,2008-12-25,F,,,,,01.45Z,NAFRev2,N,,,0,,,,,,
420358327,00013,42035832700013,O,1984-12-31,NN,,,,true,1,,,,,,65190,POUMAROUS,,,65367,,,,,,,,,,,,,,,,,,,2002-01-27,F,,,,,01.1G,NAF1993,N,,,0,,,,,,
420358335,00016,42035833500016,O,1982-12-31,NN,,,2006-10-28T04:52:24,true,3,,,,,,65190,POUMAROUS,,,65367,,,,,,,,,,,,,,,,,,,2004-12-31,F,,,,,01.1G,NAFRev1,N,,,0,,,,,,
421312935,00016,42131293500016,O,1998-04-01,NN,,,2020-09-11T04:04:01,true,4,,,,,,65190,POUMAROUS,,,65367,,,,,,,,,,,,,,,,,,,2008-01-01,A,,,,,01.42Z,NAFRev2,N,,,0,,,,,,
422151761,00018,42215176100018,O,1999-01-01,NN,,,2017-02-14T04:51:52,true,4,,,,,,65190,POUMAROUS,,,65367,,,,,,,,,,,,,,,,,,,2017-03-01,F,,,,,01.42Z,NAFRev2,N,,,0,,,,,,
442045803,00024,44204580300024,O,2003-04-19,NN,,4322AZ,2017-08-02T04:34:45,true,8,,,,,,65190,POUMAROUS,,,65367,,,,,,,,,,,,,,,,,,,2017-07-31,F,,,,,43.22A,NAFRev2,N,,,0,,,,,,
479691305,00011,47969130500011,O,2005-01-01,,,,2008-01-05T04:07:59,true,2,QUARTIER LASBORDES,,,,,65190,POUMAROUS,,,65367,,,,,,,,,,,,,,,,,,,2008-01-01,A,,,,,01.11Z,NAFRev2,N,,,0,,,,,,
481020253,00011,48102025300011,O,2005-01-01,,,,2008-01-05T00:19:30,true,2,CENTRE DU VILLAGE,,,,,65190,POUMAROUS,,,65367,,,,,,,,,,,,,,,,,,,2008-01-01,A,,,,,01.42Z,NAFRev2,N,,,0,,,,,,
481911394,00015,48191139400015,O,2005-05-02,NN,,,2008-11-08T02:50:59,true,2,,,,,,65190,POUMAROUS,,,65367,,,,,,,,,,,,,,,,,,,2005-08-02,F,,,,,93.0D,NAFRev1,N,,,0,,,,,,
485278402,00014,48527840200014,O,2005-12-01,,,,2018-12-21T04:00:48,true,2,,,,,,65190,POUMAROUS,,,65367,,,,,,,,,,,,,,,,,,,2008-01-01,A,,,,,01.11Z,NAFRev2,N,,,0,,,,,,
493828586,00013,49382858600013,O,2007-01-10,NN,,,2017-02-28T09:41:00,true,4,,,,,LE CASTET,65190,POUMAROUS,,,65367,,,,,,,,,,,,,,,,,,,2017-01-16,F,,,,,43.32C,NAFRev2,N,-0.4210962,43.0616463,0.88,poi.river,Le Gave d'Ossau (Rivière) Castet,https://osm.org/way/159698546,G,,
499400711,00010,49940071100010,O,2007-09-01,NN,,,2011-04-23T16:45:20,true,4,,,,,CAP DU VILLAGE,65190,POUMAROUS,,,65367,,,,,,,,,,,,,,,,,,,2011-02-28,F,GOLDEN PRESTIGE SECURITE,,,,80.10Z,NAFRev2,O,-0.6799123,44.7866557,0.7,poi.bus_stop,Village Cap de Bos (Arrêt de bus) Pessac,https://osm.org/node/820916234,G,,
502363922,00027,50236392200027,O,2016-10-28,,,,2016-11-03T08:02:18,true,1,,46,,RUE,DU PIC DU MIDI,65190,POUMAROUS,,,65367,,,,,,,,,,,,,,,,,,,2016-10-28,A,,,,,01.49Z,NAFRev2,N,0.212259,43.148956,0.93,housenumber,46 Rue du Pic du Midi 65190 Poumarous,65367_0060_00046,G,46 RUE DU PIC DU MIDI,
504648528,00025,50464852800025,O,2009-09-23,,,,2019-09-03T08:36:30,false,2,,56,,RUE,DU PIC DU MIDI,65190,POUMAROUS,,,65367,,,,,,,,,,,,,,,,,,,2019-08-01,F,,,,,74.90B,NAFRev2,N,0.212372,43.147263,0.93,housenumber,56 Rue du Pic du Midi 65190 Poumarous,65367_0060_00056,G,56 RUE DU PIC DU MIDI,
511687279,00014,51168727900014,O,2009-04-07,,,,2009-04-08T05:17:42,true,1,,,,,QUARTIER LASBORDES,65190,POUMAROUS,,,65367,,,,,,,,,,,,,,,,,,,2009-04-07,A,,,,,01.42Z,NAFRev2,N,,,0,,,,,,
514573393,00014,51457339300014,O,2009-08-12,,,,2009-09-03T05:17:09,true,1,,,,,,65190,POUMAROUS,,,65367,,,,,,,,,,,,,,,,,,,2009-08-12,A,,,,,68.20B,NAFRev2,N,,,0,,,,,,
517457255,00019,51745725500019,O,2009-10-01,,,,2016-02-05T04:11:33,true,4,,6,,CHE,DU CASTET,65190,POUMAROUS,,,65367,,,,,,,,,,,,,,,,,,,2016-01-04,F,,,,,85.59A,NAFRev2,N,0.212528,43.154924,0.81,housenumber,6 Chemin du Castet 65190 Poumarous,65367_0015_00006,G,6 CHEMIN DU CASTET,
517457255,00027,51745725500027,O,2011-05-01,,,,2014-04-10T09:07:19,false,2,,6,,CHE,DU CASTET HOUNT DU CAP,65190,POUMAROUS,,,65367,,,,,,,,,,,,,,,,,,,2012-08-20,F,,,,,85.59A,NAFRev2,N,,,0,,,,,,
518281308,00024,51828130800024,O,2010-01-01,,,,2014-04-14T08:46:13,false,2,,1,,CHE,DE CONQUES,65190,POUMAROUS,,,65367,,,,,,,,,,,,,,,,,,,2013-11-01,F,,,,,85.59B,NAFRev2,N,0.208056,43.143596,0.82,housenumber,1 Chemin de Conques 65190 Poumarous,65367_0025_00001,G,1 CHEMIN DE CONQUES,
525260261,00017,52526026100017,O,2010-12-01,NN,,,2017-05-04T07:07:29,true,1,,3,,CHE,DE LAMARQUE,65190,POUMAROUS,,,65367,,,,,,,,,,,,,,,,,,,2010-12-01,A,,,,,01.46Z,NAFRev2,N,0.222689,43.154645,0.83,housenumber,3 Chemin de Lamarque 65190 Poumarous,65367_0050_00003,G,3 CHEMIN DE LAMARQUE,
531227585,00019,53122758500019,O,2011-04-01,,,,2014-09-28T04:02:46,true,2,,52,,RUE,DU PIC DU MIDI,65190,POUMAROUS,,,65367,,,,,,,,,,,,,,,,,,,2014-09-30,F,,,,MOINET'LAG ENVIRONNEMENT,81.30Z,NAFRev2,N,0.212253,43.148071,0.93,housenumber,52 Rue du Pic du Midi 65190 Poumarous,65367_0060_00052,G,52 RUE DU PIC DU MIDI,
538664855,00011,53866485500011,O,2012-01-01,,,,2011-12-21T08:17:23,true,1,,34,,RUE,DU PIC DU MIDI,65190,POUMAROUS,,,65367,,,,,,,,,,,,,,,,,,,2012-01-01,A,,,,,01.42Z,NAFRev2,N,0.212386,43.151427,0.93,housenumber,34 Rue du Pic du Midi 65190 Poumarous,65367_0060_00034,G,34 RUE DU PIC DU MIDI,
752518696,00014,75251869600014,O,2012-06-01,NN,,4333ZZ,2016-04-26T05:33:03,true,1,,25,,RUE,DU PIC DU MIDI,65190,POUMAROUS,,,65367,,,,,,,,,,,,,,,,,,,2012-06-01,A,,,,,43.33Z,NAFRev2,O,0.212471,43.152029,0.93,housenumber,25 Rue du Pic du Midi 65190 Poumarous,65367_0060_00025,G,25 RUE DU PIC DU MIDI,
777145517,00010,77714551700010,O,,,,,,true,1,,,,,,65190,POUMAROUS,,,65367,,,,,,,,,,,,,,,,,,,1973-12-25,F,,,,,01.4A,NAF1993,N,,,0,,,,,,
777145525,00013,77714552500013,O,,NN,,,,true,1,,,,,,65190,POUMAROUS,,,65367,,,,,,,,,,,,,,,,,,,,F,,,,,22.02,NAP,N,,,0,,,,,,
784144024,00014,78414402400014,O,1900-01-01,NN,,,2008-01-05T03:23:13,true,3,,,,,,65190,POUMAROUS,,,65367,,,,,,,,,,,,,,,,,,,2008-01-01,A,,,,,94.99Z,NAFRev2,N,,,0,,,,,,
790600001,00016,79060000100016,O,2013-01-15,,,,2013-01-20T05:00:16,true,1,,27,,RUE,DU PIC DU MIDI,65190,POUMAROUS,,,65367,,,,,,,,,,,,,,,,,,,2013-01-15,A,,,,,68.20B,NAFRev2,N,0.212405,43.151676,0.93,housenumber,27 Rue du Pic du Midi 65190 Poumarous,65367_0060_00027,G,27 RUE DU PIC DU MIDI,
790600142,00018,79060014200018,O,2013-01-01,,,,2013-01-20T05:04:57,true,1,,3,,RUE,DU PIC DU MIDI,65190,POUMAROUS,,,65367,,,,,,,,,,,,,,,,,,,2013-01-01,A,,,,,01.43Z,NAFRev2,N,0.217856,43.156403,0.93,housenumber,3 Rue du Pic du Midi 65190 Poumarous,65367_0060_00003,G,3 RUE DU PIC DU MIDI,
799281167,00012,79928116700012,O,2014-01-01,,,,2013-12-23T08:20:10,true,1,,29,,RUE,DU PIC DU MIDI,65190,POUMAROUS,,,65367,,,,,,,,,,,,,,,,,,,2014-01-01,A,,,,,01.42Z,NAFRev2,N,0.212439,43.15141,0.93,housenumber,29 Rue du Pic du Midi 65190 Poumarous,65367_0060_00029,G,29 RUE DU PIC DU MIDI,
802803486,00025,80280348600025,O,2018-11-01,,,,2018-12-21T08:13:39,true,1,,39,,RUE,DU PIC DU MIDI,65190,POUMAROUS,,,65367,,,,,,,,,,,,,,,,,,,2018-11-01,A,,,,,01.19Z,NAFRev2,N,0.212334,43.147924,0.93,housenumber,39 Rue du Pic du Midi 65190 Poumarous,65367_0060_00039,G,39 RUE DU PIC DU MIDI,
823537576,00014,82353757600014,O,2016-09-01,01,2018,,2020-08-25T11:31:01,true,1,,,,CHE,DE L'ARRET,65190,POUMAROUS,,,65367,,,,,,,,,,,,,,,,,,,2016-09-01,A,,,,,01.45Z,NAFRev2,N,0.213175,43.162939,0.81,street,Chemin de l'Arrêt 65190 Poumarous,65367_0005,G,CHEMIN DE L ARRET,
825090442,00013,82509044200013,O,2017-01-01,,,,2017-06-07T09:58:20,false,2,,19,,RUE,DU PIC DU MIDI,65190,POUMAROUS,,,65367,,,,,,,,,,,,,,,,,,,2017-02-22,F,,,,,85.59A,NAFRev2,N,0.212853,43.153044,0.93,housenumber,19 Rue du Pic du Midi 65190 Poumarous,65367_0060_00019,G,19 RUE DU PIC DU MIDI,
827909151,00017,82790915100017,O,2017-01-26,,,,2017-02-23T15:15:09,true,1,CHEZ MME STEPHANIE MOINET,52,,RUE,DU PIC DU MIDI,65190,POUMAROUS,,,65367,,,,,,,,,,,,,,,,,,,2017-01-26,A,,,,,93.19Z,NAFRev2,N,0.212253,43.148071,0.93,housenumber,52 Rue du Pic du Midi 65190 Poumarous,65367_0060_00052,G,52 RUE DU PIC DU MIDI,
831865563,00017,83186556300017,O,2017-09-11,,,,2017-09-08T09:19:07,true,1,,11,,CHE,DU CASTET,65190,POUMAROUS,,,65367,,,,,,,,,,,,,,,,,,,2017-09-11,A,,,,,85.52Z,NAFRev2,N,0.216054,43.156526,0.82,housenumber,11 Chemin du Castet 65190 Poumarous,65367_0015_00011,G,11 CHEMIN DU CASTET,
833671068,00017,83367106800017,O,2018-01-01,,,,2017-12-01T03:16:07,true,1,,68,,RUE,DU PIC DU MIDI,65190,POUMAROUS,,,65367,,,,,,,,,,,,,,,,,,,2018-01-01,A,,,,,01.42Z,NAFRev2,N,0.212571,43.14471,0.93,housenumber,68 Rue du Pic du Midi 65190 Poumarous,65367_0060_00068,G,68 RUE DU PIC DU MIDI,
843966904,00016,84396690400016,O,2018-10-22,,,,2018-11-20T14:21:15,true,1,,11,,RUE,DU PIC DU MIDI,65190,POUMAROUS,,,65367,,,,,,,,,,,,,,,,,,,2018-10-22,A,,,,,94.99Z,NAFRev2,N,0.21643,43.155398,0.93,housenumber,11 Rue du Pic du Midi 65190 Poumarous,65367_0060_00011,G,11 RUE DU PIC DU MIDI,
844721472,00018,84472147200018,O,2018-11-01,,,,2019-03-06T03:37:12,true,1,,37,,RUE,DU PIC DU MIDI,65190,POUMAROUS,,,65367,,,,,,,,,,,,,,,,,,,2018-11-01,A,,,,,01.19Z,NAFRev2,N,0.212742,43.148502,0.93,housenumber,37 Rue du Pic du Midi 65190 Poumarous,65367_0060_00037,G,37 RUE DU PIC DU MIDI,
844723452,00018,84472345200018,O,2018-11-01,,,,2018-12-21T04:00:47,true,1,,,,,CAP DU VILLAGE,65190,POUMAROUS,,,65367,,,,,,,,,,,,,,,,,,,2018-11-01,A,,,,,01.19Z,NAFRev2,N,-0.6799123,44.7866557,0.7,poi.bus_stop,Village Cap de Bos (Arrêt de bus) Pessac,https://osm.org/node/820916234,G,,
844726000,00012,84472600000012,O,2018-11-01,,,,2018-12-21T04:00:48,true,1,,50,,RUE,DU PIC DU MIDI,65190,POUMAROUS,,,65367,,,,,,,,,,,,,,,,,,,2018-11-01,A,,,,,01.19Z,NAFRev2,N,0.211596,43.148436,0.93,housenumber,50 Rue du Pic du Midi 65190 Poumarous,65367_0060_00050,G,50 RUE DU PIC DU MIDI,
883124315,00010,88312431500010,O,2020-04-28,,,,2020-09-15T03:39:50,true,2,,9,,RTE,DE TOURNAY,65190,POUMAROUS,,,65367,,,,,,,,,,,,,,,,,,,2020-07-06,F,,,,,47.99A,NAFRev2,N,0.224704,43.167402,0.82,housenumber,9 Route de Tournay 65190 Poumarous,65367_0070_00009,G,9 ROUTE DE TOURNAY,
888801206,00010,88880120600010,O,2020-10-01,,,,2020-09-11T04:04:01,true,1,,35,,RUE,DU PIC DU MIDI,65190,POUMAROUS,,,65367,,,,,,,,,,,,,,,,,,,2020-10-01,A,,,,,01.42Z,NAFRev2,N,0.212399,43.14917,0.93,housenumber,35 Rue du Pic du Midi 65190 Poumarous,65367_0060_00035,G,35 RUE DU PIC DU MIDI,
