siren,nic,siret,statutDiffusionEtablissement,dateCreationEtablissement,trancheEffectifsEtablissement,anneeEffectifsEtablissement,activitePrincipaleRegistreMetiersEtablissement,dateDernierTraitementEtablissement,etablissementSiege,nombrePeriodesEtablissement,complementAdresseEtablissement,numeroVoieEtablissement,indiceRepetitionEtablissement,typeVoieEtablissement,libelleVoieEtablissement,codePostalEtablissement,libelleCommuneEtablissement,libelleCommuneEtrangerEtablissement,distributionSpecialeEtablissement,codeCommuneEtablissement,codeCedexEtablissement,libelleCedexEtablissement,codePaysEtrangerEtablissement,libellePaysEtrangerEtablissement,complementAdresse2Etablissement,numeroVoie2Etablissement,indiceRepetition2Etablissement,typeVoie2Etablissement,libelleVoie2Etablissement,codePostal2Etablissement,libelleCommune2Etablissement,libelleCommuneEtranger2Etablissement,distributionSpeciale2Etablissement,codeCommune2Etablissement,codeCedex2Etablissement,libelleCedex2Etablissement,codePaysEtranger2Etablissement,libellePaysEtranger2Etablissement,dateDebut,etatAdministratifEtablissement,enseigne1Etablissement,enseigne2Etablissement,enseigne3Etablissement,denominationUsuelleEtablissement,activitePrincipaleEtablissement,nomenclatureActivitePrincipaleEtablissement,caractereEmployeurEtablissement,longitude,latitude,geo_score,geo_type,geo_adresse,geo_id,geo_ligne,geo_l4,geo_l5
180089468,00011,18008946800011,O,1992-12-23,,,,2008-01-04T18:17:56,true,3,BETINA SELECTION,,,,,56250,TREDION,,,56254,,,,,,,,,,,,,,,,,,,2008-01-01,A,,,,,84.11Z,NAFRev2,N,,,0,,,,,,
215602541,00017,21560254100017,O,1983-03-01,NN,,,2016-04-26T01:24:33,false,4,,1,,RUE,SAINT MARTIN,56250,TREDION,,,56254,,,,,,,,,,,,,,,,,,,2011-07-01,F,MAIRIE,,,,84.11Z,NAFRev2,O,-2.594739,47.792746,0.94,housenumber,1 Rue Saint Martin 56250 Trédion,56254_0165_00001,G,1 RUE SAINT MARTIN,
215602541,00025,21560254100025,O,1994-12-25,NN,,,2015-12-01T16:26:50,false,2,MAIRIE,,,PL,SAINT CHRISTOPHE,56250,TREDION,,,56254,,,,,,,,,,,,,,,,,,,2008-01-01,A,SERVICE D'ASSAINISSEMENT,,,,37.00Z,NAFRev2,N,-2.591215,47.79296,0.85,street,Place Saint Christophe 56250 Trédion,56254_0030,G,PLACE SAINT CHRISTOPHE,
215602541,00033,21560254100033,O,2001-11-23,NN,,,2015-12-01T16:29:13,false,4,MAIRIE,,,PL,SAINT CHRISTOPHE,56250,TREDION,,,56254,,,,,,,,,,,,,,,,,,,2012-12-25,F,LOTISSEMENT COMMUNAL,,,,42.99Z,NAFRev2,N,-2.591215,47.79296,0.85,street,Place Saint Christophe 56250 Trédion,56254_0030,G,PLACE SAINT CHRISTOPHE,
215602541,00041,21560254100041,O,1984-05-01,NN,,,2008-01-04T18:36:44,false,3,,,,,ETANG AUX BICHES,56250,TREDION,,,56254,,,,,,,,,,,,,,,,,,,2008-01-01,A,CAMPING L'ETANG AUX BICHES,,,,55.30Z,NAFRev2,N,-2.590717,47.782952,0.93,locality,L'Etang aux Biches 56250 Trédion,56254_b286,G,L ETANG AUX BICHES,
215602541,00058,21560254100058,O,2005-01-01,,,,2015-12-01T16:32:18,false,2,MAIRIE,,,PL,SAINT CHRISTOPHE,56250,TREDION,,,56254,,,,,,,,,,,,,,,,,,,2008-01-01,A,LOCATION LOCAL COMMERCIAL,,,,68.20B,NAFRev2,N,-2.591215,47.79296,0.85,street,Place Saint Christophe 56250 Trédion,56254_0030,G,PLACE SAINT CHRISTOPHE,
215602541,00066,21560254100066,O,2005-01-01,,,,2015-12-01T16:36:22,false,2,MAIRIE,,,PL,SAINT CHRISTOPHE,56250,TREDION,,,56254,,,,,,,,,,,,,,,,,,,2008-01-01,A,LOTISSEMENT DES BICHES,,,,42.99Z,NAFRev2,N,-2.591215,47.79296,0.85,street,Place Saint Christophe 56250 Trédion,56254_0030,G,PLACE SAINT CHRISTOPHE,
215602541,00074,21560254100074,O,2005-04-18,NN,,,2006-10-26T23:41:11,false,1,MAIRIE,,,RUE,SAINT MARTIN,56250,TREDION,,,56254,,,,,,,,,,,,,,,,,,,2005-04-18,F,LOCATION LOCAL COMMERCE DE PROXIMITE,,,,70.2C,NAFRev1,N,-2.594739,47.792746,0.94,street,Rue Saint Martin 56250 Trédion,56254_0165,G,RUE SAINT MARTIN,
215602541,00124,21560254100124,O,2011-07-01,03,2018,,2020-08-25T10:17:51,true,1,,,,PL,SAINT CHRISTOPHE,56250,TREDION,,,56254,,,,,,,,,,,,,,,,,,,2011-07-01,A,MAIRIE,,,,84.11Z,NAFRev2,O,-2.591215,47.79296,0.85,street,Place Saint Christophe 56250 Trédion,56254_0030,G,PLACE SAINT CHRISTOPHE,
265603209,00015,26560320900015,O,1985-11-19,NN,,,2015-12-01T16:49:00,false,4,MAIRIE,,,RUE,SAINT MARTIN,56250,TREDION,,,56254,,,,,,,,,,,,,,,,,,,2011-07-01,F,CCAS,,,,88.99B,NAFRev2,N,-2.594739,47.792746,0.94,street,Rue Saint Martin 56250 Trédion,56254_0165,G,RUE SAINT MARTIN,
265603209,00023,26560320900023,O,2011-07-01,,,,2015-12-01T16:49:00,true,1,,,,PL,SAINT CHRISTOPHE,56250,TREDION,,,56254,,,,,,,,,,,,,,,,,,,2011-07-01,A,,,,,88.99B,NAFRev2,N,-2.591215,47.79296,0.85,street,Place Saint Christophe 56250 Trédion,56254_0030,G,PLACE SAINT CHRISTOPHE,
300872348,00010,30087234800010,O,,NN,,,,true,1,,,,,LE PETIT VILLENEUVE,56250,TREDION,,,56254,,,,,,,,,,,,,,,,,,,1994-08-31,F,,,,,74.2A,NAF1993,N,-2.591678,47.800519,0.94,locality,Le Petit Villeneuve 56250 Trédion,56254_b550,G,LE PETIT VILLENEUVE,
302646518,00019,30264651800019,O,,NN,,,,true,1,,,,,BOURG,56250,TREDION,,,56254,,,,,,,,,,,,,,,,,,,1994-01-24,F,,,,,55.3A,NAF1993,O,-1.229143,44.2011043,0.89,poi.school,École du bourg Mimizan,https://osm.org/way/35215942,G,,
304914062,00035,30491406200035,O,2012-03-01,,,,2012-03-23T11:00:04,false,1,,,,,ROUTE DE SERENT,56250,TREDION,,,56254,,,,,,,,,,,,,,,,,,,2012-03-01,A,,,,,10.11Z,NAFRev2,N,-2.594377,47.800168,0.43,locality,Route du Moulin à Papier 56250 Trédion,56254_0100,G,ROUTE DU MOULIN A PAPIER,
305414260,00011,30541426000011,O,,,,,,true,1,,,,,,56250,TREDION,,,56254,,,,,,,,,,,,,,,,,,,1984-12-25,F,,,,,62.43,NAP,N,,,0,,,,,,
309924553,00014,30992455300014,O,1977-01-01,NN,,,2008-11-07T00:24:50,true,4,,,,,BOURG,56250,TREDION,,,56254,,,,,,,,,,,,,,,,,,,2003-03-31,F,,,,,60.2E,NAFRev1,N,-1.229143,44.2011043,0.89,poi.school,École du bourg Mimizan,https://osm.org/way/35215942,G,,
310381629,00024,31038162900024,O,1981-03-01,03,2018,,2020-08-25T10:24:36,true,4,,,,,DOMAINE CHATEAU TREDION,56250,TREDION,,,56254,,,,,,,,,,,,,,,,,,,2008-01-01,A,,,,,56.21Z,NAFRev2,O,-2.595025,47.792578,0.63,street,Rue du Chateau 56250 Trédion,56254_0028,G,RUE DU CHATEAU,
310976857,00014,31097685700014,O,,,,,,true,1,,,,,MONTLERY,56250,TREDION,,,56254,,,,,,,,,,,,,,,,,,,1984-12-25,F,,,,,54.08,NAP,N,2.2704191,48.6363809,0.79,poi.townhall,Mairie de Monthléry (Hôtel de ville) Montlhéry,https://osm.org/way/146009743,G,,
311488076,00010,31148807600010,O,1977-01-01,NN,,4391BZ,2016-04-26T02:03:34,true,5,,13,,RUE,DU CALVAIRE,56250,TREDION,,,56254,,,,,,,,,,,,,,,,,,,2014-07-31,F,,,,,43.91B,NAFRev2,N,-2.592797,47.793639,0.94,housenumber,13 Rue du Calvaire 56250 Trédion,56254_0022_00013,G,13 RUE DU CALVAIRE,
312575434,00021,31257543400021,O,2004-06-25,01,2018,,2020-08-25T10:25:26,true,4,LIEUDIT DOMAINE DU CHATEAU,,,RUE,DE LANVAUX,56250,TREDION,,,56254,,,,,,,,,,,,,,,,,,,2008-01-01,A,,,,,68.31Z,NAFRev2,O,-2.59185,47.788807,0.94,street,Rue de Lanvaux 56250 Trédion,56254_0080,G,RUE DE LANVAUX,
314653049,00010,31465304900010,O,1978-01-01,NN,,,,true,1,,,,,BOURG,56250,TREDION,,,56254,,,,,,,,,,,,,,,,,,,2002-10-31,F,,,,,52.1B,NAF1993,N,-1.229143,44.2011043,0.89,poi.school,École du bourg Mimizan,https://osm.org/way/35215942,G,,
314906314,00021,31490631400021,O,,NN,,,,true,1,,,,,DOMAINE,56250,TREDION,,,56254,,,,,,,,,,,,,,,,,,,,F,,,,,77.01,NAP,N,-2.55765,47.785081,0.46,locality,Clos de la Fontaine 56250 Trédion,56254_b155,G,CLOS DE LA FONTAINE,
316694744,00079,31669474400079,O,1997-12-30,00,2018,,2020-08-25T10:27:00,false,4,,,,,LE BEAU CHENE,56250,TREDION,,,56254,,,,,,,,,,,,,,,,,,,2016-01-27,A,,,,,01.47Z,NAFRev2,N,5.3060484,45.8226767,0.82,poi.track,Chemin de Beau Chêne La Balme-les-Grottes,https://osm.org/way/307214473,G,,
317865905,00010,31786590500010,O,1980-01-01,03,2018,,2020-08-25T10:27:30,true,4,,,,HAM,DE LE FOURNEAU,56250,TREDION,,,56254,,,,,,,,,,,,,,,,,,,2008-01-01,A,,,,,85.20Z,NAFRev2,O,-2.590947,47.788245,0.39,street,Ruelle de la Fontaine 56250 Trédion,56254_0067,G,RUELLE DE LA FONTAINE,
320844137,00010,32084413700010,O,,NN,,,,true,1,,,,,VENISE EN TREDION,56250,TREDION,,,56254,,,,,,,,,,,,,,,,,,,1996-03-31,F,,,,,51.1A,NAF1993,N,-2.592051,47.790481,0.73,street,Impasse de Venise 56250 Trédion,56254_0180,G,IMPASSE DE VENISE,
321348096,00058,32134809600058,O,1993-09-10,NN,,,2006-11-25T09:49:28,false,3,,,,,CHATEAU,56250,TREDION,,,56254,,,,,,,,,,,,,,,,,,,1993-12-25,F,,,,,70.2C,NAF1993,N,-2.595025,47.792578,0.92,street,Rue du Chateau 56250 Trédion,56254_0028,G,RUE DU CHATEAU,
321575136,00015,32157513600015,O,,,,,,true,1,,,,,MONHERY,56250,TREDION,,,56254,,,,,,,,,,,,,,,,,,,1984-12-25,F,,,,,57.11,NAP,N,,,0,,,,,,
322309758,00033,32230975800033,O,1997-01-01,NN,,,2009-12-23T08:29:36,true,5,,,,,CHEMAROT,56250,TREDION,,,56254,,,,,,,,,,,,,,,,,,,2008-01-01,F,,,,,86.90D,NAFRev2,N,,,0,,,,,,
322512096,00023,32251209600023,O,1988-01-02,NN,,,,false,4,,,,IMP,KERGRAS,56250,TREDION,,,56254,,,,,,,,,,,,,,,,,,,2002-07-01,F,,,,,92.3A,NAF1993,N,-2.593315,47.790292,0.62,locality,Courtil sur Kergras 56250 Trédion,56254_b278,G,COURTIL SUR KERGRAS,
322571605,00011,32257160500011,O,1981-01-01,NN,,,,false,4,,,,,BOURG,56250,TREDION,,,56254,,,,,,,,,,,,,,,,,,,2001-12-31,F,CAFE DU SABOT D OR,,,,70.2C,NAF1993,N,-1.229143,44.2011043,0.89,poi.school,École du bourg Mimizan,https://osm.org/way/35215942,G,,
322571605,00029,32257160500029,O,1981-01-01,NN,,,2008-01-04T18:37:08,true,3,,,,,VILG LE SABOT,56250,TREDION,,,56254,,,,,,,,,,,,,,,,,,,2008-01-01,A,,,,,68.20B,NAFRev2,N,-2.590968,47.789025,0.62,street,Ld le Sabot 56250 Trédion,56254_kjcre5,G,LD LE SABOT,
323358283,00014,32335828300014,O,,NN,,,,true,1,,,,CHE,DU LERMAN,56250,TREDION,,,56254,,,,,,,,,,,,,,,,,,,1993-12-31,F,,,,,74.1G,NAF1993,N,-2.587699,47.784111,0.61,street,Chemin de Lerman 56250 Trédion,56254_0085,G,CHEMIN DE LERMAN,
325967891,00012,32596789100012,O,1982-12-07,NN,,,,true,3,,,,,LA VILLE GAZIO,56250,TREDION,,,56254,,,,,,,,,,,,,,,,,,,1993-05-10,F,,,,,02.0B,NAF1993,N,-2.554496,47.791224,0.94,locality,La Ville Gazio 56250 Trédion,56254_b749,G,LA VILLE GAZIO,
326989407,00019,32698940700019,O,1983-03-01,,,,,false,4,,,,RUE,SAINT MARTIN,56250,TREDION,,,56254,,,,,,,,,,,,,,,,,,,1995-09-30,F,,,,,52.2C,NAF1993,N,-2.594739,47.792746,0.94,street,Rue Saint Martin 56250 Trédion,56254_0165,G,RUE SAINT MARTIN,
327585139,00030,32758513900030,O,,NN,,,,true,1,,,,,LE BURNOT,56250,TREDION,,,56254,,,,,,,,,,,,,,,,,,,1993-04-30,F,,,,,45.2V,NAF1993,N,-2.590968,47.789025,0.37,street,Ld le Sabot 56250 Trédion,56254_kjcre5,G,LD LE SABOT,
327890133,00017,32789013300017,O,,NN,,,,true,1,,,,,BOURG,56250,TREDION,,,56254,,,,,,,,,,,,,,,,,,,1995-10-24,F,,,,,55.4B,NAF1993,N,-1.229143,44.2011043,0.89,poi.school,École du bourg Mimizan,https://osm.org/way/35215942,G,,
328671334,00030,32867133400030,O,2009-05-14,,,,2012-11-09T00:26:08,true,1,,,,,LE PIGEON BLANC,56250,TREDION,,,56254,,,,,,,,,,,,,,,,,,,2009-05-14,A,,,,,43.39Z,NAFRev2,N,-2.605239,47.782981,0.94,locality,Le Pigeon Blanc 56250 Trédion,56254_b557,G,LE PIGEON BLANC,
330757659,00017,33075765900017,O,1984-10-02,NN,,,2008-11-07T00:49:18,false,4,,,,,LE FRENE,56250,TREDION,,,56254,,,,,,,,,,,,,,,,,,,2004-03-19,F,,,,,45.2J,NAFRev1,O,-2.595298,47.801718,0.41,locality,Le Grand Villeneuve 56250 Trédion,56254_b311,G,LE GRAND VILLENEUVE,
332474949,00028,33247494900028,O,,NN,,,,true,1,,,,LD,BOURG,56250,TREDION,,,56254,,,,,,,,,,,,,,,,,,,1990-08-15,F,,,,,65.03,NAP,N,-1.229143,44.2011043,0.89,poi.school,École du bourg Mimizan,https://osm.org/way/35215942,G,,
332925486,00018,33292548600018,O,,NN,,,,true,1,,,,LD,BLENAN,56250,TREDION,,,56254,,,,,,,,,,,,,,,,,,,,F,,,,,64.45,NAP,N,-2.594366,47.785892,0.92,street,Ld Blenan 56250 Trédion,56254_k778vs,G,LD BLENAN,
333239713,00014,33323971300014,O,1984-01-01,NN,,,2010-08-23T15:04:25,true,4,,,,LD,BEL AIR,56250,TREDION,,,56254,,,,,,,,,,,,,,,,,,,2008-01-01,F,,,,,43.34Z,NAFRev2,N,-2.605249,47.78918,0.94,locality,Bel Air 56250 Trédion,56254_b034,G,BEL AIR,
333239721,00017,33323972100017,O,1984-01-01,NN,,,2007-09-27T09:32:08,true,3,,,,LD,BEL AIR,56250,TREDION,,,56254,,,,,,,,,,,,,,,,,,,2007-07-31,F,,,,,45.4M,NAFRev1,N,-2.605249,47.78918,0.94,locality,Bel Air 56250 Trédion,56254_b034,G,BEL AIR,
337560817,00047,33756081700047,O,1995-05-31,NN,,,,true,1,,,,,ETANG AUX BICHES,56250,TREDION,,,56254,,,,,,,,,,,,,,,,,,,2002-09-30,F,,,,,45.4D,NAF1993,N,-2.590717,47.782952,0.93,locality,L'Etang aux Biches 56250 Trédion,56254_b286,G,L ETANG AUX BICHES,
337635882,00026,33763588200026,O,1988-12-25,NN,,,2017-05-04T04:55:55,false,5,,,,,CHETEBAUD,56250,TREDION,,,56254,,,,,,,,,,,,,,,,,,,2015-08-31,F,,,,,81.30Z,NAFRev2,O,,,0,,,,,,
338134869,00019,33813486900019,O,1986-06-01,NN,,,2008-06-05T08:16:10,true,3,,,,,PENHARA,56250,TREDION,,,56254,,,,,,,,,,,,,,,,,,,2008-01-01,A,,,,,01.50Z,NAFRev2,N,,,0,,,,,,
338261845,00030,33826184500030,O,,NN,,,,true,1,,,,,LES PRINCES,56250,TREDION,,,56254,,,,,,,,,,,,,,,,,,,1991-08-31,F,,,,,86.07,NAP,N,-2.612914,47.787139,0.51,locality,Les Grands Pres 56250 Trédion,56254_b321,G,LES GRANDS PRES,
338325400,00020,33832540000020,O,,NN,,,,true,1,,,,LD,LE PARC,56250,TREDION,,,56254,,,,,,,,,,,,,,,,,,,1989-12-31,F,,,,,86.07,NAP,N,-2.605239,47.782981,0.46,locality,Le Pigeon Blanc 56250 Trédion,56254_b557,G,LE PIGEON BLANC,
340322205,00014,34032220500014,O,1987-01-01,01,2018,,2020-08-25T10:39:12,true,4,,,,,CHATEAU DE TREDION,56250,TREDION,,,56254,,,,,,,,,,,,,,,,,,,2008-01-01,A,,,,,68.20A,NAFRev2,O,-2.595025,47.792578,0.74,street,Rue du Chateau 56250 Trédion,56254_0028,G,RUE DU CHATEAU,
342272531,00043,34227253100043,O,1997-12-16,NN,,,,true,1,,5,,PL,DU COMMERCE,56250,TREDION,,,56254,,,,,,,,,,,,,,,,,,,2001-07-19,F,,,,,55.4A,NAF1993,O,-2.592896,47.792841,0.83,housenumber,5 Place du Commerce 56250 Trédion,56254_0040_00005,G,5 PLACE DU COMMERCE,
342390200,00026,34239020000026,O,2012-05-01,,,4334ZC,2017-04-07T19:33:40,true,1,,,,,LE GERET,56250,TREDION,,,56254,,,,,,,,,,,,,,,,,,,2012-05-01,A,,,,,43.34Z,NAFRev2,N,-2.58611,47.78792,0.61,street,Ld le Gerpil 56250 Trédion,56254_6s1jik,G,LD LE GERPIL,
343427373,00026,34342737300026,O,2005-12-02,NN,,,2014-07-08T00:48:06,true,3,,,,PL,ST CHRISTOPHE,56250,TREDION,,,56254,,,,,,,,,,,,,,,,,,,2008-12-31,F,VIVAL,,,,47.22Z,NAFRev2,O,-2.591215,47.79296,0.73,street,Place Saint Christophe 56250 Trédion,56254_0030,G,PLACE SAINT CHRISTOPHE,
344275672,00014,34427567200014,O,,NN,,,,true,1,,,,,LE GRAND VILLENEUVE,56250,TREDION,,,56254,,,,,,,,,,,,,,,,,,,1989-06-30,F,,,,,02.20,NAP,N,-2.595298,47.801718,0.94,locality,Le Grand Villeneuve 56250 Trédion,56254_b311,G,LE GRAND VILLENEUVE,
344456926,00015,34445692600015,O,,NN,,,,true,1,,,,,BOURG,56250,TREDION,,,56254,,,,,,,,,,,,,,,,,,,1991-05-31,F,,,,,55.10,NAP,N,-1.229143,44.2011043,0.89,poi.school,École du bourg Mimizan,https://osm.org/way/35215942,G,,
345133672,00021,34513367200021,O,2006-07-11,,,1089ZZ,2015-03-17T00:27:34,true,2,,,,,LE BOFFO,56250,TREDION,,,56254,,,,,,,,,,,,,,,,,,,2008-01-01,A,PIZZA MOBILE,,,,56.10C,NAFRev2,N,-2.590968,47.789025,0.31,street,Ld le Sabot 56250 Trédion,56254_kjcre5,G,LD LE SABOT,
347650814,00010,34765081400010,O,,NN,,,,true,1,,,,,LES PRINCES,56250,TREDION,,,56254,,,,,,,,,,,,,,,,,,,1991-01-31,F,,,,,02.20,NAP,N,-2.612914,47.787139,0.51,locality,Les Grands Pres 56250 Trédion,56254_b321,G,LES GRANDS PRES,
347666067,00017,34766606700017,O,,NN,,,,true,1,,,,,LE PRADI,56250,TREDION,,,56254,,,,,,,,,,,,,,,,,,,1988-03-15,F,,,,,78.02,NAP,N,-2.59293,47.79515,0.61,street,Lieu Dit la Noe du Pradi 56250 Trédion,56254_b476,G,LIEU DIT LA NOE DU PRADI,
347735250,00024,34773525000024,O,2002-06-30,NN,,,2008-01-05T19:37:56,true,3,ZAC DU POULFANC,,,RUE,DE LORRAINE,56250,TREDION,,,56254,,,,,,,,,,,,,,,,,,,2008-01-01,A,,,,,68.20B,NAFRev2,N,-2.590947,47.788245,0.6,street,Ruelle de la Fontaine 56250 Trédion,56254_0067,G,RUELLE DE LA FONTAINE,
349747709,00013,34974770900013,O,1989-01-01,NN,,,,true,3,LE SABOT,,,,BOURG,56250,TREDION,,,56254,,,,,,,,,,,,,,,,,,,1993-12-25,F,,,,,55.4B,NAF1993,N,-2.590968,47.789025,0.58,street,Ld le Sabot 56250 Trédion,56254_kjcre5,D,LD LE SABOT,
350019261,00022,35001926100022,O,2007-06-30,,,,2010-09-14T06:06:33,false,3,,18,,RUE,DU CALVAIRE,56250,TREDION,,,56254,,,,,,,,,,,,,,,,,,,2010-06-30,F,,,,,21.20Z,NAFRev2,N,-2.592675,47.79391,0.94,housenumber,18 Rue du Calvaire 56250 Trédion,56254_0022_00018,G,18 RUE DU CALVAIRE,
351447651,00016,35144765100016,O,1989-07-10,NN,,,2006-11-25T11:09:00,true,1,,,,,BOURG,56250,TREDION,,,56254,,,,,,,,,,,,,,,,,,,2001-03-01,F,,,,,92.3D,NAF1993,O,-1.229143,44.2011043,0.89,poi.school,École du bourg Mimizan,https://osm.org/way/35215942,G,,
351867783,00018,35186778300018,O,,,,,,true,1,,,,,LE LETY,56250,TREDION,,,56254,,,,,,,,,,,,,,,,,,,1992-03-31,F,,,,,45.4C,NAF1993,N,-2.581995,47.779755,0.51,street,Lieu Dit le Lerman 56250 Trédion,56254_sbv794,G,LIEU DIT LE LERMAN,
352087613,00019,35208761300019,O,1987-01-01,NN,,,,true,1,,,,LD,LE LETY,56250,TREDION,,,56254,,,,,,,,,,,,,,,,,,,1999-04-01,F,,,,,92.4Z,NAF1993,N,-2.581995,47.779755,0.51,street,Lieu Dit le Lerman 56250 Trédion,56254_sbv794,G,LIEU DIT LE LERMAN,
356000539,04393,35600053904393,O,1991-01-01,NN,,,2009-10-17T13:36:08,false,5,,,,PL,DE L EGLISE,56250,TREDION,,,56254,,,,,,,,,,,,,,,,,,,2009-03-18,F,BUREAU DE POSTE,,,,53.10Z,NAFRev2,O,-2.592408,47.793086,0.33,street,Rue de l'Abbé Coëdelo 56250 Trédion,56254_0032,G,RUE DE L ABBE COEDELO,
378146344,00056,37814634400056,O,2013-01-01,,,,2015-06-02T10:53:01,false,2,,12,,RUE,DU CALVAIRE,56250,TREDION,,,56254,,,,,,,,,,,,,,,,,,,2014-12-15,F,,,,BAUDOUIN PAYSAGISTE,81.30Z,NAFRev2,N,-2.592682,47.793576,0.94,housenumber,12 Rue du Calvaire 56250 Trédion,56254_0022_00012,G,12 RUE DU CALVAIRE,
379263619,00056,37926361900056,O,2005-11-30,,,,2008-11-08T00:35:25,true,3,,,,,LE RODOUER,56250,TREDION,,,56254,,,,,,,,,,,,,,,,,,,2008-01-31,F,LA LANDE ENTRETIEN DEPANN,,,,43.22A,NAFRev2,N,-2.588358,47.787954,0.94,street,Le Rodouer 56250 Trédion,56254_pyu2x7,G,LE RODOUER,
379460199,00035,37946019900035,O,2010-12-31,11,2018,,2020-08-25T10:16:22,false,2,,2,,IMP,DE VENISE,56250,TREDION,,,56254,,,,,,,,,,,,,,,,,,,2011-03-08,A,,,,,10.51C,NAFRev2,O,-2.592051,47.790481,0.82,housenumber,2 Impasse de Venise 56250 Trédion,56254_0180_00002,G,2 IMPASSE DE VENISE,
379657174,00049,37965717400049,O,2002-10-28,NN,,,,false,3,,9,,RUE,DE L ABBE COEDELO,56250,TREDION,,,56254,,,,,,,,,,,,,,,,,,,2002-12-25,F,,,,,85.1G,NAF1993,N,-2.590826,47.793394,0.94,housenumber,9 Rue de l'Abbé Coëdelo 56250 Trédion,56254_0032_00009,G,9 RUE DE L ABBE COEDELO,
379657174,00064,37965717400064,O,2003-04-15,NN,,,2006-11-25T11:27:25,false,3,,9,,RUE,ABBE COEDELO,56250,TREDION,,,56254,,,,,,,,,,,,,,,,,,,2006-04-01,F,,,,,85.1G,NAFRev1,N,-2.590826,47.793394,0.88,housenumber,9 Rue de l'Abbé Coëdelo 56250 Trédion,56254_0032_00009,G,9 RUE DE L ABBE COEDELO,
379811359,00015,37981135900015,O,1990-10-13,NN,,,2008-01-05T19:50:01,true,3,,,,,LE BOURG,56250,TREDION,,,56254,,,,,,,,,,,,,,,,,,,2008-01-01,A,,,,,68.20B,NAFRev2,N,-2.591357,47.787782,0.31,locality,Le Clos du Petit Ruisseau 56250 Trédion,56254_b786,G,LE CLOS DU PETIT RUISSEAU,
380302588,00021,38030258800021,O,,,,,,true,1,,,,,LE BEAU CHENE,56250,TREDION,,,56254,,,,,,,,,,,,,,,,,,,1997-12-30,F,,,,,01.2G,NAF1993,N,5.3060484,45.8226767,0.82,poi.track,Chemin de Beau Chêne La Balme-les-Grottes,https://osm.org/way/307214473,G,,
380562660,00064,38056266000064,O,2014-05-05,01,2018,,2020-08-25T10:17:33,true,1,,10,,PL,DU COMMERCE,56250,TREDION,,,56254,,,,,,,,,,,,,,,,,,,2014-05-05,A,LE CHRISTOPHER,,,NIZAN,56.10A,NAFRev2,O,-2.593199,47.79284,0.84,housenumber,10 Place du Commerce 56250 Trédion,56254_0040_00010,G,10 PLACE DU COMMERCE,
381740737,00055,38174073700055,O,2009-08-01,,,,2012-11-09T00:47:04,true,2,,,,,LE RODOUER,56250,TREDION,,,56254,,,,,,,,,,,,,,,,,,,2011-10-31,F,,,,,85.51Z,NAFRev2,N,-2.588358,47.787954,0.94,street,Le Rodouer 56250 Trédion,56254_pyu2x7,G,LE RODOUER,
382455657,00017,38245565700017,O,1991-07-02,NN,,4334ZC,2015-03-18T01:05:22,true,4,,,,,BLENAN,56250,TREDION,,,56254,,,,,,,,,,,,,,,,,,,2014-06-30,F,,,,,43.34Z,NAFRev2,N,-2.594366,47.785892,0.92,street,Ld Blenan 56250 Trédion,56254_k778vs,G,LD BLENAN,
388866451,00031,38886645100031,O,1995-07-04,NN,,2370ZZ,2015-03-18T01:06:05,true,4,,,,,LA GRANDE MARE,56250,TREDION,,,56254,,,,,,,,,,,,,,,,,,,2014-01-07,F,,,,,23.70Z,NAFRev2,N,-2.580677,47.794351,0.94,locality,La Grande Mare 56250 Trédion,56254_b314,G,LA GRANDE MARE,
390358273,00014,39035827300014,O,,NN,,,,true,1,,,,RTE,,56250,TREDION,,,56254,,,,,,,,,,,,,,,,,,,1995-06-30,F,,,,,45.2V,NAF1993,N,-2.594377,47.800168,0.38,locality,Route du Moulin à Papier 56250 Trédion,56254_0100,G,ROUTE DU MOULIN A PAPIER,
390403939,00015,39040393900015,O,,NN,,,,true,1,,,,,BOURG,56250,TREDION,,,56254,,,,,,,,,,,,,,,,,,,1997-12-15,F,,,,,15.8C,NAF1993,O,-1.229143,44.2011043,0.89,poi.school,École du bourg Mimizan,https://osm.org/way/35215942,G,,
390764199,00027,39076419900027,O,2010-11-01,,,,2015-03-30T08:25:39,true,4,,,,,LE GUERET,56250,TREDION,,,56254,,,,,,,,,,,,,,,,,,,2015-03-23,F,,,,,82.99Z,NAFRev2,N,-2.595298,47.801718,0.38,locality,Le Grand Villeneuve 56250 Trédion,56254_b311,G,LE GRAND VILLENEUVE,
392493672,00027,39249367200027,O,2000-01-15,,,,2011-02-01T05:41:46,false,2,,2,,IMP,DE VENISE,56250,TREDION,,,56254,,,,,,,,,,,,,,,,,,,2010-12-31,F,,,,,10.51C,NAFRev2,N,-2.592051,47.790481,0.82,housenumber,2 Impasse de Venise 56250 Trédion,56254_0180_00002,G,2 IMPASSE DE VENISE,
393166608,00017,39316660800017,O,1993-12-01,NN,,,2013-05-18T03:23:01,true,5,,18,,RUE,DU CALVAIRE,56250,TREDION,,,56254,,,,,,,,,,,,,,,,,,,2011-12-28,F,,,,,21.20Z,NAFRev2,O,-2.592675,47.79391,0.94,housenumber,18 Rue du Calvaire 56250 Trédion,56254_0022_00018,G,18 RUE DU CALVAIRE,
393256243,00048,39325624300048,O,1997-12-30,NN,,,2017-05-04T04:02:14,false,5,,,,,LE BEAU CHENE,56250,TREDION,,,56254,,,,,,,,,,,,,,,,,,,2015-08-24,F,,,,,01.47Z,NAFRev2,O,5.3060484,45.8226767,0.82,poi.track,Chemin de Beau Chêne La Balme-les-Grottes,https://osm.org/way/307214473,G,,
394040414,00010,39404041400010,O,1994-02-07,NN,,,,true,1,,,,,BOURG,56250,TREDION,,,56254,,,,,,,,,,,,,,,,,,,2000-09-27,F,,,,,55.3A,NAF1993,O,-1.229143,44.2011043,0.89,poi.school,École du bourg Mimizan,https://osm.org/way/35215942,G,,
394270847,00012,39427084700012,O,1994-01-16,NN,,,2006-11-25T12:22:29,true,1,,,,,BOURG,56250,TREDION,,,56254,,,,,,,,,,,,,,,,,,,2000-09-27,F,,,,,74.1J,NAF1993,N,-1.229143,44.2011043,0.89,poi.school,École du bourg Mimizan,https://osm.org/way/35215942,G,,
394986566,00013,39498656600013,O,,,,,,true,1,,,,,LA VILLE AUX HOUX,56250,TREDION,,,56254,,,,,,,,,,,,,,,,,,,1997-09-30,F,,,,,01.2A,NAF1993,N,-2.601379,47.787296,0.82,street,Lieu Dit la Ville au Houx 56250 Trédion,56254_b747,G,LIEU DIT LA VILLE AU HOUX,
397685504,00011,39768550400011,O,1994-05-01,NN,,,2007-01-18T09:36:17,true,3,,,,LD,LE LETY,56250,TREDION,,,56254,,,,,,,,,,,,,,,,,,,1998-12-25,F,,,,,01.3Z,NAF1993,N,-2.581995,47.779755,0.51,street,Lieu Dit le Lerman 56250 Trédion,56254_sbv794,G,LIEU DIT LE LERMAN,
397685777,00013,39768577700013,O,,NN,,,,true,1,,,,LD,LAURION,56250,TREDION,,,56254,,,,,,,,,,,,,,,,,,,1993-01-01,F,,,,,01.2E,NAF1993,N,-2.568474,47.780239,0.46,locality,Ker Lanvaux 56250 Trédion,56254_b337,G,KER LANVAUX,
398553172,00014,39855317200014,O,1994-10-01,NN,,,2008-01-04T18:52:25,true,3,,,,,KERDOSSAN,56250,TREDION,,,56254,,,,,,,,,,,,,,,,,,,2008-01-01,A,,,,,01.41Z,NAFRev2,N,,,0,,,,,,
399908102,00011,39990810200011,O,1995-01-01,NN,,,2016-04-26T03:23:02,true,3,,,,,LE TEMPLE,56250,TREDION,,,56254,,,,,,,,,,,,,,,,,,,2008-01-01,A,,,,,01.41Z,NAFRev2,N,-2.591678,47.800519,0.41,locality,Le Petit Villeneuve 56250 Trédion,56254_b550,G,LE PETIT VILLENEUVE,
400154324,00018,40015432400018,O,1994-10-01,03,2018,5610CQ,2020-08-25T10:32:39,true,4,,,,,L ETANG AUX BICHES,56250,TREDION,,,56254,,,,,,,,,,,,,,,,,,,2008-01-01,A,,,,,56.10A,NAFRev2,O,-2.590717,47.782952,0.94,locality,L'Etang aux Biches 56250 Trédion,56254_b286,G,L ETANG AUX BICHES,
400649877,00034,40064987700034,O,1998-11-14,NN,,,,true,1,,,,,PIGEON BLANC,56250,TREDION,,,56254,,,,,,,,,,,,,,,,,,,2001-01-15,F,,,,,60.2L,NAF1993,N,-2.605239,47.782981,0.93,locality,Le Pigeon Blanc 56250 Trédion,56254_b557,G,LE PIGEON BLANC,