siren,nic,siret,statutDiffusionEtablissement,dateCreationEtablissement,trancheEffectifsEtablissement,anneeEffectifsEtablissement,activitePrincipaleRegistreMetiersEtablissement,dateDernierTraitementEtablissement,etablissementSiege,nombrePeriodesEtablissement,complementAdresseEtablissement,numeroVoieEtablissement,indiceRepetitionEtablissement,typeVoieEtablissement,libelleVoieEtablissement,codePostalEtablissement,libelleCommuneEtablissement,libelleCommuneEtrangerEtablissement,distributionSpecialeEtablissement,codeCommuneEtablissement,codeCedexEtablissement,libelleCedexEtablissement,codePaysEtrangerEtablissement,libellePaysEtrangerEtablissement,complementAdresse2Etablissement,numeroVoie2Etablissement,indiceRepetition2Etablissement,typeVoie2Etablissement,libelleVoie2Etablissement,codePostal2Etablissement,libelleCommune2Etablissement,libelleCommuneEtranger2Etablissement,distributionSpeciale2Etablissement,codeCommune2Etablissement,codeCedex2Etablissement,libelleCedex2Etablissement,codePaysEtranger2Etablissement,libellePaysEtranger2Etablissement,dateDebut,etatAdministratifEtablissement,enseigne1Etablissement,enseigne2Etablissement,enseigne3Etablissement,denominationUsuelleEtablissement,activitePrincipaleEtablissement,nomenclatureActivitePrincipaleEtablissement,caractereEmployeurEtablissement,longitude,latitude,geo_score,geo_type,geo_adresse,geo_id,geo_ligne,geo_l4,geo_l5
211501374,00014,21150137400014,O,1983-03-01,02,2018,,2020-08-25T10:15:56,true,4,HOTEL DE VILLE,,,,,15380,MOUSSAGES,,,15137,,,,,,,,,,,,,,,,,,,2008-01-01,A,MAIRIE,,,,84.11Z,NAFRev2,O,,,0,,,,,,
211501374,00022,21150137400022,O,1983-12-21,01,2018,,2020-08-25T10:15:56,false,3,,,,,LE BOURG,15380,MOUSSAGES,,,15137,,,,,,,,,,,,,,,,,,,2008-01-01,A,ECOLE ELEMENTAIRE PUBLIQUE,,,,85.20Z,NAFRev2,N,2.472342,45.243854,0.7,street,Lieu Dit le Suc de Bouriannes 15380 Moussages,15137_b096,G,LIEU DIT LE SUC DE BOURIANNES,
211501374,00030,21150137400030,O,1996-01-01,NN,,,2008-01-04T18:26:38,false,3,MAIRIE,,,,,15380,MOUSSAGES,,,15137,,,,,,,,,,,,,,,,,,,2008-01-01,A,CAMPING MUNICIPAL DE MOUSSAGES,,,,55.30Z,NAFRev2,N,,,0,,,,,,
211501374,00048,21150137400048,O,1995-12-25,NN,,,2008-01-04T18:26:38,false,2,MAIRIE,,,,,15380,MOUSSAGES,,,15137,,,,,,,,,,,,,,,,,,,2008-01-01,A,SCE ASSAINISSEMENT,,,,37.00Z,NAFRev2,N,,,0,,,,,,
211501374,00055,21150137400055,O,1995-12-25,NN,,,2015-05-14T03:30:07,false,2,MAIRIE,,,,,15380,MOUSSAGES,,,15137,,,,,,,,,,,,,,,,,,,2008-01-01,A,SCE TRANSPORTS SCOLAIRES,,,,49.39A,NAFRev2,N,,,0,,,,,,
251500302,00012,25150030200012,O,1983-03-01,02,2018,,2020-08-25T10:20:15,true,4,MAIRIE,,,,,15380,MOUSSAGES,,,15137,,,,,,,,,,,,,,,,,,,2011-12-31,A,,,,,36.00Z,NAFRev2,O,,,0,,,,,,
261501209,00017,26150120900017,O,1983-03-01,NN,,,2010-06-26T03:05:13,true,3,,,,,,15380,MOUSSAGES,,,15137,,,,,,,,,,,,,,,,,,,2008-01-01,A,CDE,,,,88.99B,NAFRev2,N,,,0,,,,,,
261503668,00012,26150366800012,O,1983-09-27,NN,,,2017-08-06T14:08:28,true,4,MAIRIE,,,,,15380,MOUSSAGES,,,15137,,,,,,,,,,,,,,,,,,,2017-08-01,F,CCAS,,,,88.99B,NAFRev2,N,,,0,,,,,,
271500407,00017,27150040700017,O,,NN,,,2008-04-26T08:32:04,true,1,,,,,,15380,MOUSSAGES,,,15137,,,,,,,,,,,,,,,,,,,1995-12-25,F,,,,,60.2B,NAF1993,N,,,0,,,,,,
300010915,00019,30001091500019,O,1963-01-01,NN,,,2008-11-07T00:16:28,true,3,,,,LD,FRESSANGES,15380,MOUSSAGES,,,15137,,,,,,,,,,,,,,,,,,,2007-12-31,F,,,,,45.4D,NAFRev1,N,1.4122215,45.6587674,0.89,poi.stream,Le Fressanges (Ruisseau) Vicq-sur-Breuilh,https://osm.org/way/268030960,G,,
300516283,00011,30051628300011,O,1974-01-01,NN,,,,true,1,,,,,,15380,MOUSSAGES,,,15137,,,,,,,,,,,,,,,,,,,1998-12-31,F,,,,,52.1B,NAF1993,N,,,0,,,,,,
303254908,00013,30325490800013,O,,NN,,,,true,1,,,,,VEYSSET,15380,MOUSSAGES,,,15137,,,,,,,,,,,,,,,,,,,1985-09-21,F,,,,,38.50,NAP,N,2.445921,45.240017,0.93,street,Veysset 15380 Moussages,15137_j44n2w,G,VEYSSET,
315488718,00034,31548871800034,O,1997-01-01,,,,,false,2,,,,,CELLES,15380,MOUSSAGES,,,15137,,,,,,,,,,,,,,,,,,,1997-12-25,F,,,,,70.2B,NAF1993,N,2.465877,45.247267,0.91,street,Lieu Dit Celles 15380 Moussages,15137_wsy403,G,LIEU DIT CELLES,
315488718,00067,31548871800067,O,2009-04-01,,,,2013-02-21T11:10:34,true,2,,,,,BACHELUZE,15380,MOUSSAGES,,,15137,,,,,,,,,,,,,,,,,,,2009-04-01,F,,,,,01.19Z,NAFRev2,N,2.495275,45.223513,0.91,street,Lieu Dit Bacheluze 15380 Moussages,15137_6ptr1d,G,LIEU DIT BACHELUZE,
317230191,00015,31723019100015,O,,NN,,,,true,1,,,,,FRESSANGES,15380,MOUSSAGES,,,15137,,,,,,,,,,,,,,,,,,,,F,,,,,55.60,NAP,N,1.4122215,45.6587674,0.89,poi.stream,Le Fressanges (Ruisseau) Vicq-sur-Breuilh,https://osm.org/way/268030960,G,,
320461767,00016,32046176700016,O,1980-12-01,,,,,true,1,,,,,LASSAGNE,15380,MOUSSAGES,,,15137,,,,,,,,,,,,,,,,,,,2000-07-04,F,,,,,01.2J,NAF1993,N,2.517249,45.221825,0.71,street,La Sagne 15380 Moussages,15137_j52o2n,G,LA SAGNE,
324203892,00017,32420389200017,O,1982-03-24,NN,,,2008-01-04T18:54:30,true,3,,,,,MAIRIE,15380,MOUSSAGES,,,15137,,,,,,,,,,,,,,,,,,,2008-01-01,A,,,,,77.31Z,NAFRev2,N,3.0709671,50.6304695,0.92,poi.townhall,Hôtel de Ville Lille,https://osm.org/way/40917078,G,,
324503523,00015,32450352300015,O,,NN,,,,true,1,,,,RTE,DE MAURIAC,15380,MOUSSAGES,,,15137,,,,,,,,,,,,,,,,,,,1989-08-01,F,,,,,60.01,NAP,N,2.456316,45.23885,0.62,street,Route Mauriac 15380 Moussages,15137_bn5zz1,G,ROUTE MAURIAC,
327882023,00010,32788202300010,O,,NN,,,,true,1,,,,,VEYSSET,15380,MOUSSAGES,,,15137,,,,,,,,,,,,,,,,,,,2001-11-30,F,,,,,01.1A,NAF1993,N,2.445921,45.240017,0.93,street,Veysset 15380 Moussages,15137_j44n2w,G,VEYSSET,
328156211,00018,32815621100018,O,1983-07-01,NN,,,2015-05-14T06:08:49,true,5,,,,,,15380,MOUSSAGES,,,15137,,,,,,,,,,,,,,,,,,,2013-03-31,F,,,,,10.71C,NAFRev2,O,,,0,,,,,,
329384333,00046,32938433300046,O,1900-01-01,NN,,,2006-12-15T00:24:49,false,3,,,,,,15380,MOUSSAGES,,,15137,,,,,,,,,,,,,,,,,,,1992-12-31,F,,,,,51.1R,NAF1993,N,,,0,,,,,,
331723999,00016,33172399900016,O,1984-07-10,NN,,,2006-10-27T02:13:56,true,3,,,,,LES TONELS,15380,MOUSSAGES,,,15137,,,,,,,,,,,,,,,,,,,2005-05-02,F,,,,,01.2A,NAFRev1,N,2.0403602,48.777693,0.72,poi.footway,Chemin des Tonelles (Chemin piéton) Montigny-le-Bretonneux,https://osm.org/way/49835959,G,,
332079417,00025,33207941700025,O,2001-09-24,01,2018,,2020-08-25T10:35:23,true,12,,,,,LE BOURG,15380,MOUSSAGES,,,15137,,,,,,,,,,,,,,,,,,,2015-08-04,A,,,,,43.12A,NAFRev2,O,2.472342,45.243854,0.7,street,Lieu Dit le Suc de Bouriannes 15380 Moussages,15137_b096,G,LIEU DIT LE SUC DE BOURIANNES,
334346210,00019,33434621000019,O,1986-01-06,NN,,,,false,3,,,,,,15380,MOUSSAGES,,,15137,,,,,,,,,,,,,,,,,,,1993-08-01,F,,,,,85.1G,NAF1993,N,,,0,,,,,,
347476541,00029,34747654100029,O,1999-06-01,NN,,,,true,1,,,,,LE BOURG,15380,MOUSSAGES,,,15137,,,,,,,,,,,,,,,,,,,2001-09-30,F,,,,,55.1A,NAF1993,N,2.472342,45.243854,0.7,street,Lieu Dit le Suc de Bouriannes 15380 Moussages,15137_b096,G,LIEU DIT LE SUC DE BOURIANNES,
352963136,00010,35296313600010,O,1990-01-01,NN,,,2008-01-04T23:48:49,true,3,,,,,VALANS,15380,MOUSSAGES,,,15137,,,,,,,,,,,,,,,,,,,2008-01-01,A,,,,,01.42Z,NAFRev2,N,2.505867,45.229345,0.91,street,Lieu Dit Valans 15380 Moussages,15137_o540ja,G,LIEU DIT VALANS,
353304058,00012,35330405800012,O,1990-01-25,NN,,,2013-01-10T05:19:27,true,3,,,,,VALAN,15380,MOUSSAGES,,,15137,,,,,,,,,,,,,,,,,,,2008-01-01,A,,,,,01.42Z,NAFRev2,N,2.505867,45.229345,0.74,street,Lieu Dit Valans 15380 Moussages,15137_o540ja,G,LIEU DIT VALANS,
353866734,00026,35386673400026,O,2008-12-31,,,,2017-03-22T10:29:48,true,1,,,,LD,FRESSANGES,15380,MOUSSAGES,,,15137,,,,,,,,,,,,,,,,,,,2008-12-31,A,,,,,68.20A,NAFRev2,N,1.4122215,45.6587674,0.89,poi.stream,Le Fressanges (Ruisseau) Vicq-sur-Breuilh,https://osm.org/way/268030960,G,,
377968789,00075,37796878900075,O,2003-09-19,NN,,,2010-08-18T05:49:29,false,5,,,,,ROUTE DE MAURIAC,15380,MOUSSAGES,,,15137,,,,,,,,,,,,,,,,,,,2010-02-01,A,,,,,59.13A,NAFRev2,N,2.456316,45.23885,0.79,street,Route Mauriac 15380 Moussages,15137_bn5zz1,G,ROUTE MAURIAC,
377968789,00109,37796878900109,O,2017-10-13,,,,2017-11-09T10:14:25,false,1,BATIMENT A,,,LD,VEYSSET SUD,15380,MOUSSAGES,,,15137,,,,,,,,,,,,,,,,,,,2017-10-13,A,,,,,52.10B,NAFRev2,N,2.451206,45.239801,0.93,locality,Veysset Sud 15380 Moussages,15137_b103,G,VEYSSET SUD,
377968789,00117,37796878900117,O,2017-10-13,,,,2017-11-09T10:23:38,false,1,BATIMENT B,,,,VEYSSET SUD,15380,MOUSSAGES,,,15137,,,,,,,,,,,,,,,,,,,2017-10-13,A,,,,,82.99Z,NAFRev2,N,2.451206,45.239801,0.93,locality,Veysset Sud 15380 Moussages,15137_b103,G,VEYSSET SUD,
380117010,00021,38011701000021,O,1998-01-01,,,,,true,1,,,,,ALGERES,15380,MOUSSAGES,,,15137,,,,,,,,,,,,,,,,,,,1998-12-25,F,,,,,93.0N,NAF1993,N,2.46659,45.226701,0.93,street,Algères 15380 Moussages,15137_p6xcgq,G,ALGERES,
380448563,00037,38044856300037,O,2008-07-09,,,,2008-11-04T04:17:55,false,2,,,,,FRESSANGES,15380,MOUSSAGES,,,15137,,,,,,,,,,,,,,,,,,,2008-11-01,F,,,,,86.21Z,NAFRev2,N,1.4122215,45.6587674,0.89,poi.stream,Le Fressanges (Ruisseau) Vicq-sur-Breuilh,https://osm.org/way/268030960,G,,
380448563,00052,38044856300052,O,2012-09-01,,,,2013-01-25T09:08:42,false,1,,,,,FRESSANGES,15380,MOUSSAGES,,,15137,,,,,,,,,,,,,,,,,,,2012-09-01,A,,,,,01.49Z,NAFRev2,N,1.4122215,45.6587674,0.89,poi.stream,Le Fressanges (Ruisseau) Vicq-sur-Breuilh,https://osm.org/way/268030960,G,,
383345527,00022,38334552700022,O,1996-10-01,NN,,,2007-07-11T11:09:38,true,5,,,,RTE,DE MAURIAC,15380,MOUSSAGES,,,15137,,,,,,,,,,,,,,,,,,,2006-09-29,F,,,,,52.6G,NAFRev1,N,2.456316,45.23885,0.62,street,Route Mauriac 15380 Moussages,15137_bn5zz1,G,ROUTE MAURIAC,
388059040,00013,38805904000013,O,1984-03-25,NN,,,2008-01-04T23:03:17,true,3,,,,,FRESSANGES,15380,MOUSSAGES,,,15137,,,,,,,,,,,,,,,,,,,2008-01-01,A,,,,,01.42Z,NAFRev2,N,1.4122215,45.6587674,0.89,poi.stream,Le Fressanges (Ruisseau) Vicq-sur-Breuilh,https://osm.org/way/268030960,G,,
388118093,00011,38811809300011,O,1992-07-15,NN,,,,true,1,,,,,,15380,MOUSSAGES,,,15137,,,,,,,,,,,,,,,,,,,2000-12-31,F,,,,,55.3A,NAF1993,N,,,0,,,,,,
388855454,00012,38885545400012,O,1992-10-12,NN,,,2019-10-28T11:36:47,true,5,,,,,LE SUC DE BOURIANNE,15380,MOUSSAGES,,,15137,,,,,,,,,,,,,,,,,,,2008-01-01,A,,,,,01.42Z,NAFRev2,N,2.472342,45.243854,0.87,street,Lieu Dit le Suc de Bouriannes 15380 Moussages,15137_b096,G,LIEU DIT LE SUC DE BOURIANNES,
388855454,00038,38885545400038,O,2018-09-03,,,,2019-10-28T11:36:48,false,2,,,,,BOURIANNES,15380,MOUSSAGES,,,15137,,,,,,,,,,,,,,,,,,,2019-08-31,F,DET 15,,,,71.11Z,NAFRev2,N,2.472342,45.243854,0.9,street,Lieu Dit le Suc de Bouriannes 15380 Moussages,15137_b096,G,LIEU DIT LE SUC DE BOURIANNES,
389920109,00011,38992010900011,O,1993-01-01,01,2018,,2020-08-25T10:24:58,true,4,,,,,VEYSSEL,15380,MOUSSAGES,,,15137,,,,,,,,,,,,,,,,,,,2012-12-31,A,,,,,01.42Z,NAFRev2,O,2.445921,45.240017,0.69,street,Veysset 15380 Moussages,15137_j44n2w,G,VEYSSET,
392644654,00015,39264465400015,O,1900-01-01,NN,,,2015-01-22T07:21:28,false,3,,,,,VAREILLES,15380,MOUSSAGES,,,15137,,,,,,,,,,,,,,,,,,,1994-06-30,F,,,,,60.2E,NAF1993,N,2.451867,45.246788,0.93,street,Vareilles 15380 Moussages,15137_rs795l,G,VAREILLES,
393200563,00012,39320056300012,O,1989-03-29,NN,,,,true,1,,,,,FERLUC,15380,MOUSSAGES,,,15137,,,,,,,,,,,,,,,,,,,1997-12-16,F,,,,,01.4A,NAF1993,N,2.439777,45.239305,0.91,street,Lieu Dit Ferluc 15380 Moussages,15137_19rps4,G,LIEU DIT FERLUC,
394317507,00017,39431750700017,O,1993-04-01,NN,,,2007-01-18T09:35:30,true,3,,,,,LES PRADELLES,15380,MOUSSAGES,,,15137,,,,,,,,,,,,,,,,,,,1996-07-01,F,,,,,01.2A,NAF1993,N,3.2368096,43.4507247,0.89,poi.track,Les Pradelles (Chemin) Puissalicon,https://osm.org/way/86925126,G,,
394772594,00013,39477259400013,O,1993-01-01,NN,,,,true,1,,,,,,15380,MOUSSAGES,,,15137,,,,,,,,,,,,,,,,,,,2001-06-30,F,,,,,01.2A,NAF1993,N,,,0,,,,,,
395057193,00017,39505719300017,O,1994-05-07,NN,,,2012-05-05T04:52:13,true,4,,,,,FRESSANGES,15380,MOUSSAGES,,,15137,,,,,,,,,,,,,,,,,,,2010-11-28,F,,,,,01.42Z,NAFRev2,N,1.4122215,45.6587674,0.89,poi.stream,Le Fressanges (Ruisseau) Vicq-sur-Breuilh,https://osm.org/way/268030960,G,,
399158260,00014,39915826000014,O,1978-01-01,NN,,,2008-01-04T19:03:46,true,3,,,,,JALHAC,15380,MOUSSAGES,,,15137,,,,,,,,,,,,,,,,,,,2008-01-01,A,,,,,01.42Z,NAFRev2,N,2.449168,45.227648,0.66,street,Jailhac 15380 Moussages,15137_dwvusi,G,JAILHAC,
399342807,00019,39934280700019,O,1994-07-01,NN,,,2008-01-04T19:07:33,true,3,,,,,ROUMEGOUX,15380,MOUSSAGES,,,15137,,,,,,,,,,,,,,,,,,,2008-01-01,A,,,,,01.43Z,NAFRev2,N,2.1985426,44.8562907,0.89,poi.tower,(Tour) Roumégoux,https://osm.org/way/244926998,G,,
399461391,00019,39946139100019,O,1994-12-25,NN,,,2008-01-04T19:10:00,true,3,,,,,VAREILLES,15380,MOUSSAGES,,,15137,,,,,,,,,,,,,,,,,,,2008-01-01,A,,,,,68.20B,NAFRev2,N,2.451867,45.246788,0.93,street,Vareilles 15380 Moussages,15137_rs795l,G,VAREILLES,
399796499,00016,39979649900016,O,1980-01-01,NN,,,2008-01-04T19:16:20,true,3,,,,,JALHIAC,15380,MOUSSAGES,,,15137,,,,,,,,,,,,,,,,,,,2008-01-01,A,,,,,01.42Z,NAFRev2,N,2.449168,45.227648,0.33,street,Jailhac 15380 Moussages,15137_dwvusi,G,JAILHAC,
405916800,00015,40591680000015,O,,NN,,,,true,1,,,,,,15380,MOUSSAGES,,,15137,,,,,,,,,,,,,,,,,,,1994-10-31,F,,,,,70.2C,NAF1993,N,,,0,,,,,,
406014316,00011,40601431600011,O,,NN,,,,true,1,,,,,,15380,MOUSSAGES,,,15137,,,,,,,,,,,,,,,,,,,1992-12-25,F,,,,,52.6E,NAF1993,N,,,0,,,,,,
406410233,00018,40641023300018,O,1964-01-01,NN,,,,true,1,,,,,,15380,MOUSSAGES,,,15137,,,,,,,,,,,,,,,,,,,1998-12-31,F,,,,,70.2C,NAF1993,N,,,0,,,,,,
406410787,00013,40641078700013,O,,NN,,,,true,1,,,,,,15380,MOUSSAGES,,,15137,,,,,,,,,,,,,,,,,,,1995-12-31,F,,,,,52.2C,NAF1993,N,,,0,,,,,,
406512186,00015,40651218600015,O,,,,,,true,1,,,,,,15380,MOUSSAGES,,,15137,,,,,,,,,,,,,,,,,,,1984-12-25,F,,,,,57.08,NAP,N,,,0,,,,,,
406610956,00012,40661095600012,O,,NN,,,,true,1,,,,,,15380,MOUSSAGES,,,15137,,,,,,,,,,,,,,,,,,,1992-06-30,F,,,,,55.4A,NAF1993,N,,,0,,,,,,
406612184,00019,40661218400019,O,,,,,,true,1,,,,,,15380,MOUSSAGES,,,15137,,,,,,,,,,,,,,,,,,,1985-12-25,F,,,,,01.80,NAP,N,,,0,,,,,,
406711994,00011,40671199400011,O,,,,,,true,1,,,,,,15380,MOUSSAGES,,,15137,,,,,,,,,,,,,,,,,,,1984-12-25,F,,,,,55.60,NAP,N,,,0,,,,,,
408261394,00014,40826139400014,O,1996-07-01,NN,,,2008-04-26T13:38:16,true,4,,,,,VEYSSET,15380,MOUSSAGES,,,15137,,,,,,,,,,,,,,,,,,,2008-01-01,A,,,,,68.20B,NAFRev2,N,2.445921,45.240017,0.93,street,Veysset 15380 Moussages,15137_j44n2w,G,VEYSSET,
409321783,00014,40932178300014,O,1980-01-01,NN,,,2008-01-04T21:25:08,true,3,,,,,LACHAMP,15380,MOUSSAGES,,,15137,,,,,,,,,,,,,,,,,,,2008-01-01,A,,,,,01.42Z,NAFRev2,N,2.463407,45.225242,0.93,street,Lachamp 15380 Moussages,15137_h64o9s,G,LACHAMP,
409321791,00017,40932179100017,O,1980-01-01,NN,,,,true,1,,,,,,15380,MOUSSAGES,,,15137,,,,,,,,,,,,,,,,,,,2001-04-05,F,,,,,01.1A,NAF1993,N,,,0,,,,,,
409321809,00017,40932180900017,O,1980-01-01,NN,,,2007-02-16T16:05:48,true,3,,,,,COLS MOUSSAGES,15380,MOUSSAGES,,,15137,,,,,,,,,,,,,,,,,,,2005-12-31,F,,,,,01.1A,NAFRev1,N,2.458077,45.252375,0.93,street,Cols 15380 Moussages,15137_ryx8eg,G,COLS,
409321817,00010,40932181700010,O,1980-01-01,NN,,,2008-01-04T21:25:08,true,6,,,,,LE BOURG,15380,MOUSSAGES,,,15137,,,,,,,,,,,,,,,,,,,2008-01-01,A,,,,,68.20B,NAFRev2,N,2.472342,45.243854,0.7,street,Lieu Dit le Suc de Bouriannes 15380 Moussages,15137_b096,G,LIEU DIT LE SUC DE BOURIANNES,
409321825,00013,40932182500013,O,1982-12-31,NN,,,2006-10-28T03:40:57,true,3,,,,,BACHELUSE,15380,MOUSSAGES,,,15137,,,,,,,,,,,,,,,,,,,2005-10-31,F,,,,,01.1A,NAFRev1,N,2.495275,45.223513,0.64,street,Lieu Dit Bacheluze 15380 Moussages,15137_6ptr1d,G,LIEU DIT BACHELUZE,
409321833,00017,40932183300017,O,1980-01-01,NN,,,2012-05-05T05:40:48,true,4,,,,,LAPRADE,15380,MOUSSAGES,,,15137,,,,,,,,,,,,,,,,,,,2012-01-23,F,,,,,01.42Z,NAFRev2,N,0.1744593,45.2685605,0.89,poi.park,(Parc) Laprade,https://osm.org/way/173153845,G,,
409321841,00010,40932184100010,O,1984-12-31,NN,,,2010-01-28T04:42:57,true,4,,,,,LABRO,15380,MOUSSAGES,,,15137,,,,,,,,,,,,,,,,,,,2010-01-18,A,,,,,68.20B,NAFRev2,N,2.476049,45.222947,0.93,street,Labro 15380 Moussages,15137_l9zc4e,G,LABRO,
409321858,00014,40932185800014,O,1992-12-31,NN,,,2008-01-04T21:25:08,true,3,,,,,LACHAMP,15380,MOUSSAGES,,,15137,,,,,,,,,,,,,,,,,,,2008-01-01,A,,,,,01.42Z,NAFRev2,N,2.463407,45.225242,0.93,street,Lachamp 15380 Moussages,15137_h64o9s,G,LACHAMP,
409321866,00017,40932186600017,O,1990-12-31,NN,,,,true,3,,,,,COLS,15380,MOUSSAGES,,,15137,,,,,,,,,,,,,,,,,,,1997-12-31,F,,,,,01.1A,NAF1993,N,2.458077,45.252375,0.93,street,Cols 15380 Moussages,15137_ryx8eg,G,COLS,
409321874,00011,40932187400011,O,1994-10-01,NN,,,2017-06-07T04:30:54,true,4,,,,,,15380,MOUSSAGES,,,15137,,,,,,,,,,,,,,,,,,,2017-05-10,F,,,,,01.42Z,NAFRev2,N,,,0,,,,,,
410977201,00012,41097720100012,O,1984-12-31,NN,,,2006-10-28T03:52:19,true,3,,,,,,15380,MOUSSAGES,,,15137,,,,,,,,,,,,,,,,,,,2006-12-31,F,,,,,01.1A,NAFRev1,N,,,0,,,,,,
410977219,00014,41097721900014,O,1983-12-31,NN,,,2016-11-20T03:49:53,true,4,,,,,BACHELUZE,15380,MOUSSAGES,,,15137,,,,,,,,,,,,,,,,,,,2017-01-01,A,,,,,01.49Z,NAFRev2,N,2.495275,45.223513,0.91,street,Lieu Dit Bacheluze 15380 Moussages,15137_6ptr1d,G,LIEU DIT BACHELUZE,
410977227,00017,41097722700017,O,1982-12-31,NN,,,,true,4,,,,,LABRO,15380,MOUSSAGES,,,15137,,,,,,,,,,,,,,,,,,,2003-03-21,F,,,,,01.1A,NAFRev1,N,2.476049,45.222947,0.93,street,Labro 15380 Moussages,15137_l9zc4e,G,LABRO,
410977235,00010,41097723500010,O,1984-12-31,NN,,,2008-01-04T21:51:42,true,3,FRESSANGES,,,,,15380,MOUSSAGES,,,15137,,,,,,,,,,,,,,,,,,,2008-01-01,A,,,,,01.42Z,NAFRev2,N,2.461218,45.252787,0.42,street,Les Fillières 15380 Moussages,15137_oe7u0k,D,LES FILLIERES,
412012379,00019,41201237900019,O,1997-01-01,NN,,,2009-07-30T08:46:31,true,4,,,,,CELLES,15380,MOUSSAGES,,,15137,,,,,,,,,,,,,,,,,,,2009-03-27,F,,,,,01.42Z,NAFRev2,N,2.465877,45.247267,0.91,street,Lieu Dit Celles 15380 Moussages,15137_wsy403,G,LIEU DIT CELLES,
418319182,00014,41831918200014,O,1998-01-01,,,,2009-08-31T14:06:36,false,3,,,,,COLS,15380,MOUSSAGES,,,15137,,,,,,,,,,,,,,,,,,,1999-12-31,F,,,,,01.2A,NAF1993,N,2.458077,45.252375,0.93,street,Cols 15380 Moussages,15137_ryx8eg,G,COLS,
421342775,00010,42134277500010,O,1999-01-04,01,2018,4399CZ,2020-08-25T10:11:54,true,4,,,,,FRESSANGES,15380,MOUSSAGES,,,15137,,,,,,,,,,,,,,,,,,,2008-01-01,A,,,,,43.99C,NAFRev2,O,1.4122215,45.6587674,0.89,poi.stream,Le Fressanges (Ruisseau) Vicq-sur-Breuilh,https://osm.org/way/268030960,G,,
421778150,00019,42177815000019,O,1999-01-23,NN,,,,true,1,,,,,,15380,MOUSSAGES,,,15137,,,,,,,,,,,,,,,,,,,2001-12-31,F,,,,,52.1B,NAF1993,N,,,0,,,,,,
424350510,00022,42435051000022,O,2001-02-20,NN,,,2008-12-31T04:58:17,true,4,,,,PL,EGLISE,15380,MOUSSAGES,,,15137,,,,,,,,,,,,,,,,,,,2008-07-30,F,,,,,68.20A,NAFRev2,N,-1.1676989,44.0766928,0.8,poi.park,Place de l'Église (Parc) Mézos,https://osm.org/way/37053988,G,,
425321460,00015,42532146000015,O,1991-02-01,NN,,,2008-01-05T01:15:00,true,3,,,,,,15380,MOUSSAGES,,,15137,,,,,,,,,,,,,,,,,,,2008-01-01,A,,,,,68.20B,NAFRev2,N,,,0,,,,,,
429534555,00017,42953455500017,O,2000-02-17,NN,,4391BZ,2020-02-14T15:18:14,false,7,,,,,VALANS,15380,MOUSSAGES,,,15137,,,,,,,,,,,,,,,,,,,2019-12-31,F,,,,,43.91B,NAFRev2,N,2.505867,45.229345,0.91,street,Lieu Dit Valans 15380 Moussages,15137_o540ja,G,LIEU DIT VALANS,
429534555,00025,42953455500025,O,2015-01-01,,,,2020-02-14T15:22:55,true,1,,,,,FRESSANGES,15380,MOUSSAGES,,,15137,,,,,,,,,,,,,,,,,,,2015-01-01,A,,,,,01.42Z,NAFRev2,N,1.4122215,45.6587674,0.89,poi.stream,Le Fressanges (Ruisseau) Vicq-sur-Breuilh,https://osm.org/way/268030960,G,,
429635774,00012,42963577400012,O,2000-01-01,NN,,,,true,1,,,,,ALGERES,15380,MOUSSAGES,,,15137,,,,,,,,,,,,,,,,,,,2001-04-30,F,,,,,01.2A,NAF1993,N,2.46659,45.226701,0.93,street,Algères 15380 Moussages,15137_p6xcgq,G,ALGERES,
434136164,00010,43413616400010,O,2001-01-15,NN,,,2009-01-27T07:07:46,true,4,,,,,LE BOURG,15380,MOUSSAGES,,,15137,,,,,,,,,,,,,,,,,,,2008-12-31,F,,,,,56.10A,NAFRev2,N,2.472342,45.243854,0.7,street,Lieu Dit le Suc de Bouriannes 15380 Moussages,15137_b096,G,LIEU DIT LE SUC DE BOURIANNES,
435186838,00023,43518683800023,O,2015-04-01,,,,2015-04-10T08:42:38,false,1,,,,,LABRO,15380,MOUSSAGES,,,15137,,,,,,,,,,,,,,,,,,,2015-04-01,A,,,,,01.45Z,NAFRev2,N,2.476049,45.222947,0.93,street,Labro 15380 Moussages,15137_l9zc4e,G,LABRO,
438117608,00010,43811760800010,O,2001-05-01,01,2018,,2020-08-25T10:24:51,true,3,,,,,LE BOURG,15380,MOUSSAGES,,,15137,,,,,,,,,,,,,,,,,,,2008-01-01,A,,,,,01.42Z,NAFRev2,N,2.472342,45.243854,0.7,street,Lieu Dit le Suc de Bouriannes 15380 Moussages,15137_b096,G,LIEU DIT LE SUC DE BOURIANNES,
438701450,00019,43870145000019,O,2001-07-01,NN,,,2011-09-04T04:33:18,true,4,LE BOURG,,,,LE BOURG,15380,MOUSSAGES,,,15137,,,,,,,,,,,,,,,,,,,2011-08-30,F,,,,,01.42Z,NAFRev2,N,2.472342,45.243854,0.7,street,Lieu Dit le Suc de Bouriannes 15380 Moussages,15137_b096,G,LIEU DIT LE SUC DE BOURIANNES,
439194903,00019,43919490300019,O,2001-10-01,NN,,,2006-11-25T17:34:49,false,3,,,,,LE BOURG,15380,MOUSSAGES,,,15137,,,,,,,,,,,,,,,,,,,2004-10-01,F,,,,,55.1A,NAFRev1,O,2.472342,45.243854,0.7,street,Lieu Dit le Suc de Bouriannes 15380 Moussages,15137_b096,G,LIEU DIT LE SUC DE BOURIANNES,
440931640,00013,44093164000013,O,2002-01-01,NN,,,2008-10-22T08:07:47,false,4,LE BOURG,,,,,15380,MOUSSAGES,,,15137,,,,,,,,,,,,,,,,,,,2008-09-30,F,,,,,47.11B,NAFRev2,N,2.472342,45.243854,0.7,street,Lieu Dit le Suc de Bouriannes 15380 Moussages,15137_b096,D,LIEU DIT LE SUC DE BOURIANNES,
441134921,00010,44113492100010,O,2002-01-01,NN,,,2011-05-03T00:23:47,false,2,,,,,LE MARILHOUX,15380,MOUSSAGES,,,15137,,,,,,,,,,,,,,,,,,,2002-12-25,F,,,,,01.2A,NAF1993,N,2.473599,45.236622,0.71,street,Rue du Marilhoux 15380 Moussages,15137_2vjhv2,G,RUE DU MARILHOUX,
441997608,00019,44199760800019,O,2002-01-01,NN,,,2008-01-04T21:32:12,true,3,,,,,LE BOURG,15380,MOUSSAGES,,,15137,,,,,,,,,,,,,,,,,,,2008-01-01,A,,,,,01.42Z,NAFRev2,N,2.472342,45.243854,0.7,street,Lieu Dit le Suc de Bouriannes 15380 Moussages,15137_b096,G,LIEU DIT LE SUC DE BOURIANNES,
442771200,00015,44277120000015,O,1966-03-25,NN,,,2008-01-04T21:49:15,true,3,,,,,LE BOURG,15380,MOUSSAGES,,,15137,,,,,,,,,,,,,,,,,,,2008-01-01,A,,,,,01.43Z,NAFRev2,N,2.472342,45.243854,0.7,street,Lieu Dit le Suc de Bouriannes 15380 Moussages,15137_b096,G,LIEU DIT LE SUC DE BOURIANNES,
444431282,00011,44443128200011,O,2002-12-09,NN,,,2008-01-04T22:27:32,true,4,,,,,LE SUC DE BOURIANNE,15380,MOUSSAGES,,,15137,,,,,,,,,,,,,,,,,,,2008-01-01,A,,,,,90.01Z,NAFRev2,N,2.472342,45.243854,0.87,street,Lieu Dit le Suc de Bouriannes 15380 Moussages,15137_b096,G,LIEU DIT LE SUC DE BOURIANNES,
447554858,00012,44755485800012,O,2003-01-01,,,,,true,3,,,,,LABRO,15380,MOUSSAGES,,,15137,,,,,,,,,,,,,,,,,,,2003-12-31,F,,,,,01.2A,NAFRev1,N,2.476049,45.222947,0.93,street,Labro 15380 Moussages,15137_l9zc4e,G,LABRO,
478449010,00022,47844901000022,O,2015-11-25,,,,2020-08-28T03:59:32,true,1,,,,,LE BOURG,15380,MOUSSAGES,,,15137,,,,,,,,,,,,,,,,,,,2015-11-25,A,,,,,68.20B,NAFRev2,N,2.472342,45.243854,0.7,street,Lieu Dit le Suc de Bouriannes 15380 Moussages,15137_b096,G,LIEU DIT LE SUC DE BOURIANNES,
479560484,00012,47956048400012,O,2002-09-01,NN,,,2011-04-23T13:39:45,true,4,,,,,MAIRIE,15380,MOUSSAGES,,,15137,,,,,,,,,,,,,,,,,,,2008-01-01,A,,,,,93.12Z,NAFRev2,O,3.0709671,50.6304695,0.92,poi.townhall,Hôtel de Ville Lille,https://osm.org/way/40917078,G,,
480040781,00027,48004078100027,O,2005-12-01,NN,,,2017-05-04T03:59:26,false,3,,,,RTE,DE MAURIAC,15380,MOUSSAGES,,,15137,,,,,,,,,,,,,,,,,,,2015-07-15,F,,,,,59.13A,NAFRev2,O,2.456316,45.23885,0.62,street,Route Mauriac 15380 Moussages,15137_bn5zz1,G,ROUTE MAURIAC,
480320365,00012,48032036500012,O,2005-01-01,,,,2008-01-05T00:06:16,true,2,,,,,LES PRADOUX,15380,MOUSSAGES,,,15137,,,,,,,,,,,,,,,,,,,2008-01-01,A,,,,,68.20B,NAFRev2,N,2.464222,45.236498,0.93,street,Les Pradoux 15380 Moussages,15137_13plx6,G,LES PRADOUX,
481113322,00012,48111332200012,O,2005-02-01,,,,2008-01-05T00:21:33,true,2,,,,LD,JAILHAC,15380,MOUSSAGES,,,15137,,,,,,,,,,,,,,,,,,,2008-01-01,A,,,,,90.01Z,NAFRev2,N,2.449168,45.227648,0.93,street,Jailhac 15380 Moussages,15137_dwvusi,G,JAILHAC,