siren,nic,siret,statutDiffusionEtablissement,dateCreationEtablissement,trancheEffectifsEtablissement,anneeEffectifsEtablissement,activitePrincipaleRegistreMetiersEtablissement,dateDernierTraitementEtablissement,etablissementSiege,nombrePeriodesEtablissement,complementAdresseEtablissement,numeroVoieEtablissement,indiceRepetitionEtablissement,typeVoieEtablissement,libelleVoieEtablissement,codePostalEtablissement,libelleCommuneEtablissement,libelleCommuneEtrangerEtablissement,distributionSpecialeEtablissement,codeCommuneEtablissement,codeCedexEtablissement,libelleCedexEtablissement,codePaysEtrangerEtablissement,libellePaysEtrangerEtablissement,complementAdresse2Etablissement,numeroVoie2Etablissement,indiceRepetition2Etablissement,typeVoie2Etablissement,libelleVoie2Etablissement,codePostal2Etablissement,libelleCommune2Etablissement,libelleCommuneEtranger2Etablissement,distributionSpeciale2Etablissement,codeCommune2Etablissement,codeCedex2Etablissement,libelleCedex2Etablissement,codePaysEtranger2Etablissement,libellePaysEtranger2Etablissement,dateDebut,etatAdministratifEtablissement,enseigne1Etablissement,enseigne2Etablissement,enseigne3Etablissement,denominationUsuelleEtablissement,activitePrincipaleEtablissement,nomenclatureActivitePrincipaleEtablissement,caractereEmployeurEtablissement,longitude,latitude,geo_score,geo_type,geo_adresse,geo_id,geo_ligne,geo_l4,geo_l5
211914007,00011,21191400700011,O,1983-03-01,03,2018,,2020-08-25T10:16:06,true,4,HOTEL DE VILLE,,,,,19400,MONCEAUX-SUR-DORDOGNE,,,19140,,,,,,,,,,,,,,,,,,,2008-01-01,A,MAIRIE,,,,84.11Z,NAFRev2,O,1.914155,45.069693,0.34,street,Route de Vergnolles 19400 Monceaux-sur-Dordogne,19140_enf8aa,D,ROUTE DE VERGNOLLES,
211914007,00045,21191400700045,O,1983-12-21,01,2018,,2020-08-25T10:16:06,false,3,,,,,,19400,MONCEAUX-SUR-DORDOGNE,,,19140,,,,,,,,,,,,,,,,,,,2008-01-01,A,ECOLE PRIMAIRE PUBLIQUE,,,,85.20Z,NAFRev2,N,,,0,,,,,,
211914007,00060,21191400700060,O,1997-01-01,NN,,,2019-11-14T14:00:22,false,3,MAIRIE,,,,,19400,MONCEAUX-SUR-DORDOGNE,,,19140,,,,,,,,,,,,,,,,,,,2008-01-01,A,SERVICE ASSAINISSEMENT,,,,37.00Z,NAFRev2,N,1.922883,45.093535,0.37,locality,Le Pont de la Borie 19400 Monceaux-sur-Dordogne,19140_b122,D,LE PONT DE LA BORIE,
211914007,00078,21191400700078,O,1997-01-01,NN,,,2019-11-14T14:00:22,false,3,MAIRIE,,,,,19400,MONCEAUX-SUR-DORDOGNE,,,19140,,,,,,,,,,,,,,,,,,,2008-01-01,A,SERVICE DES EAUX,,,,36.00Z,NAFRev2,N,1.922883,45.093535,0.37,locality,Le Pont de la Borie 19400 Monceaux-sur-Dordogne,19140_b122,D,LE PONT DE LA BORIE,
211914007,00086,21191400700086,O,2002-04-23,NN,,,2019-11-14T14:00:22,false,4,MAIRIE,,,,LE BOURG,19400,MONCEAUX-SUR-DORDOGNE,,,19140,,,,,,,,,,,,,,,,,,,2014-12-31,F,LOTISSEMENT COMMUNAL,,,,42.99Z,NAFRev2,N,2.212915,47.9910304,0.9,poi.bar,Le Bourg (Bar) Ingrannes,https://osm.org/node/1718543174,G,,
211929922,00014,21192992200014,O,2002-12-25,,,,2019-11-14T14:00:22,true,3,MAIRIE,,,,LE BOURG,19400,MONCEAUX-SUR-DORDOGNE,,,19140,,,,,,,,,,,,,,,,,,,2009-10-02,F,,,,,84.11Z,NAFRev2,N,2.212915,47.9910304,0.9,poi.bar,Le Bourg (Bar) Ingrannes,https://osm.org/node/1718543174,G,,
261914006,00018,26191400600018,O,1983-03-01,NN,,,2019-11-14T14:00:22,true,4,,,,,HOTEL DE VILLE,19400,MONCEAUX-SUR-DORDOGNE,,,19140,,,,,,,,,,,,,,,,,,,2015-12-31,F,CCAS,,,,88.99B,NAFRev2,N,3.0709671,50.6304695,0.92,poi.townhall,Hôtel de Ville Lille,https://osm.org/way/40917078,G,,
261929038,00014,26192903800014,O,1998-03-19,,,,2019-11-14T14:00:22,true,3,MAIRIE,,,,,19400,MONCEAUX-SUR-DORDOGNE,,,19140,,,,,,,,,,,,,,,,,,,2008-01-01,A,,,,,88.99B,NAFRev2,N,1.922883,45.093535,0.37,locality,Le Pont de la Borie 19400 Monceaux-sur-Dordogne,19140_b122,D,LE PONT DE LA BORIE,
271914004,00012,27191400400012,O,,,,,2019-11-14T14:00:22,true,1,,,,,HOTEL DE VILLE,19400,MONCEAUX-SUR-DORDOGNE,,,19140,,,,,,,,,,,,,,,,,,,1995-12-25,F,,,,,41.0Z,NAF1993,N,3.0709671,50.6304695,0.92,poi.townhall,Hôtel de Ville Lille,https://osm.org/way/40917078,G,,
303879308,00011,30387930800011,O,1975-01-01,NN,,,2019-11-14T14:00:22,true,3,,,,LD,LAFARGE,19400,MONCEAUX-SUR-DORDOGNE,,,19140,,,,,,,,,,,,,,,,,,,2007-06-30,F,,,,,45.3A,NAFRev1,O,0.115169,45.6120812,0.89,poi.quarry,Carrière Lafarge La Couronne,https://osm.org/way/113144745,G,,
303879308,00029,30387930800029,O,1987-12-31,NN,,,2019-11-14T14:00:22,false,3,,,,,LAFARGE,19400,MONCEAUX-SUR-DORDOGNE,,,19140,,,,,,,,,,,,,,,,,,,1999-12-31,F,,,,,01.1A,NAF1993,N,0.115169,45.6120812,0.89,poi.quarry,Carrière Lafarge La Couronne,https://osm.org/way/113144745,G,,
304508708,00027,30450870800027,O,2000-11-02,NN,,,2019-11-14T14:00:22,true,4,,,,,SAULIERES,19400,MONCEAUX-SUR-DORDOGNE,,,19140,,,,,,,,,,,,,,,,,,,2012-04-01,F,,,,,01.25Z,NAFRev2,N,1.905989,45.054532,0.92,locality,Saulieres Sud 19400 Monceaux-sur-Dordogne,19140_b152,G,SAULIERES SUD,
304584774,00018,30458477400018,O,,,,,2019-11-14T14:00:22,true,1,,,,LD,LE MALPAS,19400,MONCEAUX-SUR-DORDOGNE,,,19140,,,,,,,,,,,,,,,,,,,1987-12-31,F,,,,,55.72,NAP,N,1.92987,45.079737,0.94,street,Le Malpas 19400 Monceaux-sur-Dordogne,19140_1cf3jl,G,LE MALPAS,
304694029,00022,30469402900022,O,2009-01-01,,,,2019-11-14T14:00:22,false,1,LE COTTAGE,,,,LA LATHIERE,19400,MONCEAUX-SUR-DORDOGNE,,,19140,,,,,,,,,,,,,,,,,,,2009-01-01,A,,,,,68.20A,NAFRev2,N,1.879939,45.056524,0.68,street,La Lattière 19400 Monceaux-sur-Dordogne,19140_4g3pqx,G,LA LATTIERE,
304694029,00030,30469402900030,O,2011-01-01,,,,2019-11-14T14:00:22,false,1,,,,,LA LATHYERE,19400,MONCEAUX-SUR-DORDOGNE,,,19140,,,,,,,,,,,,,,,,,,,2011-01-01,A,,,,,01.11Z,NAFRev2,N,1.880174,45.056271,0.92,street,Lieu-dit la Lathyère 19400 Monceaux-sur-Dordogne,19140_4g3pqx,G,LIEU DIT LA LATHYERE,
307679092,00014,30767909200014,O,1976-01-01,NN,,,2019-11-14T14:00:22,true,3,,,,LD,LA BRIQUE,19400,MONCEAUX-SUR-DORDOGNE,,,19140,,,,,,,,,,,,,,,,,,,2004-01-13,F,,,,,51.5E,NAFRev1,N,5.6695047,45.5358552,0.9,poi.bar,La Brique (Bar) Le Pont-de-Beauvoisin,https://osm.org/node/2504359325,G,,
307679092,00022,30767909200022,O,1996-01-01,NN,,,2019-11-14T14:00:22,false,4,,,,,LA BRIQUE,19400,MONCEAUX-SUR-DORDOGNE,,,19140,,,,,,,,,,,,,,,,,,,2001-03-15,F,,,,,29.3C,NAF1993,N,5.6695047,45.5358552,0.9,poi.bar,La Brique (Bar) Le Pont-de-Beauvoisin,https://osm.org/node/2504359325,G,,
309368611,00021,30936861100021,O,1991-12-31,NN,,,2019-11-14T14:00:22,true,3,,,,,,19400,MONCEAUX-SUR-DORDOGNE,,,19140,,,,,,,,,,,,,,,,,,,2008-01-01,A,,,,,01.11Z,NAFRev2,N,,,0,,,,,,
309959401,00014,30995940100014,O,,NN,,,2019-11-14T14:00:22,true,1,,,,LD,LAYGUES,19400,MONCEAUX-SUR-DORDOGNE,,,19140,,,,,,,,,,,,,,,,,,,1990-09-30,F,,,,,55.71,NAP,N,1.908095,45.076433,0.91,street,Lieu-dit Laygues 19400 Monceaux-sur-Dordogne,19140_netpdt,G,LIEU DIT LAYGUES,
311131668,00023,31113166800023,O,,NN,,,2019-11-14T14:00:22,true,1,,,,,LE CHASSANG,19400,MONCEAUX-SUR-DORDOGNE,,,19140,,,,,,,,,,,,,,,,,,,1990-01-16,F,,,,,49.05,NAP,N,1.905805,45.08193,0.92,street,Impasse le Chassang 19400 Monceaux-sur-Dordogne,19140_4yef49,G,IMPASSE LE CHASSANG,
311150734,00029,31115073400029,O,,NN,,,2019-11-14T14:00:22,true,1,,,,LD,LE VIALLARD,19400,MONCEAUX-SUR-DORDOGNE,,,19140,,,,,,,,,,,,,,,,,,,1990-12-31,F,,,,,55.60,NAP,N,1.866203,45.053369,0.92,street,Lieu-dit le Viallard 19400 Monceaux-sur-Dordogne,19140_07zhxy,G,LIEU DIT LE VIALLARD,
311341358,00019,31134135800019,O,1977-01-01,NN,,,2019-11-14T14:00:22,true,4,,,,,LA BOUYGE,19400,MONCEAUX-SUR-DORDOGNE,,,19140,,,,,,,,,,,,,,,,,,,2010-12-31,F,,,,,43.33Z,NAFRev2,N,1.908113,45.077545,0.91,street,Chemin de la Bouyge 19400 Monceaux-sur-Dordogne,19140_c0uodv,G,CHEMIN DE LA BOUYGE,
311999825,00129,31199982500129,O,1980-05-25,NN,,,2019-11-14T14:00:22,false,3,,,,,CAMPING DU SAULOU,19400,MONCEAUX-SUR-DORDOGNE,,,19140,,,,,,,,,,,,,,,,,,,2008-01-01,A,,,,,77.29Z,NAFRev2,N,,,0,,,,,,
312530223,00055,31253022300055,O,2003-10-01,NN,,,2019-11-14T14:00:22,true,4,,,,,LE CHAMBON,19400,MONCEAUX-SUR-DORDOGNE,,,19140,,,,,,,,,,,,,,,,,,,2008-02-01,F,,,,,43.34Z,NAFRev2,N,1.927329,45.077576,0.92,street,Lieu-dit le Chambon 19400 Monceaux-sur-Dordogne,19140_ux1mhz,G,LIEU DIT LE CHAMBON,
312543937,00022,31254393700022,O,1985-03-01,NN,,,2019-11-14T14:00:22,false,3,,,,LD,AU BECH,19400,MONCEAUX-SUR-DORDOGNE,,,19140,,,,,,,,,,,,,,,,,,,2007-12-31,F,,,,,02.0B,NAFRev1,N,1.892713,45.06618,0.57,street,Lieu-dit le Bech 19400 Monceaux-sur-Dordogne,19140_nd0gjc,G,LIEU DIT LE BECH,
312672744,00017,31267274400017,O,,NN,,,2019-11-14T14:00:22,true,1,,,,LD,LE GAUD,19400,MONCEAUX-SUR-DORDOGNE,,,19140,,,,,,,,,,,,,,,,,,,1991-05-31,F,,,,,55.71,NAP,N,1.9767176,45.2160681,0.89,poi.stream,Le Gaud (Ruisseau) Gumond,https://osm.org/way/356109347,G,,
312921521,00018,31292152100018,O,1978-01-01,NN,,,2019-11-14T14:00:22,true,3,,,,LD,LAYGUES,19400,MONCEAUX-SUR-DORDOGNE,,,19140,,,,,,,,,,,,,,,,,,,2008-01-01,A,,,,,56.10A,NAFRev2,N,1.908095,45.076433,0.91,street,Lieu-dit Laygues 19400 Monceaux-sur-Dordogne,19140_netpdt,G,LIEU DIT LAYGUES,
314319088,00014,31431908800014,O,1978-01-01,NN,,,2019-11-14T14:00:22,true,10,,,,LD,VERGNOLLES,19400,MONCEAUX-SUR-DORDOGNE,,,19140,,,,,,,,,,,,,,,,,,,2010-02-16,F,,,,,55.30Z,NAFRev2,N,1.916939,45.06332,0.92,locality,Les Pres de Vergnolles 19400 Monceaux-sur-Dordogne,19140_b131,G,LES PRES DE VERGNOLLES,
317025740,00042,31702574000042,O,2019-02-15,,,,2019-11-14T14:00:22,true,1,,,,,HAMEAU DE BROS,19400,MONCEAUX-SUR-DORDOGNE,,,19140,,,,,,,,,,,,,,,,,,,2019-02-15,A,,,,,72.19Z,NAFRev2,N,1.894235,45.067179,0.44,street,Lieu-dit Bros 19400 Monceaux-sur-Dordogne,19140_fmcvle,G,LIEU DIT BROS,
317412922,00013,31741292200013,O,,,,,2019-11-14T14:00:22,true,1,,,,,LAFARGE,19400,MONCEAUX-SUR-DORDOGNE,,,19140,,,,,,,,,,,,,,,,,,,1987-07-31,F,,,,,01.4A,NAF1993,N,0.115169,45.6120812,0.89,poi.quarry,Carrière Lafarge La Couronne,https://osm.org/way/113144745,G,,
317980217,00044,31798021700044,O,1988-07-01,NN,,,2019-11-14T14:00:22,true,23,,,,,PORT DE VAURS,19400,MONCEAUX-SUR-DORDOGNE,,,19140,,,,,,,,,,,,,,,,,,,2018-06-28,F,,,,,46.73A,NAFRev2,O,1.893796,45.047072,0.94,street,Port de Vaurs 19400 Monceaux-sur-Dordogne,19140_b124,G,PORT DE VAURS,
322122300,00039,32212230000039,O,2017-03-01,,,,2019-11-14T14:00:22,true,1,,,,,BROS,19400,MONCEAUX-SUR-DORDOGNE,,,19140,,,,,,,,,,,,,,,,,,,2017-03-01,A,XAVIER DU PRADEL,,,CORREZE RESIDENCE SERVICE,81.21Z,NAFRev2,N,1.894235,45.067179,0.91,street,Lieu-dit Bros 19400 Monceaux-sur-Dordogne,19140_fmcvle,G,LIEU DIT BROS,
322963000,00029,32296300000029,O,2009-08-01,,,,2019-11-14T14:00:22,true,1,,,,,AUX CROCS,19400,MONCEAUX-SUR-DORDOGNE,,,19140,,,,,,,,,,,,,,,,,,,2009-08-01,A,,,,,43.34Z,NAFRev2,N,1.929915,45.076321,0.72,street,Impasse les Crocs 19400 Monceaux-sur-Dordogne,19140_zehsfv,G,IMPASSE LES CROCS,
325683399,00027,32568339900027,O,2016-07-25,,,2341ZZ,2019-11-14T14:00:22,true,1,,,,,LE TOURNANT DE FRAYSSIT,19400,MONCEAUX-SUR-DORDOGNE,,,19140,,,,,,,,,,,,,,,,,,,2016-07-25,A,OPOT! LA POTERIE DE MARIANNE,,,OPOT! LA POTERIE DE MARIANNE,23.41Z,NAFRev2,N,1.917758,45.09485,0.94,locality,Le Tournant de Frayssit 19400 Monceaux-sur-Dordogne,19140_b169,G,LE TOURNANT DE FRAYSSIT,
326245073,00019,32624507300019,O,1982-11-19,NN,,,2019-11-14T14:00:22,true,4,,,,,SAULIERES,19400,MONCEAUX-SUR-DORDOGNE,,,19140,,,,,,,,,,,,,,,,,,,2008-01-01,A,,,,,68.20B,NAFRev2,N,1.905989,45.054532,0.92,locality,Saulieres Sud 19400 Monceaux-sur-Dordogne,19140_b152,G,SAULIERES SUD,
326245081,00012,32624508100012,O,1982-11-19,NN,,,2019-11-14T14:00:22,true,3,,,,,,19400,MONCEAUX-SUR-DORDOGNE,,,19140,,,,,,,,,,,,,,,,,,,2008-01-01,A,,,,,01.42Z,NAFRev2,N,,,0,,,,,,
326451259,00013,32645125900013,O,1982-11-19,NN,,,2019-11-14T14:00:22,true,4,,,,,LA JONCHERE,19400,MONCEAUX-SUR-DORDOGNE,,,19140,,,,,,,,,,,,,,,,,,,2008-01-01,A,,,,,01.43Z,NAFRev2,N,1.873015,45.049346,0.92,street,Lieu-dit la Jonchère 19400 Monceaux-sur-Dordogne,19140_rana15,G,LIEU DIT LA JONCHERE,
326451267,00016,32645126700016,O,1982-11-19,NN,,,2019-11-14T14:00:22,true,3,,,,,LE FOUR,19400,MONCEAUX-SUR-DORDOGNE,,,19140,,,,,,,,,,,,,,,,,,,2006-12-31,F,,,,,01.2A,NAFRev1,N,1.868109,45.065356,0.91,street,Lieu-dit le Four 19400 Monceaux-sur-Dordogne,19140_s251og,G,LIEU DIT LE FOUR,
326451275,00019,32645127500019,O,,NN,,,2019-11-14T14:00:22,true,1,,,,,LE MONS,19400,MONCEAUX-SUR-DORDOGNE,,,19140,,,,,,,,,,,,,,,,,,,1995-01-12,F,,,,,01.2A,NAF1993,N,1.8663,45.06928,0.91,street,Lieu-dit le Mons 19400 Monceaux-sur-Dordogne,19140_jao38z,G,LIEU DIT LE MONS,
326524360,00012,32652436000012,O,1983-01-01,NN,,,2019-11-14T14:00:22,true,3,,,,,MOUSTOULAT,19400,MONCEAUX-SUR-DORDOGNE,,,19140,,,,,,,,,,,,,,,,,,,2006-12-31,F,,,,,01.2A,NAFRev1,N,,,0,,,,,,
326538527,00010,32653852700010,O,1983-01-01,NN,,,2019-11-14T14:00:22,true,4,,,,LD,LA METTE,19400,MONCEAUX-SUR-DORDOGNE,,,19140,,,,,,,,,,,,,,,,,,,2008-01-01,A,,,,,68.20B,NAFRev2,N,1.868063,45.079829,0.9,street,Lieu-dit le Moulin de la Mette 19400 Monceaux-sur-Dordogne,19140_b107,G,LIEU DIT LE MOULIN DE LA METTE,
326538527,00028,32653852700028,O,1999-04-26,NN,,,2019-11-14T14:00:22,false,4,,,,,CHAMPEAUX,19400,MONCEAUX-SUR-DORDOGNE,,,19140,,,,,,,,,,,,,,,,,,,2009-12-31,F,,,,,01.61Z,NAFRev2,N,1.882141,45.077884,0.91,street,Lieu-dit Champeaux 19400 Monceaux-sur-Dordogne,19140_ehxv1l,G,LIEU DIT CHAMPEAUX,
326946001,00012,32694600100012,O,1983-04-02,NN,,,2019-11-14T14:00:22,false,3,,,,,,19400,MONCEAUX-SUR-DORDOGNE,,,19140,,,,,,,,,,,,,,,,,,,1996-12-31,F,,,,,01.1D,NAF1993,N,,,0,,,,,,
327076907,00010,32707690700010,O,1982-11-19,NN,,,2019-11-14T14:00:22,true,4,,,,,VERGNOLLE,19400,MONCEAUX-SUR-DORDOGNE,,,19140,,,,,,,,,,,,,,,,,,,2012-12-25,F,,,,,68.20B,NAFRev2,N,1.916939,45.06332,0.82,locality,Les Pres de Vergnolles 19400 Monceaux-sur-Dordogne,19140_b131,G,LES PRES DE VERGNOLLES,
327076915,00013,32707691500013,O,1982-11-19,NN,,,2019-11-14T14:00:22,true,3,,,,,LE CLAUX,19400,MONCEAUX-SUR-DORDOGNE,,,19140,,,,,,,,,,,,,,,,,,,2007-12-31,F,,,,,01.2A,NAFRev1,N,1.879414,45.089077,0.91,street,Lieu-dit le Claux 19400 Monceaux-sur-Dordogne,19140_29ft8y,G,LIEU DIT LE CLAUX,
327076923,00017,32707692300017,O,1982-11-19,NN,,,2019-11-14T14:00:22,true,4,,,,,LE FOUR,19400,MONCEAUX-SUR-DORDOGNE,,,19140,,,,,,,,,,,,,,,,,,,2008-03-31,F,,,,,01.42Z,NAFRev2,N,1.868109,45.065356,0.91,street,Lieu-dit le Four 19400 Monceaux-sur-Dordogne,19140_s251og,G,LIEU DIT LE FOUR,
327390555,00016,32739055500016,O,1983-04-28,NN,,,2019-11-14T14:00:22,true,4,,,,,LE MONS,19400,MONCEAUX-SUR-DORDOGNE,,,19140,,,,,,,,,,,,,,,,,,,2008-01-01,A,,,,,68.20B,NAFRev2,N,1.8663,45.06928,0.91,street,Lieu-dit le Mons 19400 Monceaux-sur-Dordogne,19140_jao38z,G,LIEU DIT LE MONS,
327700514,00018,32770051400018,O,,,,,2019-11-14T14:00:22,true,1,,,,,LE CHAMBON,19400,MONCEAUX-SUR-DORDOGNE,,,19140,,,,,,,,,,,,,,,,,,,1984-12-25,F,,,,,62.46,NAP,N,1.927329,45.077576,0.92,street,Lieu-dit le Chambon 19400 Monceaux-sur-Dordogne,19140_ux1mhz,G,LIEU DIT LE CHAMBON,
327700522,00011,32770052200011,O,,NN,,,2019-11-14T14:00:22,true,1,,,,,LE CHAMBON,19400,MONCEAUX-SUR-DORDOGNE,,,19140,,,,,,,,,,,,,,,,,,,,F,,,,,67.04,NAP,N,1.927329,45.077576,0.92,street,Lieu-dit le Chambon 19400 Monceaux-sur-Dordogne,19140_ux1mhz,G,LIEU DIT LE CHAMBON,
327956025,00016,32795602500016,O,,NN,,,2019-11-14T14:00:22,true,1,,,,,LE BOURG,19400,MONCEAUX-SUR-DORDOGNE,,,19140,,,,,,,,,,,,,,,,,,,1993-11-01,F,,,,,01.2A,NAF1993,N,2.212915,47.9910304,0.9,poi.bar,Le Bourg (Bar) Ingrannes,https://osm.org/node/1718543174,G,,
328203757,00013,32820375700013,O,1983-10-01,NN,,,2019-11-14T14:00:22,false,3,,,,,LE BOURG,19400,MONCEAUX-SUR-DORDOGNE,,,19140,,,,,,,,,,,,,,,,,,,2006-01-31,F,,,,,01.4B,NAFRev1,N,2.212915,47.9910304,0.9,poi.bar,Le Bourg (Bar) Ingrannes,https://osm.org/node/1718543174,G,,
328203757,00021,32820375700021,O,1990-01-01,NN,,,2019-11-14T14:00:22,true,3,,,,,,19400,MONCEAUX-SUR-DORDOGNE,,,19140,,,,,,,,,,,,,,,,,,,2006-01-31,F,,,,,01.1G,NAFRev1,N,,,0,,,,,,
328784491,00016,32878449100016,O,1984-01-16,NN,,,2019-11-14T14:00:22,false,4,,,,,LE CHASSANG,19400,MONCEAUX-SUR-DORDOGNE,,,19140,,,,,,,,,,,,,,,,,,,2003-07-01,F,,,,,45.3A,NAFRev1,N,1.905805,45.08193,0.92,street,Impasse le Chassang 19400 Monceaux-sur-Dordogne,19140_4yef49,G,IMPASSE LE CHASSANG,
328889647,00017,32888964700017,O,1984-01-01,NN,,,2019-11-14T14:00:22,true,3,,,,LD,MOUSTOULAT,19400,MONCEAUX-SUR-DORDOGNE,,,19140,,,,,,,,,,,,,,,,,,,2008-01-01,A,,,,,01.42Z,NAFRev2,N,,,0,,,,,,
329125538,00028,32912553800028,O,1987-04-28,NN,,,2019-11-14T14:00:22,true,4,,,,,LA CHASSAGNE,19400,MONCEAUX-SUR-DORDOGNE,,,19140,,,,,,,,,,,,,,,,,,,2011-03-31,F,,,,,43.33Z,NAFRev2,N,1.883224,45.098005,0.94,street,La Chassagne 19400 Monceaux-sur-Dordogne,19140_dopjwr,G,LA CHASSAGNE,
329473391,00020,32947339100020,O,1984-04-09,NN,,,2019-11-14T14:00:22,true,1,,,,LD,LE MALPAS,19400,MONCEAUX-SUR-DORDOGNE,,,19140,,,,,,,,,,,,,,,,,,,2002-02-28,F,,,,,55.3A,NAF1993,O,1.92987,45.079737,0.94,street,Le Malpas 19400 Monceaux-sur-Dordogne,19140_1cf3jl,G,LE MALPAS,
329473466,00012,32947346600012,O,,NN,,,2019-11-14T14:00:22,true,1,,,,LD,LE VIALLARD,19400,MONCEAUX-SUR-DORDOGNE,,,19140,,,,,,,,,,,,,,,,,,,1996-12-31,F,,,,,45.2V,NAF1993,N,1.866203,45.053369,0.92,street,Lieu-dit le Viallard 19400 Monceaux-sur-Dordogne,19140_07zhxy,G,LIEU DIT LE VIALLARD,
329928477,00010,32992847700010,O,1984-01-01,NN,,,2019-11-14T14:00:22,true,4,,,,,AU BECH,19400,MONCEAUX-SUR-DORDOGNE,,,19140,,,,,,,,,,,,,,,,,,,2008-01-01,A,,,,,01.61Z,NAFRev2,N,1.892713,45.06618,0.57,street,Lieu-dit le Bech 19400 Monceaux-sur-Dordogne,19140_nd0gjc,G,LIEU DIT LE BECH,
329928477,00028,32992847700028,O,2012-12-01,,,,2019-12-05T13:03:44,false,2,,,,,LE BECH,19400,MONCEAUX-SUR-DORDOGNE,,,19140,,,,,,,,,,,,,,,,,,,2019-12-31,F,,,,,01.42Z,NAFRev2,N,1.892713,45.06618,0.91,street,Lieu-dit le Bech 19400 Monceaux-sur-Dordogne,19140_nd0gjc,G,LIEU DIT LE BECH,
332065374,00016,33206537400016,O,1985-01-01,NN,,,2019-11-14T14:00:22,true,3,,,,LD,LE BROS,19400,MONCEAUX-SUR-DORDOGNE,,,19140,,,,,,,,,,,,,,,,,,,2008-01-01,A,,,,,01.42Z,NAFRev2,N,3.9361585,43.6621568,0.87,poi.company,Bache Bros (Entreprise) Le Crès,https://osm.org/node/4207171829,G,,
332092360,00012,33209236000012,O,1985-01-01,NN,,,2019-11-14T14:00:22,true,3,,,,LD,LAFARGE,19400,MONCEAUX-SUR-DORDOGNE,,,19140,,,,,,,,,,,,,,,,,,,2008-01-01,A,,,,,01.42Z,NAFRev2,N,0.115169,45.6120812,0.89,poi.quarry,Carrière Lafarge La Couronne,https://osm.org/way/113144745,G,,
332115831,00031,33211583100031,O,2007-01-01,,,,2019-11-14T14:00:22,false,3,,,,,LA JONCHERE,19400,MONCEAUX-SUR-DORDOGNE,,,19140,,,,,,,,,,,,,,,,,,,2009-12-31,F,FERME AUBERGE DE LA JONCHERE,,,,55.20Z,NAFRev2,N,1.873015,45.049346,0.92,street,Lieu-dit la Jonchère 19400 Monceaux-sur-Dordogne,19140_rana15,G,LIEU DIT LA JONCHERE,
332296441,00014,33229644100014,O,,NN,,,2019-11-14T14:00:22,true,1,,,,LD,LES PRES DE VERGNOLLES,19400,MONCEAUX-SUR-DORDOGNE,,,19140,,,,,,,,,,,,,,,,,,,,F,,,,,02.20,NAP,N,1.916939,45.06332,0.94,locality,Les Pres de Vergnolles 19400 Monceaux-sur-Dordogne,19140_b131,G,LES PRES DE VERGNOLLES,
332541598,00014,33254159800014,O,1985-05-02,NN,,4391BZ,2019-11-14T14:00:22,false,5,,,,LD,LE CHAMPEAUX,19400,MONCEAUX-SUR-DORDOGNE,,,19140,,,,,,,,,,,,,,,,,,,2008-01-01,F,,,,,43.91B,NAFRev2,N,1.882141,45.077884,0.72,street,Lieu-dit Champeaux 19400 Monceaux-sur-Dordogne,19140_ehxv1l,G,LIEU DIT CHAMPEAUX,
332541598,00022,33254159800022,O,2015-08-01,,,4391BZ,2019-11-14T14:00:22,true,1,,,,,LE CLAUX,19400,MONCEAUX-SUR-DORDOGNE,,,19140,,,,,,,,,,,,,,,,,,,2015-08-01,A,,,,,43.91B,NAFRev2,N,1.879414,45.089077,0.91,street,Lieu-dit le Claux 19400 Monceaux-sur-Dordogne,19140_29ft8y,G,LIEU DIT LE CLAUX,
332712306,00015,33271230600015,O,1985-05-01,NN,,,2019-11-14T14:00:22,true,4,,,,LD,AU CHAMBON RTE DE BEAULIEU,19400,MONCEAUX-SUR-DORDOGNE,,,19140,,,,,,,,,,,,,,,,,,,2002-12-25,F,,,,,55.2C,NAF1993,N,1.927329,45.077576,0.43,street,Lieu-dit le Chambon 19400 Monceaux-sur-Dordogne,19140_ux1mhz,G,LIEU DIT LE CHAMBON,
332882711,00051,33288271100051,O,2014-03-01,,,,2019-11-14T14:00:22,true,1,,,,,LE BOURG,19400,MONCEAUX-SUR-DORDOGNE,,,19140,,,,,,,,,,,,,,,,,,,2014-03-01,A,,,,,74.90B,NAFRev2,N,2.212915,47.9910304,0.9,poi.bar,Le Bourg (Bar) Ingrannes,https://osm.org/node/1718543174,G,,
333321461,00019,33332146100019,O,1985-08-01,01,2018,4391BZ,2020-08-25T10:36:04,true,5,,,,LD,PONT DE LABORIE,19400,MONCEAUX-SUR-DORDOGNE,,,19140,,,,,,,,,,,,,,,,,,,2019-03-26,A,,,,,43.91B,NAFRev2,N,0.9661262,44.1552824,0.73,poi.track,Chemin Rural de Pont de Lapeyre à Labordes Castelsagrat,https://osm.org/way/49359110,G,,
334542693,00018,33454269300018,O,,NN,,,2019-11-14T14:00:22,true,1,,,,,,19400,MONCEAUX-SUR-DORDOGNE,,,19140,,,,,,,,,,,,,,,,,,,1994-04-30,F,,,,,01.1D,NAF1993,N,,,0,,,,,,
334866209,00078,33486620900078,O,2002-04-12,,,,2019-11-14T14:00:22,false,4,,,,,LE MALPAS,19400,MONCEAUX-SUR-DORDOGNE,,,19140,,,,,,,,,,,,,,,,,,,2003-12-25,F,,,,,55.3A,NAFRev1,O,1.92987,45.079737,0.94,street,Le Malpas 19400 Monceaux-sur-Dordogne,19140_1cf3jl,G,LE MALPAS,
334866209,00086,33486620900086,O,2004-05-01,NN,,,2019-11-14T14:00:22,true,20,LD,,,LD,LE CHAMBON,19400,MONCEAUX-SUR-DORDOGNE,,,19140,,,,,,,,,,,,,,,,,,,2012-11-01,F,LA GUINGUETTE DU MALPAS,,,LA GUINGUETTE DU MALPAS,56.10A,NAFRev2,N,1.927329,45.077576,0.92,street,Lieu-dit le Chambon 19400 Monceaux-sur-Dordogne,19140_ux1mhz,G,LIEU DIT LE CHAMBON,
335264685,00066,33526468500066,O,2007-11-01,,,4332AA,2019-11-14T14:00:22,true,3,,,,,LE GAUD,19400,MONCEAUX-SUR-DORDOGNE,,,19140,,,,,,,,,,,,,,,,,,,2016-12-31,F,,,,,43.32A,NAFRev2,N,1.9767176,45.2160681,0.89,poi.stream,Le Gaud (Ruisseau) Gumond,https://osm.org/way/356109347,G,,
337849541,00053,33784954100053,O,2011-04-15,NN,,,2019-11-14T14:00:22,false,2,,,,,CAMPING DU MALPAS,19400,MONCEAUX-SUR-DORDOGNE,,,19140,,,,,,,,,,,,,,,,,,,2011-09-01,F,,,,,56.10C,NAFRev2,O,1.9304971,45.0815539,0.82,poi.camp_site,L'Echo du Malpas (Camping) Monceaux-sur-Dordogne,https://osm.org/node/2908325001,G,,
338021520,00014,33802152000014,O,,NN,,,2019-11-14T14:00:22,true,1,,,,LD,LA JONCHERE,19400,MONCEAUX-SUR-DORDOGNE,,,19140,,,,,,,,,,,,,,,,,,,,F,,,,,64.49,NAP,N,1.873015,45.049346,0.92,street,Lieu-dit la Jonchère 19400 Monceaux-sur-Dordogne,19140_rana15,G,LIEU DIT LA JONCHERE,
338639123,00011,33863912300011,O,1986-06-01,NN,,,2019-11-14T14:00:22,true,3,,,,,,19400,MONCEAUX-SUR-DORDOGNE,,,19140,,,,,,,,,,,,,,,,,,,2008-01-01,A,,,,,55.30Z,NAFRev2,N,,,0,,,,,,
338651797,00056,33865179700056,O,2005-01-01,,,,2019-11-14T14:00:22,false,2,,,,,LE MOULIN DE VAURETTE,19400,MONCEAUX-SUR-DORDOGNE,,,19140,,,,,,,,,,,,,,,,,,,2006-03-01,F,,,,,51.4S,NAFRev1,N,1.890747,45.047624,0.83,street,Moulin de Vaurette 19400 Monceaux-sur-Dordogne,19140_b109,G,MOULIN DE VAURETTE,
339058174,00014,33905817400014,O,1986-10-25,NN,,,2019-11-14T14:00:22,true,4,,,,LD,FENEYROL,19400,MONCEAUX-SUR-DORDOGNE,,,19140,,,,,,,,,,,,,,,,,,,2012-12-31,F,,,,,43.22A,NAFRev2,N,1.877772,45.047066,0.94,street,Feneyrol 19400 Monceaux-sur-Dordogne,19140_datmnq,G,FENEYROL,
339930364,00056,33993036400056,O,1999-08-23,,,,2019-11-14T14:00:22,false,3,,,,,MOUSTOULAT,19400,MONCEAUX-SUR-DORDOGNE,,,19140,,,,,,,,,,,,,,,,,,,2000-08-14,F,AGNES Z,,,,93.0D,NAF1993,N,,,0,,,,,,
340252766,00019,34025276600019,O,1987-01-01,NN,,,2019-11-14T14:00:22,true,4,,,,,SAULIERES,19400,MONCEAUX-SUR-DORDOGNE,,,19140,,,,,,,,,,,,,,,,,,,2008-12-31,A,,,,,01.42Z,NAFRev2,O,1.905989,45.054532,0.92,locality,Saulieres Sud 19400 Monceaux-sur-Dordogne,19140_b152,G,SAULIERES SUD,
340449966,00019,34044996600019,O,1987-01-01,NN,,,2019-11-14T14:00:22,true,3,,,,LD,LES DAMES,19400,MONCEAUX-SUR-DORDOGNE,,,19140,,,,,,,,,,,,,,,,,,,2006-11-30,F,,,,,01.2A,NAFRev1,N,1.852264,45.063162,0.94,street,Les Dames 19400 Monceaux-sur-Dordogne,19140_hxbgsf,G,LES DAMES,
342215043,00015,34221504300015,O,1987-05-09,NN,,,2019-11-14T14:00:22,true,3,MAIRIE,,,,,19400,MONCEAUX-SUR-DORDOGNE,,,19140,,,,,,,,,,,,,,,,,,,2008-01-01,A,,,,,93.12Z,NAFRev2,N,1.922883,45.093535,0.37,locality,Le Pont de la Borie 19400 Monceaux-sur-Dordogne,19140_b122,D,LE PONT DE LA BORIE,
343903571,00010,34390357100010,O,1988-01-01,NN,,,2019-11-14T14:00:22,true,3,,,,,,19400,MONCEAUX-SUR-DORDOGNE,,,19140,,,,,,,,,,,,,,,,,,,2008-01-01,A,,,,,01.46Z,NAFRev2,N,,,0,,,,,,