siren,nic,siret,statutDiffusionEtablissement,dateCreationEtablissement,trancheEffectifsEtablissement,anneeEffectifsEtablissement,activitePrincipaleRegistreMetiersEtablissement,dateDernierTraitementEtablissement,etablissementSiege,nombrePeriodesEtablissement,complementAdresseEtablissement,numeroVoieEtablissement,indiceRepetitionEtablissement,typeVoieEtablissement,libelleVoieEtablissement,codePostalEtablissement,libelleCommuneEtablissement,libelleCommuneEtrangerEtablissement,distributionSpecialeEtablissement,codeCommuneEtablissement,codeCedexEtablissement,libelleCedexEtablissement,codePaysEtrangerEtablissement,libellePaysEtrangerEtablissement,complementAdresse2Etablissement,numeroVoie2Etablissement,indiceRepetition2Etablissement,typeVoie2Etablissement,libelleVoie2Etablissement,codePostal2Etablissement,libelleCommune2Etablissement,libelleCommuneEtranger2Etablissement,distributionSpeciale2Etablissement,codeCommune2Etablissement,codeCedex2Etablissement,libelleCedex2Etablissement,codePaysEtranger2Etablissement,libellePaysEtranger2Etablissement,dateDebut,etatAdministratifEtablissement,enseigne1Etablissement,enseigne2Etablissement,enseigne3Etablissement,denominationUsuelleEtablissement,activitePrincipaleEtablissement,nomenclatureActivitePrincipaleEtablissement,caractereEmployeurEtablissement,longitude,latitude,geo_score,geo_type,geo_adresse,geo_id,geo_ligne,geo_l4,geo_l5
262800824,00019,26280082400019,O,,,,,2019-01-11T13:01:19,true,1,,,,,,28200,LANNERAY,,,28205,,,,,,,,,,,,,,,,,,,,F,,,,,95.11,NAP,N,,,0,,,,,,
300240223,00010,30024022300010,O,,,,,2019-01-11T13:01:19,true,1,,,,,,28200,LANNERAY,,,28205,,,,,,,,,,,,,,,,,,,1984-12-25,F,,,,,00.10,NAP,N,,,0,,,,,,
302808159,00016,30280815900016,O,,NN,,,2019-01-11T13:01:19,true,1,,25,,RUE,DE LA MAIRIE,28200,LANNERAY,,,28205,,,,,,,,,,,,,,,,,,,1994-12-31,F,,,,,45.2V,NAF1993,O,1.239081,48.086009,0.94,housenumber,25 Rue de la Mairie 28200 Saint-Denis-Lanneray,28205_0040_00025,G,25 RUE DE LA MAIRIE,
304792880,00029,30479288000029,O,,NN,,,2019-01-11T13:01:19,true,1,,,,,TOUCHEMONT,28200,LANNERAY,,,28205,,,,,,,,,,,,,,,,,,,1988-09-30,F,,,,,80.08,NAP,N,1.233479,48.068712,0.92,street,Lieu Dit Touchemont 28200 Saint-Denis-Lanneray,28334_2ufzoc,G,LIEU DIT TOUCHEMONT,
317065365,00015,31706536500015,O,,NN,,,2019-01-11T13:01:19,true,1,,,,,AU BOURG,28200,LANNERAY,,,28205,,,,,,,,,,,,,,,,,,,,F,,,,,89.03,NAP,N,-1.9115621,47.1089349,0.88,poi.track,Chemin du Breil au Bourg Chaumes-en-Retz,https://osm.org/way/283246644,G,,
317238731,00010,31723873100010,O,,NN,,,2019-01-11T13:01:19,true,1,,,,,,28200,LANNERAY,,,28205,,,,,,,,,,,,,,,,,,,,F,,,,,67.05,NAP,N,,,0,,,,,,
318340361,00019,31834036100019,O,,,,,2019-01-11T13:01:19,true,1,,,,,LE COUDRAY,28200,LANNERAY,,,28205,,,,,,,,,,,,,,,,,,,1984-12-25,F,,,,,55.71,NAP,N,1.226163,48.088691,0.94,street,Le Coudray 28200 Saint-Denis-Lanneray,28334_rmguj6,G,LE COUDRAY,
324887280,00018,32488728000018,O,1982-06-28,NN,,,2019-01-11T13:01:19,true,1,,,,RTE,DES BOIS,28200,LANNERAY,,,28205,,,,,,,,,,,,,,,,,,,1997-07-28,F,,,,,45.1A,NAF1993,N,1.240043,48.086997,0.8,street,Route des Bois 28200 Saint-Denis-Lanneray,28205_0010,G,ROUTE DES BOIS,
327052601,00017,32705260100017,O,1983-01-01,NN,,,2019-01-11T13:01:19,true,1,,,,,LA FORET,28200,LANNERAY,,,28205,,,,,,,,,,,,,,,,,,,1995-04-19,F,,,,,01.1A,NAF1993,N,1.25844,48.086529,0.94,street,La Foret 28200 Saint-Denis-Lanneray,28334_rc3wuo,G,LA FORET,
329978944,00018,32997894400018,O,1984-06-01,NN,,,2019-01-11T13:01:19,true,1,,,,,,28200,LANNERAY,,,28205,,,,,,,,,,,,,,,,,,,1999-01-31,F,,,,,92.1G,NAF1993,O,,,0,,,,,,
331957068,00025,33195706800025,O,1995-07-01,NN,,,2019-01-11T13:01:19,true,1,,6,,RUE,MONNETIERE,28200,LANNERAY,,,28205,,,,,,,,,,,,,,,,,,,1998-12-28,F,,,,,45.4M,NAF1993,O,1.243114,48.087095,0.81,housenumber,6 Rue de la Monetiere 28200 Saint-Denis-Lanneray,28205_0045_00006,G,6 RUE DE LA MONETIERE,
338101090,00011,33810109000011,O,,NN,,,2019-01-11T13:01:19,true,1,,44,,RUE,DE LA MAIRIE,28200,LANNERAY,,,28205,,,,,,,,,,,,,,,,,,,1991-04-02,F,,,,,67.07,NAP,N,1.240731,48.087572,0.94,housenumber,44 Rue de la Mairie 28200 Saint-Denis-Lanneray,28205_0040_00044,G,44 RUE DE LA MAIRIE,
341167088,00010,34116708800010,O,,NN,,,2019-01-11T13:01:19,true,1,,,,,LA POTERIE,28200,LANNERAY,,,28205,,,,,,,,,,,,,,,,,,,1987-12-31,F,,,,,79.02,NAP,N,1.23145,48.107399,0.94,street,La Poterie 28200 Saint-Denis-Lanneray,28334_vfmszh,G,LA POTERIE,
349322701,00013,34932270100013,O,,NN,,,2019-01-11T13:01:19,true,1,,,,,BOIS BERTRAND,28200,LANNERAY,,,28205,,,,,,,,,,,,,,,,,,,1989-12-31,F,,,,,02.0B,NAF1993,N,1.258201,48.086536,0.93,street,Le Bois Bertrand 28200 Saint-Denis-Lanneray,28205_b003,G,LE BOIS BERTRAND,
352368161,00019,35236816100019,O,,NN,,,2019-01-11T13:01:19,true,1,,3,,RUE,DU FER A CHEVAL,28200,LANNERAY,,,28205,,,,,,,,,,,,,,,,,,,1996-09-30,F,,,,,92.3B,NAF1993,O,1.237782,48.087959,0.93,housenumber,3 Rue du Fer à Cheval (Lanneray) 28200 Saint-Denis-Lanneray,28205_0020_00003,G,3 RUE DU FER A CHEVAL,LANNERAY
378757538,00012,37875753800012,O,1990-08-01,NN,,,2019-01-11T13:01:19,true,1,,,,,TOUCHEMONT,28200,LANNERAY,,,28205,,,,,,,,,,,,,,,,,,,2002-04-16,F,,,,,55.3A,NAF1993,N,1.233479,48.068712,0.92,street,Lieu Dit Touchemont 28200 Saint-Denis-Lanneray,28334_2ufzoc,G,LIEU DIT TOUCHEMONT,
379082811,00017,37908281100017,O,1990-08-22,,,,2019-01-11T13:01:19,true,1,,,,LD,TOUCHEMONT,28200,LANNERAY,,,28205,,,,,,,,,,,,,,,,,,,2002-04-01,F,,,,,74.1J,NAF1993,N,1.233479,48.068712,0.92,street,Lieu Dit Touchemont 28200 Saint-Denis-Lanneray,28334_2ufzoc,G,LIEU DIT TOUCHEMONT,
381727346,00011,38172734600011,O,,NN,,,2019-01-11T13:01:19,true,1,,44,,RUE,DE LA MAIRIE,28200,LANNERAY,,,28205,,,,,,,,,,,,,,,,,,,1995-06-30,F,,,,,55.4B,NAF1993,N,1.240731,48.087572,0.94,housenumber,44 Rue de la Mairie 28200 Saint-Denis-Lanneray,28205_0040_00044,G,44 RUE DE LA MAIRIE,
388268286,00019,38826828600019,O,1990-08-01,NN,,,2019-01-11T13:01:19,true,1,,,,,TOUCHEMONT,28200,LANNERAY,,,28205,,,,,,,,,,,,,,,,,,,2002-04-16,F,,,,,70.2C,NAF1993,N,1.233479,48.068712,0.92,street,Lieu Dit Touchemont 28200 Saint-Denis-Lanneray,28334_2ufzoc,G,LIEU DIT TOUCHEMONT,
420140618,00018,42014061800018,O,1984-12-31,,,,2019-01-11T13:01:19,true,1,,20,,RTE,DES BOIS,28200,LANNERAY,,,28205,,,,,,,,,,,,,,,,,,,1999-05-31,F,,,,,01.1A,NAF1993,N,1.242825,48.086318,0.83,housenumber,20 Route des Bois 28200 Saint-Denis-Lanneray,28205_0010_00020,G,20 ROUTE DES BOIS,
424766236,00022,42476623600022,O,2000-07-01,NN,,,2019-01-11T13:01:19,false,4,,10,,RUE,DU CLOS DE LA CROIX,28200,LANNERAY,,,28205,,,,,,,,,,,,,,,,,,,2001-12-31,F,,,,,74.1G,NAF1993,N,1.243368,48.088291,0.82,housenumber,10 Rue Clos de la Croix 28200 Saint-Denis-Lanneray,28205_0055_00010,G,10 RUE CLOS DE LA CROIX,
622016269,00020,62201626900020,O,1983-01-01,NN,,,2019-01-11T13:01:19,true,1,,,,LD,LE COUDRAY,28200,LANNERAY,,,28205,,,,,,,,,,,,,,,,,,,1994-03-31,F,,,,,28.7L,NAF1993,O,1.226163,48.088691,0.94,street,Le Coudray 28200 Saint-Denis-Lanneray,28334_rmguj6,G,LE COUDRAY,
775130594,00010,77513059400010,O,,,,,2019-01-11T13:01:19,true,1,,,,LD,SAINTE RADEGONDE,28200,LANNERAY,,,28205,,,,,,,,,,,,,,,,,,,1985-12-25,F,,,,,01.63,NAP,N,1.225332,48.09082,0.94,street,Sainte Radegonde 28200 Saint-Denis-Lanneray,28205_b101,G,SAINTE RADEGONDE,
775130602,00011,77513060200011,O,,,,,2019-01-11T13:01:19,true,1,,,,,CHATELIERS,28200,LANNERAY,,,28205,,,,,,,,,,,,,,,,,,,1984-12-25,F,,,,,01.56,NAP,N,1.205731,48.09224,0.85,street,Les Chatelliers 28200 Saint-Denis-Lanneray,28334_25t0ta,G,LES CHATELLIERS,
775130628,00016,77513062800016,O,,NN,,,2019-01-11T13:01:19,true,1,,16,,RUE,CLOS DE LA CROIX,28200,LANNERAY,,,28205,,,,,,,,,,,,,,,,,,,1989-09-28,F,,,,,22.02,NAP,N,1.244339,48.090001,0.94,housenumber,16 Rue Clos de la Croix 28200 Saint-Denis-Lanneray,28205_0055_00016,G,16 RUE CLOS DE LA CROIX,
775130644,00013,77513064400013,O,,NN,,,2019-01-11T13:01:19,true,1,,,,,,28200,LANNERAY,,,28205,,,,,,,,,,,,,,,,,,,,F,,,,,55.71,NAP,N,,,0,,,,,,
775130651,00018,77513065100018,O,,NN,,,2019-01-11T13:01:19,true,1,,,,,,28200,LANNERAY,,,28205,,,,,,,,,,,,,,,,,,,,F,,,,,81.11,NAP,N,,,0,,,,,,
805410198,00016,80541019800016,O,,,,,2019-01-11T13:01:19,true,1,,,,,AU BOURG,28200,LANNERAY,,,28205,,,,,,,,,,,,,,,,,,,1984-12-25,F,,,,,01.80,NAP,N,-1.9115621,47.1089349,0.88,poi.track,Chemin du Breil au Bourg Chaumes-en-Retz,https://osm.org/way/283246644,G,,
806012977,00013,80601297700013,O,,,,,2019-01-11T13:01:19,true,1,,,,,,28200,LANNERAY,,,28205,,,,,,,,,,,,,,,,,,,1984-12-25,F,,,,,67.07,NAP,N,,,0,,,,,,
806213138,00019,80621313800019,O,,,,4312BA,2019-01-11T13:01:19,true,1,,,,LD,LA FORET,28200,LANNERAY,,,28205,,,,,,,,,,,,,,,,,,,1984-12-25,F,,,,,55.10,NAP,N,1.25844,48.086529,0.94,street,La Foret 28200 Saint-Denis-Lanneray,28334_rc3wuo,G,LA FORET,
