siren,nic,siret,statutDiffusionEtablissement,dateCreationEtablissement,trancheEffectifsEtablissement,anneeEffectifsEtablissement,activitePrincipaleRegistreMetiersEtablissement,dateDernierTraitementEtablissement,etablissementSiege,nombrePeriodesEtablissement,complementAdresseEtablissement,numeroVoieEtablissement,indiceRepetitionEtablissement,typeVoieEtablissement,libelleVoieEtablissement,codePostalEtablissement,libelleCommuneEtablissement,libelleCommuneEtrangerEtablissement,distributionSpecialeEtablissement,codeCommuneEtablissement,codeCedexEtablissement,libelleCedexEtablissement,codePaysEtrangerEtablissement,libellePaysEtrangerEtablissement,complementAdresse2Etablissement,numeroVoie2Etablissement,indiceRepetition2Etablissement,typeVoie2Etablissement,libelleVoie2Etablissement,codePostal2Etablissement,libelleCommune2Etablissement,libelleCommuneEtranger2Etablissement,distributionSpeciale2Etablissement,codeCommune2Etablissement,codeCedex2Etablissement,libelleCedex2Etablissement,codePaysEtranger2Etablissement,libellePaysEtranger2Etablissement,dateDebut,etatAdministratifEtablissement,enseigne1Etablissement,enseigne2Etablissement,enseigne3Etablissement,denominationUsuelleEtablissement,activitePrincipaleEtablissement,nomenclatureActivitePrincipaleEtablissement,caractereEmployeurEtablissement,longitude,latitude,geo_score,geo_type,geo_adresse,geo_id,geo_ligne,geo_l4,geo_l5
185704152,00015,18570415200015,O,1986-03-19,,,,2008-01-04T18:18:30,true,3,,,,,,57420,VIGNY,,,57715,,,,,,,,,,,,,,,,,,,2008-01-01,A,,,,,94.91Z,NAFRev2,N,,,0,,,,,,
200002897,00011,20000289700011,O,2006-01-01,,,,2008-01-04T18:22:08,true,2,MAIRIE,,,RUE,DE GOIN,57420,VIGNY,,,57715,,,,,,,,,,,,,,,,,,,2008-01-01,A,,,,,42.99Z,NAFRev2,N,6.248978,48.968515,0.93,street,Rue de Goin 57420 Vigny,57715_0060,G,RUE DE GOIN,
215707159,00012,21570715900012,O,1983-03-01,02,2018,,2020-08-25T10:17:57,true,3,,2,,RUE,DE GOIN,57420,VIGNY,,,57715,,,,,,,,,,,,,,,,,,,2008-01-01,A,MAIRIE,,,,84.11Z,NAFRev2,N,6.248478,48.969094,0.93,housenumber,2 Rue de Goin 57420 Vigny,57715_0060_00002,G,2 RUE DE GOIN,
215707159,00020,21570715900020,O,1983-12-21,01,2018,,2020-08-25T10:17:57,false,3,,2,,RUE,DE GOIN,57420,VIGNY,,,57715,,,,,,,,,,,,,,,,,,,2008-01-01,A,ECOLE PRIMAIRE PUBLIQUE,,,,85.20Z,NAFRev2,N,6.248478,48.969094,0.93,housenumber,2 Rue de Goin 57420 Vigny,57715_0060_00002,G,2 RUE DE GOIN,
301407268,00020,30140726800020,O,1993-06-30,NN,,,2008-11-07T00:17:27,true,5,,1,,RUE,DE GOIN,57420,VIGNY,,,57715,,,,,,,,,,,,,,,,,,,2008-06-30,F,,,,,43.33Z,NAFRev2,N,6.248978,48.968515,0.93,housenumber,1 Rue de Goin 57420 Vigny,57715_0060_00001,G,1 RUE DE GOIN,
301562096,00018,30156209600018,O,,,,,,true,1,,77,,RUE,PRINCIPALE,57420,VIGNY,,,57715,,,,,,,,,,,,,,,,,,,1984-12-25,F,,,,,55.71,NAP,N,6.245928,48.967073,0.93,housenumber,77 Rue Principale 57420 Vigny,57715_0055_00077,G,77 RUE PRINCIPALE,
309474344,00012,30947434400012,O,,,,,,true,1,,48,,RUE,DE L EGLISE,57420,VIGNY,,,57715,,,,,,,,,,,,,,,,,,,1990-09-30,F,,,,,86.06,NAP,N,6.247503,48.968645,0.81,street,Rue de l'Eglise 57420 Vigny,57715_yx4fto,G,RUE DE L EGLISE,
310643515,00227,31064351500227,O,2007-02-15,NN,,,2011-04-23T04:40:47,false,3,,52,,RUE,PRINCIPALE,57420,VIGNY,,,57715,,,,,,,,,,,,,,,,,,,2009-01-31,F,,,,,52.10A,NAFRev2,O,6.247912,48.967759,0.93,housenumber,52 Rue Principale 57420 Vigny,57715_0055_00052,G,52 RUE PRINCIPALE,
318998531,00012,31899853100012,O,,,,,,true,1,,,,RTE,GOIN,57420,VIGNY,,,57715,,,,,,,,,,,,,,,,,,,1984-12-25,F,,,,,62.43,NAP,N,6.248978,48.968515,0.61,street,Rue de Goin 57420 Vigny,57715_0060,G,RUE DE GOIN,
327700092,00015,32770009200015,O,,NN,,,,true,1,,5,,RUE,DE GOIN,57420,VIGNY,,,57715,,,,,,,,,,,,,,,,,,,1990-03-14,F,,,,,65.06,NAP,N,6.248734,48.969005,0.93,housenumber,5 Rue de Goin 57420 Vigny,57715_0060_00005,G,5 RUE DE GOIN,
334310778,00017,33431077800017,O,,NN,,,,true,1,,2,,IMP,DE LA FONTAINE,57420,VIGNY,,,57715,,,,,,,,,,,,,,,,,,,1988-04-30,F,,,,,84.12,NAP,N,6.254029,48.96983,0.85,housenumber,2 Impasse de la Fontaine 57420 Vigny,57715_0052_00002,G,2 IMPASSE DE LA FONTAINE,
335202131,00017,33520213100017,O,1986-04-01,NN,,,,false,4,,9,,RTE,DE GOIN,57420,VIGNY,,,57715,,,,,,,,,,,,,,,,,,,1994-10-01,F,,,,,01.3Z,NAF1993,N,6.248928,48.969045,0.74,housenumber,9 Rue de Goin 57420 Vigny,57715_0060_00009,G,9 RUE DE GOIN,
338266612,00039,33826661200039,O,,,,,,true,1,,30,,RUE,PRINCIPALE,57420,VIGNY,,,57715,,,,,,,,,,,,,,,,,,,1997-03-01,F,,,,,93.0D,NAF1993,N,6.250261,48.968373,0.93,housenumber,30 Rue Principale 57420 Vigny,57715_0055_00030,G,30 RUE PRINCIPALE,
340231992,00017,34023199200017,O,,NN,,,,true,1,,26,,RUE,DE GOIN,57420,VIGNY,,,57715,,,,,,,,,,,,,,,,,,,1987-10-31,F,,,,,64.43,NAP,N,6.249935,48.970245,0.93,housenumber,26 Rue de Goin 57420 Vigny,57715_0060_00026,G,26 RUE DE GOIN,
340959212,00028,34095921200028,O,1992-01-01,NN,,,,true,4,,52,,,PRINCIPALE,57420,VIGNY,,,57715,,,,,,,,,,,,,,,,,,,2003-12-25,F,,,,,60.2M,NAFRev1,O,6.247912,48.967759,0.86,housenumber,52 Rue Principale 57420 Vigny,57715_0055_00052,G,52 RUE PRINCIPALE,
341268423,00017,34126842300017,O,1987-01-01,00,2018,4312BA,2020-08-25T10:39:51,true,4,,12,,RUE,DE SECOURT,57420,VIGNY,,,57715,,,,,,,,,,,,,,,,,,,2018-12-31,F,,,,,43.12A,NAFRev2,N,6.251785,48.967825,0.93,housenumber,12 Rue de Secourt 57420 Vigny,57715_0090_00012,G,12 RUE DE SECOURT,
344897814,00010,34489781400010,O,1988-05-01,,,,2008-11-17T08:27:55,false,5,,52,,RUE,PRINCIPALE,57420,VIGNY,,,57715,,,,,,,,,,,,,,,,,,,2004-07-01,F,BRICO ENTRETIEN,,,,01.3Z,NAFRev1,N,6.247912,48.967759,0.93,housenumber,52 Rue Principale 57420 Vigny,57715_0055_00052,G,52 RUE PRINCIPALE,
350199642,00025,35019964200025,O,2009-01-01,,,,2010-03-03T05:30:35,true,2,,,,,,57420,VIGNY,,,57715,,,,,,,,,,,,,,,,,,,2009-11-30,F,,,,,01.11Z,NAFRev2,N,,,0,,,,,,
350900197,00020,35090019700020,O,2012-12-10,,,,2013-02-26T08:41:12,true,2,,34,,RUE,PRINCIPALE,57420,VIGNY,,,57715,,,,,,,,,,,,,,,,,,,2013-02-19,F,,,,,86.90F,NAFRev2,N,6.249883,48.968207,0.93,housenumber,34 Rue Principale 57420 Vigny,57715_0055_00034,G,34 RUE PRINCIPALE,
370700460,00014,37070046000014,O,1970-01-01,NN,,,2008-11-08T00:32:11,true,4,,17,B,RUE,PRINCIPALE,57420,VIGNY,,,57715,,,,,,,,,,,,,,,,,,,2003-04-30,F,,,,,50.2Z,NAFRev1,N,6.25307,48.96956,0.93,interpolation,17 Rue Principale 57420 Vigny,,G,15 RUE PRINCIPALE,
377557707,00017,37755770700017,O,,NN,,,,true,1,,39,,RUE,PRINCIPALE,57420,VIGNY,,,57715,,,,,,,,,,,,,,,,,,,1996-11-30,F,,,,,51.1R,NAF1993,N,6.250565,48.968435,0.93,housenumber,39 Rue Principale 57420 Vigny,57715_0055_00039,G,39 RUE PRINCIPALE,
379532310,00016,37953231000016,O,,NN,,,,true,1,,34,,RUE,PRINCIPALE,57420,VIGNY,,,57715,,,,,,,,,,,,,,,,,,,1990-10-18,F,,,,,62.46,NAP,N,6.249883,48.968207,0.93,housenumber,34 Rue Principale 57420 Vigny,57715_0055_00034,G,34 RUE PRINCIPALE,
379654338,00027,37965433800027,O,2014-12-31,,,,2017-07-24T08:32:09,true,3,,50,,RUE,PRINCIPALE,57420,VIGNY,,,57715,,,,,,,,,,,,,,,,,,,2017-06-30,F,,,,,86.90E,NAFRev2,N,6.248406,48.967944,0.93,housenumber,50 Rue Principale 57420 Vigny,57715_0055_00050,G,50 RUE PRINCIPALE,
381988625,00012,38198862500012,O,1991-05-01,00,2017,,2019-06-24T13:11:39,true,3,,65,,RUE,PRINCIPALE,57420,VIGNY,,,57715,,,,,,,,,,,,,,,,,,,2008-01-01,A,,,,,01.11Z,NAFRev2,N,6.247468,48.967776,0.93,housenumber,65 Rue Principale 57420 Vigny,57715_0055_00065,G,65 RUE PRINCIPALE,
382354496,00012,38235449600012,O,,,,,,true,1,,53,,RUE,PRINCIPALE,57420,VIGNY,,,57715,,,,,,,,,,,,,,,,,,,1991-10-15,F,,,,,67.01,NAP,N,6.249277,48.968288,0.93,housenumber,53 Rue Principale 57420 Vigny,57715_0055_00053,G,53 RUE PRINCIPALE,
383048030,00019,38304803000019,O,1991-10-01,01,2018,4322BB,2020-08-25T10:20:01,true,6,,37,,RUE,PRINCIPALE,57420,VIGNY,,,57715,,,,,,,,,,,,,,,,,,,2013-04-08,A,GALLAND GERARD,,,,43.22B,NAFRev2,N,6.250758,48.968556,0.93,housenumber,37 Rue Principale 57420 Vigny,57715_0055_00037,G,37 RUE PRINCIPALE,
383507159,00010,38350715900010,O,1991-10-01,NN,,,2017-01-31T03:23:26,true,3,,52,,RUE,PRINCIPALE,57420,VIGNY,,,57715,,,,,,,,,,,,,,,,,,,2008-01-01,A,,,,,68.20A,NAFRev2,N,6.247912,48.967759,0.93,housenumber,52 Rue Principale 57420 Vigny,57715_0055_00052,G,52 RUE PRINCIPALE,
385148606,00010,38514860600010,O,1992-01-01,NN,,,2007-01-18T09:30:50,true,3,,2,,RUE,PRINCIPALE,57420,VIGNY,,,57715,,,,,,,,,,,,,,,,,,,2005-08-31,F,,,,,01.1A,NAFRev1,N,6.255597,48.970675,0.93,housenumber,2 Rue Principale 57420 Vigny,57715_0055_00002,G,2 RUE PRINCIPALE,
389428590,00027,38942859000027,O,1995-10-01,NN,,,2006-11-25T11:56:48,false,5,,18,,RUE,PRINCIPALE,57420,VIGNY,,,57715,,,,,,,,,,,,,,,,,,,2004-12-13,F,,,,,51.8M,NAFRev1,O,6.251813,48.968868,0.93,housenumber,18 Rue Principale 57420 Vigny,57715_0055_00018,G,18 RUE PRINCIPALE,
389674805,00012,38967480500012,O,1993-01-01,NN,,,2008-11-08T00:51:14,false,4,,77,,RUE,PRINCIPALE,57420,VIGNY,,,57715,,,,,,,,,,,,,,,,,,,1997-12-31,F,,,,,29.3C,NAF1993,O,6.245928,48.967073,0.93,housenumber,77 Rue Principale 57420 Vigny,57715_0055_00077,G,77 RUE PRINCIPALE,
389674805,00020,38967480500020,O,1998-01-01,NN,,,2013-11-05T13:12:31,true,3,,77,,RUE,PRINCIPALE,57420,VIGNY,,,57715,,,,,,,,,,,,,,,,,,,2008-01-01,A,,,,,77.12Z,NAFRev2,N,6.245928,48.967073,0.93,housenumber,77 Rue Principale 57420 Vigny,57715_0055_00077,G,77 RUE PRINCIPALE,
392870069,00045,39287006900045,O,2011-04-04,,,,2012-11-09T00:54:30,true,2,,15,,RUE,DE GOIN,57420,VIGNY,,,57715,,,,,,,,,,,,,,,,,,,2011-10-20,F,EASYCO,,,,47.99B,NAFRev2,N,6.249846,48.969736,0.93,housenumber,15 Rue de Goin 57420 Vigny,57715_0060_00015,G,15 RUE DE GOIN,
400199675,00028,40019967500028,O,2012-10-15,,,,2014-04-30T08:32:57,false,2,,42,,RUE,PRINCIPALE,57420,VIGNY,,,57715,,,,,,,,,,,,,,,,,,,2013-12-03,F,,,,,70.22Z,NAFRev2,N,6.248943,48.968102,0.93,housenumber,42 Rue Principale 57420 Vigny,57715_0055_00042,G,42 RUE PRINCIPALE,
400290425,00018,40029042500018,O,1978-01-01,NN,,,2016-10-23T03:20:36,true,4,,77,,RUE,PRINCIPALE,57420,VIGNY,,,57715,,,,,,,,,,,,,,,,,,,2016-10-01,F,,,,,01.11Z,NAFRev2,N,6.245928,48.967073,0.93,housenumber,77 Rue Principale 57420 Vigny,57715_0055_00077,G,77 RUE PRINCIPALE,
407702455,00012,40770245500012,O,1996-05-02,NN,,,2008-01-05T20:22:31,true,3,,75,,RUE,PRINCIPALE,57420,VIGNY,,,57715,,,,,,,,,,,,,,,,,,,2008-01-01,A,,,,,68.20B,NAFRev2,N,6.246242,48.967186,0.93,housenumber,75 Rue Principale 57420 Vigny,57715_0055_00075,G,75 RUE PRINCIPALE,
408933687,00019,40893368700019,O,1989-12-01,NN,,,2008-01-04T21:18:41,true,5,,25,,RUE,PRINCIPALE,57420,VIGNY,,,57715,,,,,,,,,,,,,,,,,,,2008-01-01,A,,,,,01.50Z,NAFRev2,N,6.252356,48.969275,0.93,housenumber,25 Rue Principale 57420 Vigny,57715_0055_00025,G,25 RUE PRINCIPALE,
408933695,00012,40893369500012,O,1993-01-01,NN,,,,true,1,,22,,RUE,PRINCIPALE,57420,VIGNY,,,57715,,,,,,,,,,,,,,,,,,,2002-12-31,F,,,,,01.1A,NAF1993,N,6.251368,48.968659,0.93,housenumber,22 Rue Principale 57420 Vigny,57715_0055_00022,G,22 RUE PRINCIPALE,
409182045,00016,40918204500016,O,1996-10-10,NN,,,2006-11-25T15:20:08,true,4,,53,,RUE,PRINCIPALE,57420,VIGNY,,,57715,,,,,,,,,,,,,,,,,,,2003-10-01,F,,,,,55.3A,NAFRev1,O,6.249277,48.968288,0.93,housenumber,53 Rue Principale 57420 Vigny,57715_0055_00053,G,53 RUE PRINCIPALE,
409702990,00022,40970299000022,O,2000-03-23,NN,,,2006-11-25T15:22:03,true,3,,18,,RUE,PRINCIPALE,57420,VIGNY,,,57715,,,,,,,,,,,,,,,,,,,2000-12-25,F,,,,,70.1F,NAF1993,N,6.251813,48.968868,0.93,housenumber,18 Rue Principale 57420 Vigny,57715_0055_00018,G,18 RUE PRINCIPALE,
410403356,00018,41040335600018,O,1980-01-01,NN,,,2008-06-01T04:42:50,true,4,,19,,RUE,DE GOIN,57420,VIGNY,,,57715,,,,,,,,,,,,,,,,,,,2008-07-31,F,,,,,01.11Z,NAFRev2,N,6.250131,48.970123,0.93,housenumber,19 Rue de Goin 57420 Vigny,57715_0060_00019,G,19 RUE DE GOIN,
411128580,00015,41112858000015,O,1996-11-06,NN,,,2008-01-04T21:53:59,true,3,MME DENIS FLORENCE,21,,RTE,DE GOIN,57420,VIGNY,,,57715,,,,,,,,,,,,,,,,,,,2008-01-01,A,,,,,68.20A,NAFRev2,N,6.249982,48.970317,0.75,housenumber,21 Rue de Goin 57420 Vigny,57715_0060_00021,G,21 RUE DE GOIN,
412525743,00016,41252574300016,O,1997-06-02,NN,,4322BA,2015-03-17T00:50:29,true,4,,37,,RUE,PRINCIPALE,57420,VIGNY,,,57715,,,,,,,,,,,,,,,,,,,2008-01-01,A,,,,,46.74B,NAFRev2,N,6.250758,48.968556,0.93,housenumber,37 Rue Principale 57420 Vigny,57715_0055_00037,G,37 RUE PRINCIPALE,
414836825,00011,41483682500011,O,1997-12-02,NN,,,2008-01-04T22:54:52,true,3,,18,,RUE,PRINCIPALE,57420,VIGNY,,,57715,,,,,,,,,,,,,,,,,,,2008-01-01,A,,,,,68.20A,NAFRev2,N,6.251813,48.968868,0.93,housenumber,18 Rue Principale 57420 Vigny,57715_0055_00018,G,18 RUE PRINCIPALE,
417625738,00014,41762573800014,O,1998-01-01,NN,,2511ZZ,2015-03-17T00:52:22,true,3,,77,,RUE,PRINCIPALE,57420,VIGNY,,,57715,,,,,,,,,,,,,,,,,,,2008-01-01,A,,,,,25.11Z,NAFRev2,O,6.245928,48.967073,0.93,housenumber,77 Rue Principale 57420 Vigny,57715_0055_00077,G,77 RUE PRINCIPALE,
418113015,00014,41811301500014,O,1998-03-10,NN,,,2008-01-05T20:34:18,true,3,,18,,RUE,PRINCIPALE,57420,VIGNY,,,57715,,,,,,,,,,,,,,,,,,,2008-01-01,A,,,,,68.20B,NAFRev2,N,6.251813,48.968868,0.93,housenumber,18 Rue Principale 57420 Vigny,57715_0055_00018,G,18 RUE PRINCIPALE,
418182697,00015,41818269700015,O,1998-02-20,NN,,,2008-01-04T23:16:58,true,4,,64,,RUE,PRINCIPALE,57420,VIGNY,,,57715,,,,,,,,,,,,,,,,,,,2008-01-01,A,,,,,87.30A,NAFRev2,N,6.246799,48.967142,0.93,housenumber,64 Rue Principale 57420 Vigny,57715_0055_00064,G,64 RUE PRINCIPALE,
418555694,00011,41855569400011,O,1998-04-23,NN,,,2006-11-25T15:58:43,false,3,,52,,RUE,PRINCIPALE,57420,VIGNY,,,57715,,,,,,,,,,,,,,,,,,,2006-04-12,F,,,,,50.1Z,NAFRev1,N,6.247912,48.967759,0.93,housenumber,52 Rue Principale 57420 Vigny,57715_0055_00052,G,52 RUE PRINCIPALE,
419733001,00012,41973300100012,O,1998-07-15,NN,,,2008-01-04T23:41:24,true,3,MR MONTEREAU RONNY,18,,RUE,PRINCIPALE,57420,VIGNY,,,57715,,,,,,,,,,,,,,,,,,,2008-01-01,A,,,,,68.20A,NAFRev2,N,6.251813,48.968868,0.93,housenumber,18 Rue Principale 57420 Vigny,57715_0055_00018,G,18 RUE PRINCIPALE,
419776299,00010,41977629900010,O,1998-07-15,NN,,,2008-01-04T23:42:05,true,3,,18,,RUE,PRINCIPALE,57420,VIGNY,,,57715,,,,,,,,,,,,,,,,,,,2008-01-01,A,,,,,68.20A,NAFRev2,N,6.251813,48.968868,0.93,housenumber,18 Rue Principale 57420 Vigny,57715_0055_00018,G,18 RUE PRINCIPALE,
421447582,00014,42144758200014,O,1999-01-11,NN,,,2014-06-13T23:26:59,true,5,,75,,RUE,PRINCIPALE,57420,VIGNY,,,57715,,,,,,,,,,,,,,,,,,,2012-03-28,F,,,,,49.41B,NAFRev2,O,6.246242,48.967186,0.93,housenumber,75 Rue Principale 57420 Vigny,57715_0055_00075,G,75 RUE PRINCIPALE,
429430242,00017,42943024200017,O,2000-01-25,NN,,,2008-01-05T01:39:05,true,3,,64,,RUE,PRINCIPLAE,57420,VIGNY,,,57715,,,,,,,,,,,,,,,,,,,2008-01-01,A,,,,,68.20A,NAFRev2,N,6.246799,48.967142,0.73,housenumber,64 Rue Principale 57420 Vigny,57715_0055_00064,G,64 RUE PRINCIPALE,
430040899,00014,43004089900014,O,2000-02-18,NN,,,2006-11-25T16:52:42,true,4,,52,,RUE,PRINCIPALE,57420,VIGNY,,,57715,,,,,,,,,,,,,,,,,,,2003-06-11,F,,,,,60.2M,NAFRev1,O,6.247912,48.967759,0.93,housenumber,52 Rue Principale 57420 Vigny,57715_0055_00052,G,52 RUE PRINCIPALE,
430459750,00021,43045975000021,O,2019-06-15,,,,2020-07-25T03:42:10,true,1,,6,,RUE,DE CRETU,57420,VIGNY,,,57715,,,,,,,,,,,,,,,,,,,2019-06-15,A,,,,,68.20B,NAFRev2,N,6.252549,48.966817,0.63,housenumber,6 Rue du Gretu 57420 Vigny,57715_0053_00006,G,6 RUE DU GRETU,
431256338,00028,43125633800028,O,2005-04-15,NN,,,2012-04-13T13:41:47,true,4,,53,,RUE,PRINCIPALE,57420,VIGNY,,,57715,,,,,,,,,,,,,,,,,,,2008-12-31,F,,,,,56.10A,NAFRev2,O,6.249277,48.968288,0.93,housenumber,53 Rue Principale 57420 Vigny,57715_0055_00053,G,53 RUE PRINCIPALE,
431917558,00014,43191755800014,O,,,,,,true,1,,18,,RUE,PRINCIPALE,57420,VIGNY,,,57715,,,,,,,,,,,,,,,,,,,2000-03-23,F,,,,,70.1F,NAF1993,N,6.251813,48.968868,0.93,housenumber,18 Rue Principale 57420 Vigny,57715_0055_00018,G,18 RUE PRINCIPALE,
438703340,00028,43870334000028,O,2012-07-06,,,,2017-03-29T15:40:07,false,2,,21,,RUE,DE GOIN,57420,VIGNY,,,57715,,,,,,,,,,,,,,,,,,,2016-08-23,F,,,,,68.20B,NAFRev2,N,6.249982,48.970317,0.93,housenumber,21 Rue de Goin 57420 Vigny,57715_0060_00021,G,21 RUE DE GOIN,
443682497,00013,44368249700013,O,2002-10-10,NN,,,2008-04-26T16:35:06,true,3,,52,,RUE,PRINCIPALE,57420,VIGNY,,,57715,,,,,,,,,,,,,,,,,,,2006-01-11,F,,,,,60.2M,NAFRev1,O,6.247912,48.967759,0.93,housenumber,52 Rue Principale 57420 Vigny,57715_0055_00052,G,52 RUE PRINCIPALE,
444399083,00013,44439908300013,O,2002-11-22,NN,,,2008-11-08T02:20:26,true,4,,7,,RUE,PRINCIPALE,57420,VIGNY,,,57715,,,,,,,,,,,,,,,,,,,2005-09-15,F,,,,,45.2J,NAFRev1,O,6.253651,48.969837,0.93,housenumber,7 Rue Principale 57420 Vigny,57715_0055_00007,G,7 RUE PRINCIPALE,
444532998,00028,44453299800028,O,2003-06-16,,,,2006-11-25T18:14:32,false,3,,52,,RUE,PRINCIPALE,57420,VIGNY,,,57715,,,,,,,,,,,,,,,,,,,2005-08-22,F,,,,,60.2L,NAFRev1,O,6.247912,48.967759,0.93,housenumber,52 Rue Principale 57420 Vigny,57715_0055_00052,G,52 RUE PRINCIPALE,
447647827,00016,44764782700016,O,2003-01-01,NN,,,2012-09-18T05:04:02,true,4,,22,,RUE,PRINCIPALE,57420,VIGNY,,,57715,,,,,,,,,,,,,,,,,,,2009-09-01,F,,,,,01.50Z,NAFRev2,N,6.251368,48.968659,0.93,housenumber,22 Rue Principale 57420 Vigny,57715_0055_00022,G,22 RUE PRINCIPALE,
449459163,00035,44945916300035,O,2003-12-01,,,,2011-02-21T09:39:58,false,4,,52,,RUE,PRINCIPALE,57420,VIGNY,,,57715,,,,,,,,,,,,,,,,,,,2010-12-14,F,,,,,49.41B,NAFRev2,N,6.247912,48.967759,0.93,housenumber,52 Rue Principale 57420 Vigny,57715_0055_00052,G,52 RUE PRINCIPALE,
452010168,00014,45201016800014,O,2003-12-26,NN,,,2008-01-05T21:33:50,true,3,,18,,RUE,PRINCIPALE,57420,VIGNY,,,57715,,,,,,,,,,,,,,,,,,,2008-01-01,A,,,,,68.20B,NAFRev2,N,6.251813,48.968868,0.93,housenumber,18 Rue Principale 57420 Vigny,57715_0055_00018,G,18 RUE PRINCIPALE,
452076102,00014,45207610200014,O,2004-01-12,NN,,,2008-04-26T17:27:05,true,4,SALLE POLYVALENTE,,,RUE,DE GOIN,57420,VIGNY,,,57715,,,,,,,,,,,,,,,,,,,2008-01-01,A,,,,,88.91A,NAFRev2,O,6.248978,48.968515,0.93,street,Rue de Goin 57420 Vigny,57715_0060,G,RUE DE GOIN,
453917122,00013,45391712200013,O,2004-05-15,NN,,,2008-01-05T21:37:52,true,3,,16,,RUE,DE GOIN,57420,VIGNY,,,57715,,,,,,,,,,,,,,,,,,,2008-01-01,A,,,,,68.20B,NAFRev2,N,6.249122,48.969479,0.93,housenumber,16 Rue de Goin 57420 Vigny,57715_0060_00016,G,16 RUE DE GOIN,
477767883,00010,47776788300010,O,2004-07-01,NN,,,2008-01-05T21:39:01,true,3,,48,,RUE,PRINCIPALE,57420,VIGNY,,,57715,,,,,,,,,,,,,,,,,,,2008-01-01,A,,,,,68.20B,NAFRev2,N,6.248489,48.967972,0.93,housenumber,48 Rue Principale 57420 Vigny,57715_0055_00048,G,48 RUE PRINCIPALE,
478390412,00011,47839041200011,O,2004-09-01,NN,,4321AB,2019-03-04T19:33:14,true,7,,11,,RUE,PRINCIPALE,57420,VIGNY,,,57715,,,,,,,,,,,,,,,,,,,2017-12-31,F,,,,,43.21A,NAFRev2,N,6.253417,48.969727,0.93,housenumber,11 Rue Principale 57420 Vigny,57715_0055_00011,G,11 RUE PRINCIPALE,
479951477,00013,47995147700013,O,2004-08-01,NN,,,2006-11-01T01:52:30,true,3,,48,,RUE,PRINCIPALE,57420,VIGNY,,,57715,,,,,,,,,,,,,,,,,,,2005-10-31,F,,,,,85.1G,NAFRev1,N,6.248489,48.967972,0.93,housenumber,48 Rue Principale 57420 Vigny,57715_0055_00048,G,48 RUE PRINCIPALE,
482860020,00015,48286002000015,O,1989-08-04,NN,,,2018-09-29T12:24:50,true,4,,8,,RUE,SECOURT,57420,VIGNY,,,57715,,,,,,,,,,,,,,,,,,,2009-09-10,A,,,,,94.99Z,NAFRev2,O,6.251572,48.968014,0.93,housenumber,8 Rue de Secourt 57420 Vigny,57715_0090_00008,G,8 RUE DE SECOURT,
484217971,00049,48421797100049,O,2019-08-01,,,,2020-06-17T03:53:01,true,2,,17,,RUE,FONTAINE DE MOURCHAMP,57420,VIGNY,,,57715,,,,,,,,,,,,,,,,,,,2020-05-05,F,,,,,46.19B,NAFRev2,N,6.254404,48.966084,0.93,housenumber,17 Rue Fontaine de Mourchamp 57420 Vigny,57715_0051_00017,G,17 RUE FONTAINE DE MOURCHAMP,
497606764,00015,49760676400015,O,2007-04-01,,,,2008-02-07T16:53:55,true,3,,11,,RUE,PRINCIPALE,57420,VIGNY,,,57715,,,,,,,,,,,,,,,,,,,2008-01-09,F,,,,,47.91A,NAFRev2,N,6.253417,48.969727,0.93,housenumber,11 Rue Principale 57420 Vigny,57715_0055_00011,G,11 RUE PRINCIPALE,
500294939,00011,50029493900011,O,2007-10-03,00,2017,,2019-06-24T13:04:49,true,5,,10,,RUE,D ALEMONT,57420,VIGNY,,,57715,,,,,,,,,,,,,,,,,,,2017-08-31,F,,,,,49.41B,NAFRev2,N,6.243843,48.965783,0.93,housenumber,10 Rue d'Alemont 57420 Vigny,57715_0004_00010,G,10 RUE D ALEMONT,
502823347,00013,50282334700013,O,2008-01-25,,,,2013-06-19T19:32:12,true,2,,18,,RUE,PRINCIPALE,57420,VIGNY,,,57715,,,,,,,,,,,,,,,,,,,2009-10-31,F,,,,,68.10Z,NAFRev2,N,6.251813,48.968868,0.93,housenumber,18 Rue Principale 57420 Vigny,57715_0055_00018,G,18 RUE PRINCIPALE,
503207102,00016,50320710200016,O,2008-03-15,NN,,,2017-05-04T02:21:42,true,2,,75,,RUE,PRINCIPALE,57420,VIGNY,,,57715,,,,,,,,,,,,,,,,,,,2008-04-14,A,,,,,49.41A,NAFRev2,O,6.246242,48.967186,0.93,housenumber,75 Rue Principale 57420 Vigny,57715_0055_00075,G,75 RUE PRINCIPALE,
504467317,00013,50446731700013,O,2008-08-01,,,,2013-07-18T08:59:34,true,2,,19,,RUE,DE GOIN,57420,VIGNY,,,57715,,,,,,,,,,,,,,,,,,,2013-07-16,F,,,,,01.11Z,NAFRev2,N,6.250131,48.970123,0.93,housenumber,19 Rue de Goin 57420 Vigny,57715_0060_00019,G,19 RUE DE GOIN,
509353538,00010,50935353800010,O,2007-01-01,,,,2008-12-09T08:55:58,true,1,,10,,RUE,D'ALEMONT,57420,VIGNY,,,57715,,,,,,,,,,,,,,,,,,,2007-01-01,A,,,,,47.99A,NAFRev2,N,6.243843,48.965783,0.93,housenumber,10 Rue d'Alemont 57420 Vigny,57715_0004_00010,G,10 RUE D ALEMONT,
510062516,00016,51006251600016,O,2009-01-02,NN,,,2012-05-05T14:38:16,true,2,,53,,RUE,PRINCIPALE,57420,VIGNY,,,57715,,,,,,,,,,,,,,,,,,,2011-03-31,F,LE VOYAGEUR,,,,56.10A,NAFRev2,O,6.249277,48.968288,0.93,housenumber,53 Rue Principale 57420 Vigny,57715_0055_00053,G,53 RUE PRINCIPALE,
512905233,00023,51290523300023,O,2013-10-01,,,,2015-05-22T19:31:30,true,2,,42,,RUE,PRINCIPALE,57420,VIGNY,,,57715,,,,,,,,,,,,,,,,,,,2015-03-19,F,,,,,62.02B,NAFRev2,N,6.248943,48.968102,0.93,housenumber,42 Rue Principale 57420 Vigny,57715_0055_00042,G,42 RUE PRINCIPALE,
515218881,00016,51521888100016,O,2009-10-15,,,,2013-01-29T08:36:28,true,2,,16,,RUE,DE SECOURT,57420,VIGNY,,,57715,,,,,,,,,,,,,,,,,,,2013-01-01,F,,,,,95.11Z,NAFRev2,N,6.252093,48.966939,0.93,housenumber,16 Rue de Secourt 57420 Vigny,57715_0090_00016,G,16 RUE DE SECOURT,
517390092,00016,51739009200016,O,2009-08-10,,,,2009-10-12T15:15:27,true,1,,75,,RUE,PRINCIPALE,57420,VIGNY,,,57715,,,,,,,,,,,,,,,,,,,2009-08-10,A,,,,,68.20B,NAFRev2,N,6.246242,48.967186,0.93,housenumber,75 Rue Principale 57420 Vigny,57715_0055_00075,G,75 RUE PRINCIPALE,
520285669,00013,52028566900013,O,2010-03-01,,,,2012-11-10T01:47:49,true,1,,58,,RUE,PRINCIPALE,57420,VIGNY,,,57715,,,,,,,,,,,,,,,,,,,2010-03-01,A,,,,,43.34Z,NAFRev2,N,6.247353,48.967509,0.93,housenumber,58 Rue Principale 57420 Vigny,57715_0055_00058,G,58 RUE PRINCIPALE,
520849704,00017,52084970400017,O,2010-02-01,,,,2012-11-10T01:53:20,true,1,,11,,RUE,PRINCIPALE,57420,VIGNY,,,57715,,,,,,,,,,,,,,,,,,,2010-02-01,A,,,,,43.32A,NAFRev2,N,6.253417,48.969727,0.93,housenumber,11 Rue Principale 57420 Vigny,57715_0055_00011,G,11 RUE PRINCIPALE,
522183052,00029,52218305200029,O,2020-01-06,,,,2020-01-31T17:01:44,false,1,,52,,RUE,PRINCIPALE,57420,VIGNY,,,57715,,,,,,,,,,,,,,,,,,,2020-01-06,A,,,,,49.41B,NAFRev2,N,6.247912,48.967759,0.93,housenumber,52 Rue Principale 57420 Vigny,57715_0055_00052,G,52 RUE PRINCIPALE,
532048543,00039,53204854300039,O,2019-03-28,,,,2019-04-04T19:38:19,true,1,,2,,RUE,PRINCIPALE,57420,VIGNY,,,57715,,,,,,,,,,,,,,,,,,,2019-03-28,A,CABINET VETERINAIRE EQUIN DE VIGNY,,,,75.00Z,NAFRev2,N,6.255597,48.970675,0.93,housenumber,2 Rue Principale 57420 Vigny,57715_0055_00002,G,2 RUE PRINCIPALE,
532544608,00013,53254460800013,O,2011-05-02,,,,2017-01-04T10:44:36,true,1,,50,,RUE,PRINCIPALE,57420,VIGNY,,,57715,,,,,,,,,,,,,,,,,,,2011-05-02,A,,,,,68.20B,NAFRev2,N,6.248406,48.967944,0.93,housenumber,50 Rue Principale 57420 Vigny,57715_0055_00050,G,50 RUE PRINCIPALE,
532812740,00019,53281274000019,O,2011-06-06,11,2018,,2020-08-25T10:45:36,true,2,,52,,RUE,PRINCIPALE,57420,VIGNY,,,57715,,,,,,,,,,,,,,,,,,,2016-12-31,A,TRANSPORTS GREGORY BITTE,,,TRANSPORTS GREGORY BITTE,49.41A,NAFRev2,O,6.247912,48.967759,0.93,housenumber,52 Rue Principale 57420 Vigny,57715_0055_00052,G,52 RUE PRINCIPALE,