siren,nic,siret,statutDiffusionEtablissement,dateCreationEtablissement,trancheEffectifsEtablissement,anneeEffectifsEtablissement,activitePrincipaleRegistreMetiersEtablissement,dateDernierTraitementEtablissement,etablissementSiege,nombrePeriodesEtablissement,complementAdresseEtablissement,numeroVoieEtablissement,indiceRepetitionEtablissement,typeVoieEtablissement,libelleVoieEtablissement,codePostalEtablissement,libelleCommuneEtablissement,libelleCommuneEtrangerEtablissement,distributionSpecialeEtablissement,codeCommuneEtablissement,codeCedexEtablissement,libelleCedexEtablissement,codePaysEtrangerEtablissement,libellePaysEtrangerEtablissement,complementAdresse2Etablissement,numeroVoie2Etablissement,indiceRepetition2Etablissement,typeVoie2Etablissement,libelleVoie2Etablissement,codePostal2Etablissement,libelleCommune2Etablissement,libelleCommuneEtranger2Etablissement,distributionSpeciale2Etablissement,codeCommune2Etablissement,codeCedex2Etablissement,libelleCedex2Etablissement,codePaysEtranger2Etablissement,libellePaysEtranger2Etablissement,dateDebut,etatAdministratifEtablissement,enseigne1Etablissement,enseigne2Etablissement,enseigne3Etablissement,denominationUsuelleEtablissement,activitePrincipaleEtablissement,nomenclatureActivitePrincipaleEtablissement,caractereEmployeurEtablissement,longitude,latitude,geo_score,geo_type,geo_adresse,geo_id,geo_ligne,geo_l4,geo_l5
215903667,00016,21590366700016,O,1983-03-01,02,2018,,2020-08-25T10:18:03,true,4,,66,,,CONTOUR DE L EGLISE,59173,LYNDE,,,59366,,,,,,,,,,,,,,,,,,,2008-01-01,A,MAIRIE,,,,84.11Z,NAFRev2,O,2.41929,50.713183,0.94,housenumber,66 Contour de l'Eglise 59173 Lynde,59366_0005_00066,G,66 CONTOUR DE L EGLISE,
215903667,00024,21590366700024,O,1983-12-21,02,2018,,2020-08-25T10:18:03,false,3,,101,,,CONTOUR DE L EGLISE,59173,LYNDE,,,59366,,,,,,,,,,,,,,,,,,,2008-01-01,A,ECOLE PRIMAIRE PUBLIQUE,,,,85.20Z,NAFRev2,N,2.419347,50.712714,0.94,street,Contour de l'Eglise 59173 Lynde,59366_0005,G,CONTOUR DE L EGLISE,
265903666,00013,26590366600013,O,1983-03-01,NN,,,2017-08-06T14:14:23,true,5,MAIRIE,66,,,CONTOUR DE L EGLISE,59173,LYNDE,,,59366,,,,,,,,,,,,,,,,,,,2017-08-01,F,CENTRE COMMUNAL D'ACTION SOCIALE,,,,88.99B,NAFRev2,N,2.41929,50.713183,0.94,housenumber,66 Contour de l'Eglise 59173 Lynde,59366_0005_00066,G,66 CONTOUR DE L EGLISE,
295900344,00017,29590034400017,O,1984-01-09,NN,,,2017-09-04T10:13:48,true,4,MAIRIE,101,,,CONTOUR DE L EGLISE,59173,LYNDE,,,59366,,,,,,,,,,,,,,,,,,,2008-01-01,F,,,,,42.99Z,NAFRev2,N,2.419347,50.712714,0.94,street,Contour de l'Eglise 59173 Lynde,59366_0005,G,CONTOUR DE L EGLISE,
302195102,00017,30219510200017,O,1975-01-01,NN,,,2015-02-12T15:48:55,true,5,,,,RTE,DE SAINT OMER,59173,LYNDE,,,59366,,,,,,,,,,,,,,,,,,,2011-01-01,A,,,,,01.61Z,NAFRev2,O,2.426733,50.701584,0.84,street,Route de Saint-omer 59173 Lynde,59366_0048,G,ROUTE DE SAINT OMER,
302901970,00012,30290197000012,O,,NN,,,2006-11-25T09:15:17,true,1,,,,RTE,NATIONALE,59173,LYNDE,,,59366,,,,,,,,,,,,,,,,,,,1990-03-31,F,,,,,69.12,NAP,N,2.441042,50.731131,0.81,street,Route Nationale 59173 Lynde,59366_0015,G,ROUTE NATIONALE,
305499915,00026,30549991500026,O,,,,,,true,1,,,,CHE,DES PROCESSIONS,59173,LYNDE,,,59366,,,,,,,,,,,,,,,,,,,1984-12-25,F,,,,,01.57,NAP,N,2.419157,50.71344,0.8,street,Rue des Processions 59173 Lynde,59366_0050,G,RUE DES PROCESSIONS,
309241982,00029,30924198200029,O,1984-02-01,NN,,,2014-11-19T03:48:58,true,9,LYNDE,865,,RUE,DU ROMARIN,59173,LYNDE,,,59366,,,,,,,,,,,,,,,,,,,2014-11-16,F,,,,,70.22Z,NAFRev2,N,2.411911,50.7068,0.94,housenumber,865 Rue du Romarin 59173 Lynde,59366_0055_00865,G,865 RUE DU ROMARIN,
309939270,00026,30993927000026,O,,NN,,,,true,1,,,,,CAMPING LA BECQUERELLE,59173,LYNDE,,,59366,,,,,,,,,,,,,,,,,,,,F,,,,,67.13,NAP,N,2.41918,50.712649,0.4,street,Rue du Becquerel 59173 Lynde,59366_0020,G,RUE DU BECQUEREL,
311375729,00010,31137572900010,O,,,,,,true,1,,,,CHE,COMMUNAL NO 5,59173,LYNDE,,,59366,,,,,,,,,,,,,,,,,,,1984-12-25,F,,,,,00.10,NAP,N,,,0,,,,,,
311844245,00010,31184424500010,O,,,,,,true,1,,,,CHE,COMMUNAL N 5,59173,LYNDE,,,59366,,,,,,,,,,,,,,,,,,,1985-12-25,F,,,,,67.13,NAP,N,,,0,,,,,,
312021835,00011,31202183500011,O,1978-01-01,NN,,,2008-01-04T20:11:24,true,3,,,,,,59173,LYNDE,,,59366,,,,,,,,,,,,,,,,,,,2008-01-01,A,,,,,94.91Z,NAFRev2,N,,,0,,,,,,
312244049,00010,31224404900010,O,,NN,,,,true,1,,,,,LA PLACE,59173,LYNDE,,,59366,,,,,,,,,,,,,,,,,,,,F,,,,,55.71,NAP,N,2.401305,50.708405,0.31,street,Rue de la Chapelle 59173 Lynde,59366_0035,G,RUE DE LA CHAPELLE,
318260205,00030,31826020500030,O,1998-01-01,NN,,2562BZ,2015-03-17T00:14:41,true,4,,1014,,RUE,DE VERDUN,59173,LYNDE,,,59366,,,,,,,,,,,,,,,,,,,2008-01-01,A,,,,,33.12Z,NAFRev2,N,2.431739,50.71638,0.94,housenumber,1014 Rue de Verdun 59173 Lynde,59366_0065_01014,G,1014 RUE DE VERDUN,
319592929,00016,31959292900016,O,1980-08-01,NN,,,,true,1,,,,CHE,DU BECQUEREL,59173,LYNDE,,,59366,,,,,,,,,,,,,,,,,,,2000-03-31,F,,,,,01.1A,NAF1993,N,2.41918,50.712649,0.77,street,Rue du Becquerel 59173 Lynde,59366_0020,G,RUE DU BECQUEREL,
319988259,00010,31998825900010,O,1980-10-01,NN,,,2011-10-13T10:29:53,true,4,,,,,,59173,LYNDE,,,59366,,,,,,,,,,,,,,,,,,,2011-09-07,F,,,,,01.11Z,NAFRev2,N,,,0,,,,,,
321769648,00023,32176964800023,O,,NN,,,,true,1,,,,CHE,DE MORBECQUE STEEN VELD,59173,LYNDE,,,59366,,,,,,,,,,,,,,,,,,,,F,,,,,82.05,NAP,N,,,0,,,,,,
322114075,00011,32211407500011,O,1981-06-25,NN,,,2007-01-18T09:15:50,true,3,,,,,LE BOUSBERG,59173,LYNDE,,,59366,,,,,,,,,,,,,,,,,,,1998-12-25,F,,,,,01.1A,NAF1993,N,,,0,,,,,,
322910506,00011,32291050600011,O,2004-04-01,NN,,,2008-01-04T18:40:23,true,3,,2038,,RTE,NATIONALE,59173,LYNDE,,,59366,,,,,,,,,,,,,,,,,,,2008-01-01,A,,,,,66.22Z,NAFRev2,N,2.469119,50.729808,0.84,housenumber,2038 Route Nationale 59173 Lynde,59366_0015_02038,G,2038 ROUTE NATIONALE,
322994930,00012,32299493000012,O,,NN,,,,true,1,,,,AV,DE VERDUN,59173,LYNDE,,,59366,,,,,,,,,,,,,,,,,,,,F,,,,,51.1G,NAFRev1,N,2.419891,50.712704,0.72,street,Rue de Verdun 59173 Lynde,59366_0065,G,RUE DE VERDUN,
324044791,00022,32404479100022,O,1984-04-16,NN,,,2008-11-07T00:40:53,true,4,,,,RTE,NATIONALE,59173,LYNDE,,,59366,,,,,,,,,,,,,,,,,,,2004-05-31,F,,,,,45.3A,NAFRev1,O,2.441042,50.731131,0.81,street,Route Nationale 59173 Lynde,59366_0015,G,ROUTE NATIONALE,
327138319,00022,32713831900022,O,,,,,,true,1,,,,RTE,DE WALLON CAPPEL,59173,LYNDE,,,59366,,,,,,,,,,,,,,,,,,,1990-10-30,F,,,,,55.60,NAP,N,2.474121,50.726308,0.78,poi.townhall,Mairie de Wallon-Cappel (Hôtel de ville) Wallon-Cappel,https://osm.org/way/108957856,G,,
327465894,00019,32746589400019,O,1983-02-01,NN,,,2008-08-14T03:59:22,true,5,,309,,RUE,DE VERDUN,59173,LYNDE,,,59366,,,,,,,,,,,,,,,,,,,2008-01-01,F,,,,,68.20B,NAFRev2,N,2.423977,50.71301,0.94,housenumber,309 Rue de Verdun 59173 Lynde,59366_0065_00309,G,309 RUE DE VERDUN,
328085832,00025,32808583200025,O,1900-01-01,NN,,,2011-04-28T00:23:47,false,4,,,,RTE,NATIONALE,59173,LYNDE,,,59366,,,,,,,,,,,,,,,,,,,1994-12-25,F,,,,,92.3H,NAF1993,N,2.441042,50.731131,0.81,street,Route Nationale 59173 Lynde,59366_0015,G,ROUTE NATIONALE,
328264387,00015,32826438700015,O,1983-10-01,NN,,,2008-04-05T00:29:02,true,3,,,,LD,LE VILLAGE,59173,LYNDE,,,59366,,,,,,,,,,,,,,,,,,,2008-01-01,A,,,,,68.20B,NAFRev2,N,2.42163,50.710309,0.92,street,Derriere le Village 59173 Lynde,59366_b014,G,DERRIERE LE VILLAGE,
329046411,00016,32904641100016,O,,NN,,,,true,1,,,,LD,SANGHE STRAETE,59173,LYNDE,,,59366,,,,,,,,,,,,,,,,,,,,F,,,,,79.03,NAP,N,,,0,,,,,,
329176986,00019,32917698600019,O,,NN,,,,true,1,,,,LD,SANGHE STRAETE,59173,LYNDE,,,59366,,,,,,,,,,,,,,,,,,,,F,,,,,67.06,NAP,N,,,0,,,,,,
329586978,00010,32958697800010,O,,NN,,,,true,1,,,,LD,LE VILLAGE,59173,LYNDE,,,59366,,,,,,,,,,,,,,,,,,,1990-06-30,F,,,,,87.07,NAP,N,2.42163,50.710309,0.92,street,Derriere le Village 59173 Lynde,59366_b014,G,DERRIERE LE VILLAGE,
332154467,00010,33215446700010,O,,NN,,,,true,1,,,,RUE,DE VERDUN,59173,LYNDE,,,59366,,,,,,,,,,,,,,,,,,,1994-06-30,F,,,,,52.6E,NAF1993,N,2.419891,50.712704,0.94,street,Rue de Verdun 59173 Lynde,59366_0065,G,RUE DE VERDUN,
332560788,00025,33256078800025,O,1991-09-30,NN,,4391BZ,2015-03-17T00:21:34,true,4,,394,,RTE,DE BLARINGHEM,59173,LYNDE,,,59366,,,,,,,,,,,,,,,,,,,2008-01-01,A,,,,,43.99A,NAFRev2,O,2.418784,50.705874,0.86,housenumber,394 Route de Blaringhem 59173 Lynde,59366_0025_00394,G,394 ROUTE DE BLARINGHEM,
334187960,00011,33418796000011,O,,NN,,,,true,1,,,,RTE,DE SAINT OMER,59173,LYNDE,,,59366,,,,,,,,,,,,,,,,,,,1987-10-06,F,,,,,01.07,NAP,N,2.426733,50.701584,0.84,street,Route de Saint-omer 59173 Lynde,59366_0048,G,ROUTE DE SAINT OMER,
334347614,00011,33434761400011,O,1975-04-01,NN,,,2006-10-27T02:37:31,true,3,,,,RTE,DE MORBECQUE,59173,LYNDE,,,59366,,,,,,,,,,,,,,,,,,,2006-02-28,F,,,,,01.3Z,NAFRev1,N,2.40918,50.718732,0.78,street,Rue de Morbecque 59173 Lynde,59366_0047,G,RUE DE MORBECQUE,
339451635,00017,33945163500017,O,,NN,,,,true,1,,,,,VOIE COMMUNALE 5,59173,LYNDE,,,59366,,,,,,,,,,,,,,,,,,,1987-03-31,F,,,,,67.13,NAP,N,-3.8299976,47.8979215,0.9,poi,Voie Communale 5 (Pont) Melgven,https://osm.org/way/98662971,G,,
339708174,00034,33970817400034,O,1995-11-15,NN,,,2017-07-02T14:57:55,true,5,,10,,RUE,DE VERDUN,59173,LYNDE,,,59366,,,,,,,,,,,,,,,,,,,2008-01-01,A,LA COURONNE,,,,56.30Z,NAFRev2,N,2.419709,50.712556,0.94,housenumber,10 Rue de Verdun 59173 Lynde,59366_0065_00010,G,10 RUE DE VERDUN,
342050218,00011,34205021800011,O,,NN,,,,true,1,,,,RTE,STEENBECQUES,59173,LYNDE,,,59366,,,,,,,,,,,,,,,,,,,1989-12-31,F,,,,,84.10,NAP,N,2.41987,50.712217,0.67,street,Rue de Steenbecque 59173 Lynde,59366_0060,G,RUE DE STEENBECQUE,
343164166,00013,34316416600013,O,,,,,,true,1,,,,,LA PLACE,59173,LYNDE,,,59366,,,,,,,,,,,,,,,,,,,1996-12-31,F,,,,,01.1A,NAF1993,N,2.401305,50.708405,0.31,street,Rue de la Chapelle 59173 Lynde,59366_0035,G,RUE DE LA CHAPELLE,
343164174,00017,34316417400017,O,1968-07-01,NN,,,,true,1,,192,,RUE,DE STEENBECQUE,59173,LYNDE,,,59366,,,,,,,,,,,,,,,,,,,1998-05-25,F,,,,,01.2E,NAF1993,N,2.420011,50.71095,0.94,housenumber,192 Rue de Steenbecque 59173 Lynde,59366_0060_00192,G,192 RUE DE STEENBECQUE,
343164208,00013,34316420800013,O,,NN,,,,true,1,,,,RUE,MORTE,59173,LYNDE,,,59366,,,,,,,,,,,,,,,,,,,1991-08-01,F,,,,,01.1A,NAF1993,N,2.40918,50.718732,0.65,street,Rue de Morbecque 59173 Lynde,59366_0047,G,RUE DE MORBECQUE,
343164232,00013,34316423200013,O,,NN,,,,true,1,,,,RUE,MORTE,59173,LYNDE,,,59366,,,,,,,,,,,,,,,,,,,1991-08-01,F,,,,,01.1A,NAF1993,N,2.40918,50.718732,0.65,street,Rue de Morbecque 59173 Lynde,59366_0047,G,RUE DE MORBECQUE,
343164257,00010,34316425700010,O,1982-01-01,NN,,,2008-01-04T22:12:14,true,3,,459,,RUE,MURES,59173,LYNDE,,,59366,,,,,,,,,,,,,,,,,,,2008-01-01,A,,,,,01.11Z,NAFRev2,N,2.435243,50.707004,0.87,housenumber,459 Rue des Mures 59173 Lynde,59366_0013_00459,G,459 RUE DES MURES,
343164307,00013,34316430700013,O,1972-01-01,NN,,,,true,1,,,,RTE,DE BOURBOURG,59173,LYNDE,,,59366,,,,,,,,,,,,,,,,,,,2000-01-01,F,,,,,01.1A,NAF1993,N,2.468756,50.726694,0.76,street,Rue de Bourbourg 59173 Lynde,59366_0028,G,RUE DE BOURBOURG,
343164315,00016,34316431500016,O,1983-01-01,NN,,,2007-03-04T04:03:43,true,3,,,,,LE BOUSBERG,59173,LYNDE,,,59366,,,,,,,,,,,,,,,,,,,2006-12-31,F,,,,,01.1A,NAFRev1,N,,,0,,,,,,
343164323,00010,34316432300010,O,1969-02-01,NN,,,2008-01-04T22:12:14,true,3,,,,RUE,DU BECQUEREL,59173,LYNDE,,,59366,,,,,,,,,,,,,,,,,,,2008-01-01,A,,,,,01.11Z,NAFRev2,N,2.41918,50.712649,0.94,street,Rue du Becquerel 59173 Lynde,59366_0020,G,RUE DU BECQUEREL,
343438933,00016,34343893300016,O,1979-03-01,NN,,,2008-01-04T22:15:32,true,3,,,,RTE,NATIONALE,59173,LYNDE,,,59366,,,,,,,,,,,,,,,,,,,2008-01-01,A,,,,,66.22Z,NAFRev2,N,2.441042,50.731131,0.81,street,Route Nationale 59173 Lynde,59366_0015,G,ROUTE NATIONALE,
343581328,00030,34358132800030,O,1997-02-01,,,,,true,1,,51,,RUE,DES PROCESSIONS,59173,LYNDE,,,59366,,,,,,,,,,,,,,,,,,,1998-03-30,F,,,,,26.5E,NAF1993,N,2.41874,50.713788,0.94,housenumber,51 Rue des Processions 59173 Lynde,59366_0050_00051,G,51 RUE DES PROCESSIONS,
345026744,00036,34502674400036,O,1991-04-01,NN,,,,true,4,,,,,LE BOIS DU MOULIN,59173,LYNDE,,,59366,,,,,,,,,,,,,,,,,,,1997-05-14,F,,,,,28.1C,NAF1993,O,2.42115,50.712548,0.54,street,Rue du Moulin 59173 Lynde,59366_mq8z0w,G,RUE DU MOULIN,
345327423,00017,34532742300017,O,,NN,,,,true,1,,,,RTE,NATIONALE,59173,LYNDE,,,59366,,,,,,,,,,,,,,,,,,,1993-12-31,F,,,,,60.2L,NAF1993,N,2.441042,50.731131,0.81,street,Route Nationale 59173 Lynde,59366_0015,G,ROUTE NATIONALE,
348200270,00018,34820027000018,O,1988-01-01,NN,,,2006-11-25T10:57:11,true,3,,,,RTE,NATIONALE,59173,LYNDE,,,59366,,,,,,,,,,,,,,,,,,,2003-06-30,F,,,,,74.1J,NAFRev1,N,2.441042,50.731131,0.81,street,Route Nationale 59173 Lynde,59366_0015,G,ROUTE NATIONALE,
348613506,00016,34861350600016,O,1988-09-30,NN,,,2019-12-11T03:41:47,true,5,,,,RUE,DE BLARINGHEM,59173,LYNDE,,,59366,,,,,,,,,,,,,,,,,,,2019-12-31,F,,,,,01.50Z,NAFRev2,N,2.420369,50.707145,0.79,street,Route de Blaringhem 59173 Lynde,59366_0025,G,ROUTE DE BLARINGHEM,
350883559,00030,35088355900030,O,2010-02-15,NN,,4399CZ,2017-05-04T01:10:11,true,3,,1396,,RUE,DU BECQUEREL,59173,LYNDE,,,59366,,,,,,,,,,,,,,,,,,,2015-06-15,F,,,,,41.20B,NAFRev2,O,2.400623,50.710131,0.94,housenumber,1396 Rue du Becquerel 59173 Lynde,59366_0020_01396,G,1396 RUE DU BECQUEREL,
353893845,00035,35389384500035,O,1991-01-01,NN,,,,false,3,,72,,RUE,DU BECQUEREL,59173,LYNDE,,,59366,,,,,,,,,,,,,,,,,,,1992-01-01,F,,,,,85.1G,NAF1993,N,2.41918,50.712649,0.82,street,Rue du Becquerel 59173 Lynde,59366_0020,G,RUE DU BECQUEREL,
377650296,00017,37765029600017,O,1990-04-11,NN,,,2014-07-08T00:59:59,true,5,,1997,,RTE,NATIONALE,59173,LYNDE,,,59366,,,,,,,,,,,,,,,,,,,2012-09-30,F,,,,,43.91B,NAFRev2,O,2.468566,50.729958,0.84,housenumber,1997 Route Nationale 59173 Lynde,59366_0015_01997,G,1997 ROUTE NATIONALE,
378148621,00022,37814862100022,O,1992-09-01,NN,,,2007-05-19T10:45:17,false,4,,1432,,RTE,DE MORBECQUE,59173,LYNDE,,,59366,,,,,,,,,,,,,,,,,,,2005-05-11,F,,,,,60.2M,NAFRev1,O,2.42738,50.71552,0.82,housenumber,1432 Rue de Morbecque 59173 Lynde,59366_0047_01432,G,1432 RUE DE MORBECQUE,
378641658,00018,37864165800018,O,,NN,,,,true,1,,,,LD,SANGHE STRAETE,59173,LYNDE,,,59366,,,,,,,,,,,,,,,,,,,1991-07-01,F,,,,,67.04,NAP,N,,,0,,,,,,
381103050,00013,38110305000013,O,1991-02-01,NN,,,2008-01-05T19:51:44,true,3,,,,RUE,DE VERDUN,59173,LYNDE,,,59366,,,,,,,,,,,,,,,,,,,2008-01-01,A,,,,,68.20B,NAFRev2,N,2.419891,50.712704,0.94,street,Rue de Verdun 59173 Lynde,59366_0065,G,RUE DE VERDUN,
381715689,00018,38171568900018,O,1991-01-01,NN,,,2007-01-18T09:29:39,true,3,,,,,LA PLACE,59173,LYNDE,,,59366,,,,,,,,,,,,,,,,,,,1998-12-25,F,,,,,01.1A,NAF1993,N,2.401305,50.708405,0.31,street,Rue de la Chapelle 59173 Lynde,59366_0035,G,RUE DE LA CHAPELLE,
382662062,00019,38266206200019,O,1991-04-01,NN,,,2014-06-14T00:39:10,false,4,,204,,RUE,DE LA CHAPELLE VERMEILLE,59173,LYNDE,,,59366,,,,,,,,,,,,,,,,,,,2013-01-01,F,,,,,01.47Z,NAFRev2,N,2.401305,50.708405,0.73,housenumber,204 Rue de la Chapelle 59173 Lynde,59366_0035_00204,G,204 RUE DE LA CHAPELLE,
384333993,00044,38433399300044,O,2004-03-01,,,,2008-12-01T13:34:37,false,3,,1184,,RTE,NATIONALE,59173,LYNDE,,,59366,,,,,,,,,,,,,,,,,,,2008-08-31,F,,,,,01.47Z,NAFRev2,N,2.457118,50.730374,0.84,housenumber,1184 Route Nationale 59173 Lynde,59366_0015_01184,G,1184 ROUTE NATIONALE,
384372306,00017,38437230600017,O,1992-01-01,NN,,,2017-05-04T02:49:22,true,3,,,,RUE,DE VERDUN,59173,LYNDE,,,59366,,,,,,,,,,,,,,,,,,,2008-01-01,A,,,,,01.11Z,NAFRev2,N,2.419891,50.712704,0.94,street,Rue de Verdun 59173 Lynde,59366_0065,G,RUE DE VERDUN,
385110234,01575,38511023401575,O,2002-06-18,02,2018,,2020-08-25T10:22:15,false,3,LE COEVOET/WALLON CAPPEL,423,,RTE,DE CASSEL,59173,LYNDE,,,59366,,,,,,,,,,,,,,,,,,,2008-01-01,A,,,,,46.21Z,NAFRev2,O,2.470526,50.733643,0.79,housenumber,423 Rue de Cassel 59173 Lynde,59366_0030_00423,G,423 RUE DE CASSEL,
385145222,00019,38514522200019,O,1992-04-08,NN,,,2011-11-21T17:10:58,true,4,,24,,RTE,DE MORBECQUE,59173,LYNDE,,,59366,,,,,,,,,,,,,,,,,,,2010-12-25,F,,,,,55.20Z,NAFRev2,N,2.40918,50.718732,0.68,street,Rue de Morbecque 59173 Lynde,59366_0047,G,RUE DE MORBECQUE,
387699929,00015,38769992900015,O,1991-12-31,NN,,,2007-01-18T09:30:58,true,3,,222,,RTE,DE BLARINGHEM,59173,LYNDE,,,59366,,,,,,,,,,,,,,,,,,,1998-12-25,F,,,,,01.3Z,NAF1993,N,2.420369,50.707145,0.86,housenumber,222 Route de Blaringhem 59173 Lynde,59366_0025_00222,G,222 ROUTE DE BLARINGHEM,
389852377,00016,38985237700016,O,1974-04-01,NN,,,2008-03-06T08:41:12,true,4,,,,RTE,DE MORBECQUE,59173,LYNDE,,,59366,,,,,,,,,,,,,,,,,,,2008-03-31,F,,,,,01.41Z,NAFRev2,N,2.40918,50.718732,0.78,street,Rue de Morbecque 59173 Lynde,59366_0047,G,RUE DE MORBECQUE,
390834034,00014,39083403400014,O,1993-04-19,NN,,,,true,1,,694,,RTE,NATIONALE 42,59173,LYNDE,,,59366,,,,,,,,,,,,,,,,,,,1998-09-30,F,,,,,01.3Z,NAF1993,N,2.450644,50.730334,0.72,housenumber,694 Route Nationale 59173 Lynde,59366_0015_00694,G,694 ROUTE NATIONALE,
390991792,00016,39099179200016,O,1993-04-23,NN,,,2008-01-04T23:47:10,true,3,,,,RUE,DE VERDUN,59173,LYNDE,,,59366,,,,,,,,,,,,,,,,,,,2008-01-01,A,,,,,01.11Z,NAFRev2,N,2.419891,50.712704,0.94,street,Rue de Verdun 59173 Lynde,59366_0065,G,RUE DE VERDUN,
391487618,00012,39148761800012,O,1993-06-01,NN,,,,true,3,,192,,RUE,DE STEENBECQUE,59173,LYNDE,,,59366,,,,,,,,,,,,,,,,,,,1998-12-25,F,,,,,70.2B,NAF1993,N,2.420011,50.71095,0.94,housenumber,192 Rue de Steenbecque 59173 Lynde,59366_0060_00192,G,192 RUE DE STEENBECQUE,
391642428,00018,39164242800018,O,1992-01-01,NN,,,2014-07-08T01:19:28,true,5,,1330,,RTE,DE ST OMER,59173,LYNDE,,,59366,,,,,,,,,,,,,,,,,,,2012-03-31,F,,,,,43.32A,NAFRev2,O,2.409453,50.704207,0.76,housenumber,1330 Route de Saint-omer 59173 Lynde,59366_0048_01330,G,1330 ROUTE DE SAINT OMER,
391677580,00014,39167758000014,O,,NN,,,,true,1,,192,,RUE,DE STEENBECQUE,59173,LYNDE,,,59366,,,,,,,,,,,,,,,,,,,1995-12-31,F,,,,,01.4A,NAF1993,N,2.420011,50.71095,0.94,housenumber,192 Rue de Steenbecque 59173 Lynde,59366_0060_00192,G,192 RUE DE STEENBECQUE,
393884051,00011,39388405100011,O,1994-01-01,NN,,,2008-01-05T00:21:19,true,3,,1465,,RUE,DE MORBECQUE,59173,LYNDE,,,59366,,,,,,,,,,,,,,,,,,,2008-01-01,A,,,,,74.30Z,NAFRev2,N,2.427666,50.71547,0.94,housenumber,1465 Rue de Morbecque 59173 Lynde,59366_0047_01465,G,1465 RUE DE MORBECQUE,
399403880,00012,39940388000012,O,,NN,,,,true,1,,,,RUE,DE MORBECQUE,59173,LYNDE,,,59366,,,,,,,,,,,,,,,,,,,1995-10-11,F,,,,,37.2Z,NAF1993,O,2.40918,50.718732,0.94,street,Rue de Morbecque 59173 Lynde,59366_0047,G,RUE DE MORBECQUE,
400365755,00018,40036575500018,O,,,,,,true,1,,250,,RTE,NATIONALE,59173,LYNDE,,,59366,,,,,,,,,,,,,,,,,,,1997-03-24,F,,,,,92.3H,NAF1993,N,2.444289,50.730521,0.84,housenumber,250 Route Nationale 59173 Lynde,59366_0015_00250,G,250 ROUTE NATIONALE,
400888897,00016,40088889700016,O,1994-01-01,NN,,,2008-01-04T19:37:05,true,3,,1600,,RTE,NATIONALE,59173,LYNDE,,,59366,,,,,,,,,,,,,,,,,,,2008-01-01,A,,,,,01.47Z,NAFRev2,N,2.462676,50.730091,0.84,housenumber,1600 Route Nationale 59173 Lynde,59366_0015_01600,G,1600 ROUTE NATIONALE,
400954889,00020,40095488900020,O,2000-10-07,NN,,,2011-05-03T00:21:38,false,4,,1662,,RUE,DE MORBECQUE,59173,LYNDE,,,59366,,,,,,,,,,,,,,,,,,,2001-06-30,F,,,,,92.6C,NAF1993,N,2.431282,50.715049,0.94,housenumber,1662 Rue de Morbecque 59173 Lynde,59366_0047_01662,G,1662 RUE DE MORBECQUE,
400994539,00015,40099453900015,O,1995-04-05,NN,,4399CZ,2017-10-06T03:49:47,true,5,,,,,VOIE ROMAINE,59173,LYNDE,,,59366,,,,,,,,,,,,,,,,,,,2017-09-30,F,,,,,43.99C,NAFRev2,N,2.469745,50.729555,0.94,street,Voie Romaine 59173 Lynde,59366_0066,G,VOIE ROMAINE,
402999346,00016,40299934600016,O,,NN,,,,true,1,,,,RTE,DE BOURBOURG,59173,LYNDE,,,59366,,,,,,,,,,,,,,,,,,,1997-12-31,F,,,,,52.6D,NAF1993,N,2.468756,50.726694,0.76,street,Rue de Bourbourg 59173 Lynde,59366_0028,G,RUE DE BOURBOURG,
403139256,00016,40313925600016,O,,NN,,,,true,1,,309,,RUE,DE VERDUN,59173,LYNDE,,,59366,,,,,,,,,,,,,,,,,,,1996-01-08,F,,,,,45.4J,NAF1993,N,2.423977,50.71301,0.94,housenumber,309 Rue de Verdun 59173 Lynde,59366_0065_00309,G,309 RUE DE VERDUN,
403139348,00011,40313934800011,O,,NN,,,,true,1,,309,,RUE,DE VERDUN,59173,LYNDE,,,59366,,,,,,,,,,,,,,,,,,,1996-01-08,F,,,,,45.4J,NAF1993,N,2.423977,50.71301,0.94,housenumber,309 Rue de Verdun 59173 Lynde,59366_0065_00309,G,309 RUE DE VERDUN,
403244403,00016,40324440300016,O,1995-11-15,NN,,,,true,1,,10,,RUE,DE VERDUN,59173,LYNDE,,,59366,,,,,,,,,,,,,,,,,,,1999-06-30,F,,,,,55.4A,NAF1993,O,2.419709,50.712556,0.94,housenumber,10 Rue de Verdun 59173 Lynde,59366_0065_00010,G,10 RUE DE VERDUN,
403505738,00027,40350573800027,O,2004-03-22,NN,,,2018-09-29T12:30:32,true,3,,1185,,RTE,NATIONALE,59173,LYNDE,,,59366,,,,,,,,,,,,,,,,,,,2008-01-01,A,,,,,01.11Z,NAFRev2,N,2.457143,50.730494,0.84,housenumber,1185 Route Nationale 59173 Lynde,59366_0015_01185,G,1185 ROUTE NATIONALE,
404263675,00013,40426367500013,O,1996-01-01,NN,,,2008-12-10T11:28:48,true,4,,10,,RUE,DE VERDUN,59173,LYNDE,,,59366,,,,,,,,,,,,,,,,,,,2008-01-01,F,,,,,68.20B,NAFRev2,N,2.419709,50.712556,0.94,housenumber,10 Rue de Verdun 59173 Lynde,59366_0065_00010,G,10 RUE DE VERDUN,
404964249,00019,40496424900019,O,1995-11-15,NN,,,2006-11-25T15:10:02,true,1,,10,,RUE,DE VERDUN,59173,LYNDE,,,59366,,,,,,,,,,,,,,,,,,,1999-06-30,F,,,,,74.1J,NAF1993,N,2.419709,50.712556,0.94,housenumber,10 Rue de Verdun 59173 Lynde,59366_0065_00010,G,10 RUE DE VERDUN,
405357609,00016,40535760900016,O,1995-10-06,NN,,,2008-01-04T20:54:10,true,3,,10,,RUE,DE VERDUN,59173,LYNDE,,,59366,,,,,,,,,,,,,,,,,,,2008-01-01,A,,,,,94.99Z,NAFRev2,N,2.419709,50.712556,0.94,housenumber,10 Rue de Verdun 59173 Lynde,59366_0065_00010,G,10 RUE DE VERDUN,
409307378,00011,40930737800011,O,,NN,,,2007-01-28T05:45:37,true,1,,315,R,RUE,CHAPELLE DU BOUSBERG,59173,LYNDE,,,59366,,,,,,,,,,,,,,,,,,,1982-09-30,F,,,,,01.3Z,NAF1993,N,2.446553,50.731727,0.72,street,Rue Chapelle du Bonsberg 59173 Lynde,59366_0036,G,RUE CHAPELLE DU BONSBERG,
409307386,00014,40930738600014,O,1996-01-01,NN,,,2006-10-28T03:40:55,true,3,,173,,RUE,CHAPELLE DU BONSBERG,59173,LYNDE,,,59366,,,,,,,,,,,,,,,,,,,2005-10-31,F,,,,,01.1A,NAFRev1,N,2.446553,50.731727,0.94,housenumber,173 Rue Chapelle du Bonsberg 59173 Lynde,59366_0036_00173,G,173 RUE CHAPELLE DU BONSBERG,
411779481,00018,41177948100018,O,1997-01-01,NN,,,2008-01-04T22:04:07,true,5,,326,,RUE,DE VERDUN,59173,LYNDE,,,59366,,,,,,,,,,,,,,,,,,,2008-01-01,A,,,,,68.20B,NAFRev2,O,2.424341,50.71296,0.94,housenumber,326 Rue de Verdun 59173 Lynde,59366_0065_00326,G,326 RUE DE VERDUN,
411929425,00014,41192942500014,O,1997-04-16,NN,,,2018-09-29T12:36:57,true,4,,1191,,RUE,BECQUEREL,59173,LYNDE,,,59366,,,,,,,,,,,,,,,,,,,2010-01-01,A,,,,,01.41Z,NAFRev2,N,2.403441,50.710479,0.89,housenumber,1191 Rue du Becquerel 59173 Lynde,59366_0020_01191,G,1191 RUE DU BECQUEREL,
411933252,00024,41193325200024,O,1999-04-01,,,4776ZP,2015-03-17T00:50:08,true,1,,287,,RTE,NATIONALE,59173,LYNDE,,,59366,,,,,,,,,,,,,,,,,,,2000-03-23,F,,,,,01.1D,NAF1993,N,2.444615,50.730585,0.84,housenumber,287 Route Nationale 59173 Lynde,59366_0015_00287,G,287 ROUTE NATIONALE,
412154015,00017,41215401500017,O,,,,,,true,1,,192,,RUE,DE STEENBECQUE,59173,LYNDE,,,59366,,,,,,,,,,,,,,,,,,,1996-12-31,F,,,,,01.1A,NAF1993,N,2.420011,50.71095,0.94,housenumber,192 Rue de Steenbecque 59173 Lynde,59366_0060_00192,G,192 RUE DE STEENBECQUE,
412332868,00014,41233286800014,O,1997-01-01,NN,,,2008-01-04T22:14:22,true,3,,,,RUE,DU BECQUEREL,59173,LYNDE,,,59366,,,,,,,,,,,,,,,,,,,2008-01-01,A,,,,,01.11Z,NAFRev2,N,2.41918,50.712649,0.94,street,Rue du Becquerel 59173 Lynde,59366_0020,G,RUE DU BECQUEREL,
412362311,00018,41236231100018,O,1959-05-01,NN,,,2006-10-28T04:03:14,true,3,,,,,,59173,LYNDE,,,59366,,,,,,,,,,,,,,,,,,,2005-12-25,F,,,,,01.1A,NAFRev1,N,,,0,,,,,,
413501313,00014,41350131300014,O,1997-07-28,NN,,,,false,4,MAIRIE DE LYNDE,116,,,CONTOUR DE L EGLISE,59173,LYNDE,,,59366,,,,,,,,,,,,,,,,,,,2001-04-26,F,,,,,91.3E,NAF1993,N,2.418655,50.713239,0.94,housenumber,116 Contour de l'Eglise 59173 Lynde,59366_0005_00116,G,116 CONTOUR DE L EGLISE,