siren,nic,siret,statutDiffusionEtablissement,dateCreationEtablissement,trancheEffectifsEtablissement,anneeEffectifsEtablissement,activitePrincipaleRegistreMetiersEtablissement,dateDernierTraitementEtablissement,etablissementSiege,nombrePeriodesEtablissement,complementAdresseEtablissement,numeroVoieEtablissement,indiceRepetitionEtablissement,typeVoieEtablissement,libelleVoieEtablissement,codePostalEtablissement,libelleCommuneEtablissement,libelleCommuneEtrangerEtablissement,distributionSpecialeEtablissement,codeCommuneEtablissement,codeCedexEtablissement,libelleCedexEtablissement,codePaysEtrangerEtablissement,libellePaysEtrangerEtablissement,complementAdresse2Etablissement,numeroVoie2Etablissement,indiceRepetition2Etablissement,typeVoie2Etablissement,libelleVoie2Etablissement,codePostal2Etablissement,libelleCommune2Etablissement,libelleCommuneEtranger2Etablissement,distributionSpeciale2Etablissement,codeCommune2Etablissement,codeCedex2Etablissement,libelleCedex2Etablissement,codePaysEtranger2Etablissement,libellePaysEtranger2Etablissement,dateDebut,etatAdministratifEtablissement,enseigne1Etablissement,enseigne2Etablissement,enseigne3Etablissement,denominationUsuelleEtablissement,activitePrincipaleEtablissement,nomenclatureActivitePrincipaleEtablissement,caractereEmployeurEtablissement,longitude,latitude,geo_score,geo_type,geo_adresse,geo_id,geo_ligne,geo_l4,geo_l5
035920271,00026,03592027100026,O,1982-01-01,,,,2008-01-04T17:56:00,false,4,,,,CHE,DU VALLON DES VAUX,06610,LA GAUDE,,,06065,,,,,,,,,,,,,,,,,,,2008-01-01,A,,,,,43.33Z,NAFRev2,N,7.154924,43.732909,0.53,street,Chemin du Font de Ribe et Vallons 06610 La Gaude,06065_0274,G,CHEM DU FONT DE RIBE ET VALLONS,
036220549,00020,03622054900020,O,1990-11-20,NN,,,2012-08-07T03:54:00,true,5,,704,,CHE,DU PEYMONT N 78,06610,LA GAUDE,,,06065,,,,,,,,,,,,,,,,,,,2008-01-01,F,,,,,43.12A,NAFRev2,O,7.156197,43.713268,0.68,housenumber,704 Chemin du Peymont 06610 La Gaude,06065_0o7uhr_00704,G,704 CHEMIN DU PEYMONT,
036220549,00038,03622054900038,O,1991-09-01,NN,,,,false,4,,6895,,RTE,DE CAGNES,06610,LA GAUDE,,,06065,,,,,,,,,,,,,,,,,,,2003-08-01,F,AZUR PIERRE ET DECOR,,,,45.1A,NAFRev1,N,7.150141,43.721095,0.62,street,Route de Cagnes 06610 La Gaude,06065_0132,G,ROUTE DE CAGNES,
036220549,00046,03622054900046,O,2003-08-01,NN,,,2012-05-05T00:07:21,false,4,,1241,,AV,MARCEL PAGNOL,06610,LA GAUDE,,,06065,,,,,,,,,,,,,,,,,,,2010-09-30,F,,,,,43.12A,NAFRev2,O,7.164504,43.70834,0.86,housenumber,1241 Avenue Marcel Pagnol 06610 La Gaude,06065_ux55qx_01241,G,1241 AVENUE MARCEL PAGNOL,
036620326,00029,03662032600029,O,1900-01-01,NN,,,,false,4,,,,CHE,DU MONTGROS,06610,LA GAUDE,,,06065,,,,,,,,,,,,,,,,,,,1996-12-31,F,,,,,45.1B,NAF1993,O,7.16524,43.72225,0.72,street,Chemin du Mont Gros 06610 La Gaude,06065_0422,G,CHEMIN DU MONT GROS,
036620326,00037,03662032600037,O,1996-10-15,NN,,,2009-12-30T14:56:39,false,5,LOTISSEMENT LES NERTIERES,,,,LES NERTIERES,06610,LA GAUDE,,,06065,,,,,,,,,,,,,,,,,,,2009-12-18,F,,,,,43.12B,NAFRev2,O,7.150839,43.703491,0.31,street,Les Saints-pauloises 06610 La Gaude,06065_idvfvv,G,LES SAINTS PAULOISES,
036820546,00020,03682054600020,O,1984-01-01,NN,,,2010-04-18T03:01:19,true,5,PLAN DU BOIS,27,,AV,DES LAURIERS,06610,LA GAUDE,,,06065,,,,,,,,,,,,,,,,,,,2008-12-31,A,,,,,46.34Z,NAFRev2,N,7.162294,43.736849,0.85,housenumber,27 Avenue des Lauriers 06610 La Gaude,06065_0366_00027,G,27 AVENUE DES LAURIERS,
037110871,00045,03711087100045,O,1990-01-01,NN,,,2008-01-04T17:56:05,true,4,,8800,,RTE,DE GATTIERES,06610,LA GAUDE,,,06065,,,,,,,,,,,,,,,,,,,2007-08-31,F,,,,,01.1C,NAFRev1,N,7.179306,43.718286,0.67,street,Route de Gattières 06610 La Gaude,06065_cpkk5f,G,ROUTE DE GATTIERES,
037210457,00026,03721045700026,O,1987-07-01,NN,,,2008-01-04T17:56:06,true,3,,1178,,CHE,DES COLLES ET REGAGNADES,06610,LA GAUDE,,,06065,,,,,,,,,,,,,,,,,,,2008-01-01,A,,,,,68.20B,NAFRev2,N,7.152092,43.698638,0.89,housenumber,1178 Chemin des Colles et Regagnades 06610 La Gaude,06065_xrmfa2_01178,G,1178 CHEM COLLES ET REGAGNADES,
037211943,00024,03721194300024,O,,NN,,,,true,1,,,,,VALLON LA MAURE QU LA SELL,06610,LA GAUDE,,,06065,,,,,,,,,,,,,,,,,,,,F,,,,,64.42,NAP,N,,,0,,,,,,
037212701,00025,03721270100025,O,,NN,,,,true,1,,2500,,CHE,DES COLLES ET REGAGNADES,06610,LA GAUDE,,,06065,,,,,,,,,,,,,,,,,,,1993-12-31,F,,,,,55.3A,NAF1993,N,7.149073,43.707582,0.74,street,Chemin des Colles et Regagnades 06610 La Gaude,06065_xrmfa2,G,CHEMIN DES COLLES ET REGAGNADES,
037312402,00045,03731240200045,O,1994-09-27,NN,,,2008-11-07T00:16:09,true,4,DOM DE L'ETOILE LA TREILLE,1678,,AV,MARCEL PAGNOL,06610,LA GAUDE,,,06065,,,,,,,,,,,,,,,,,,,2008-01-01,F,,,,,43.21A,NAFRev2,N,7.164488,43.704261,0.86,housenumber,1678 Avenue Marcel Pagnol 06610 La Gaude,06065_ux55qx_01678,G,1678 AVENUE MARCEL PAGNOL,
180070039,00417,18007003900417,O,1983-03-16,NN,,,,false,4,RTE NATIONALE 209,,,,LA BARONNE,06610,LA GAUDE,,,06065,,,,,,,,,,,,,,,,,,,2001-11-28,F,UNIT EXP GEVES D'ANTIBES,,,,73.1Z,NAF1993,N,7.178332,43.731823,0.93,street,Route de la Baronne 06610 La Gaude,06065_0074,G,ROUTE DE LA BARONNE,
210600656,00016,21060065600016,O,1983-03-01,21,2018,,2020-08-25T10:15:35,true,4,,,,,LE VILLAGE,06610,LA GAUDE,,,06065,,,,,,,,,,,,,,,,,,,2008-01-01,A,MAIRIE,,,,84.11Z,NAFRev2,O,2.2950702,48.9311749,0.9,poi.bar,bar le village Gennevilliers,https://osm.org/node/3287755128,G,,
210600656,00024,21060065600024,O,1983-12-21,12,2018,,2020-08-25T10:15:35,false,3,,,,,LE VILLAGE,06610,LA GAUDE,,,06065,,,,,,,,,,,,,,,,,,,2008-01-01,A,ECOL PRIM LA GAUDE,,,,85.20Z,NAFRev2,N,2.2950702,48.9311749,0.9,poi.bar,bar le village Gennevilliers,https://osm.org/node/3287755128,G,,
210600656,00032,21060065600032,O,1983-12-21,11,2018,,2020-08-25T10:15:35,false,4,,7524,,RTE,DE CAGNES,06610,LA GAUDE,,,06065,,,,,,,,,,,,,,,,,,,2008-12-25,A,ECOLE MATERNELLE MANON DES SOURCES,,,,85.10Z,NAFRev2,N,7.150141,43.721095,0.62,street,Route de Cagnes 06610 La Gaude,06065_0132,G,ROUTE DE CAGNES,
210600656,00057,21060065600057,O,1984-11-26,NN,,,2008-01-04T18:24:21,false,3,,,,,LE VILLAGE,06610,LA GAUDE,,,06065,,,,,,,,,,,,,,,,,,,2008-01-01,A,SERVICE DE L ASSAINISSEMENT,,,,37.00Z,NAFRev2,N,2.2950702,48.9311749,0.9,poi.bar,bar le village Gennevilliers,https://osm.org/node/3287755128,G,,
210600656,00065,21060065600065,O,1989-02-01,11,2018,,2020-08-25T10:15:35,false,4,DOMAINE DE L ETOILE,,,AV,MARCEL PAGNOL,06610,LA GAUDE,,,06065,,,,,,,,,,,,,,,,,,,2008-04-23,A,ECOLE PRIAIRE PUBLIQUE JEAN MONNET,,,,85.20Z,NAFRev2,N,7.162453,43.693705,0.84,street,Avenue Marcel Pagnol 06610 La Gaude,06065_ux55qx,G,AVENUE MARCEL PAGNOL,
210600656,00073,21060065600073,O,1992-03-19,03,2018,,2020-08-25T10:15:35,false,3,DOMAINE DE L ETOILE,,,AV,MARCEL PAGNOL,06610,LA GAUDE,,,06065,,,,,,,,,,,,,,,,,,,2008-01-01,A,ECOLE MATE PUBLIQUE,,,,85.10Z,NAFRev2,N,7.162453,43.693705,0.84,street,Avenue Marcel Pagnol 06610 La Gaude,06065_ux55qx,G,AVENUE MARCEL PAGNOL,
210600656,00081,21060065600081,O,1995-09-01,NN,,,,false,4,,,,RTE,DE LA BARONNE,06610,LA GAUDE,,,06065,,,,,,,,,,,,,,,,,,,1997-12-31,F,ECOLE PRIMAIRE PUBLIQUE LA BARONNE,,,,80.1Z,NAF1993,N,7.178332,43.731823,0.85,street,Route de la Baronne 06610 La Gaude,06065_0074,G,ROUTE DE LA BARONNE,
210600656,00099,21060065600099,O,1995-12-25,NN,,,2008-01-04T18:24:21,false,2,MAIRIE,,,,LE VILLAGE,06610,LA GAUDE,,,06065,,,,,,,,,,,,,,,,,,,2008-01-01,A,SCE EAU DE LA GAUDE,,,,36.00Z,NAFRev2,N,2.2950702,48.9311749,0.9,poi.bar,bar le village Gennevilliers,https://osm.org/node/3287755128,G,,
210600656,00107,21060065600107,O,2000-05-30,02,2018,,2020-08-25T10:15:35,false,3,,2730,,,VC MARCELLIN ALLO NO 39,06610,LA GAUDE,,,06065,,,,,,,,,,,,,,,,,,,2008-01-01,A,ECOLE MATERNELLE BARONNE,,,,85.10Z,NAFRev2,N,,,0,,,,,,
210600656,00115,21060065600115,O,2013-04-01,,,,2018-06-22T11:07:29,false,2,MAIRIE,,,,LE VILLAGE,06610,LA GAUDE,,,06065,,,,,,,,,,,,,,,,,,,2017-07-01,F,OFFICE DE TOURISME,,,,79.90Z,NAFRev2,N,2.2950702,48.9311749,0.9,poi.bar,bar le village Gennevilliers,https://osm.org/node/3287755128,G,,
220600019,00552,22060001900552,O,2002-01-01,NN,,,2019-10-11T16:08:28,false,3,,,,,LA BARONNE,06610,LA GAUDE,,,06065,,,,,,,,,,,,,,,,,,,2008-01-01,A,ENVIRONNEMENT,,,,84.13Z,NAFRev2,N,7.178332,43.731823,0.93,street,Route de la Baronne 06610 La Gaude,06065_0074,G,ROUTE DE LA BARONNE,
240600148,00029,24060014800029,O,1996-02-01,NN,,,2017-05-04T01:32:05,false,4,,8,,PL,DE LA FONTAINE,06610,LA GAUDE,,,06065,,,,,,,,,,,,,,,,,,,2015-10-01,F,,,,,84.11Z,NAFRev2,O,7.1499,43.721945,0.86,housenumber,8 Place de la Fontaine 06610 La Gaude,06065_0275_00008,G,8 PLACE DE LA FONTAINE,
240600353,00017,24060035300017,O,1990-10-12,NN,,,,true,3,HOTEL DE VILLE,,,,LE VILLAGE,06610,LA GAUDE,,,06065,,,,,,,,,,,,,,,,,,,2003-10-15,F,COMM LA GAUDE ET VENCE,,,,75.1A,NAFRev1,O,2.2950702,48.9311749,0.9,poi.bar,bar le village Gennevilliers,https://osm.org/node/3287755128,G,,
250601648,00026,25060164800026,O,1995-10-01,00,2018,,2020-08-25T10:20:12,true,5,COTISATION CSG MAIRIE,,,,CD LOUIS MICHEL FERAUD NO 418,06610,LA GAUDE,,,06065,,,,,,,,,,,,,,,,,,,2018-11-07,A,,,,,84.11Z,NAFRev2,O,7.151036,43.722243,0.67,street,Rue Louis Michel Feraud 06610 La Gaude,06065_zukaoh,G,RUE LOUIS MICHEL FERAUD,
260601380,00017,26060138000017,O,1984-11-20,NN,,,2010-06-26T03:03:28,true,3,HOTEL DE VILLE,,,,LE VILLAGE,06610,LA GAUDE,,,06065,,,,,,,,,,,,,,,,,,,2008-01-01,A,CCAS,,,,88.99B,NAFRev2,N,2.2950702,48.9311749,0.9,poi.bar,bar le village Gennevilliers,https://osm.org/node/3287755128,G,,
260602537,00011,26060253700011,O,1984-12-04,NN,,,2008-01-04T18:55:14,true,3,HOTEL DE VILLE,,,,LE VILLAGE,06610,LA GAUDE,,,06065,,,,,,,,,,,,,,,,,,,2008-01-01,A,CDE,,,,88.99B,NAFRev2,N,2.2950702,48.9311749,0.9,poi.bar,bar le village Gennevilliers,https://osm.org/node/3287755128,G,,
270600521,00016,27060052100016,O,,,,,,true,1,,,,,LE VILLAGE,06610,LA GAUDE,,,06065,,,,,,,,,,,,,,,,,,,1995-12-25,F,,,,,41.0Z,NAF1993,N,2.2950702,48.9311749,0.9,poi.bar,bar le village Gennevilliers,https://osm.org/node/3287755128,G,,
270600901,00010,27060090100010,O,,NN,,,,true,1,,,,,CD LOUIS MICHEL FERAUD NO 418,06610,LA GAUDE,,,06065,,,,,,,,,,,,,,,,,,,1995-12-25,F,,,,,90.0A,NAF1993,O,7.151036,43.722243,0.67,street,Rue Louis Michel Feraud 06610 La Gaude,06065_zukaoh,G,RUE LOUIS MICHEL FERAUD,
290601152,00017,29060115200017,O,1983-08-10,NN,,,2006-11-25T09:10:20,false,4,,,,,HOTEL DE VILLE,06610,LA GAUDE,,,06065,,,,,,,,,,,,,,,,,,,1996-12-25,F,,,,,70.1C,NAF1993,N,7.156756,43.717092,0.35,street,Montee de l'Oeillet 06610 La Gaude,06065_0463,G,MONTEE DE L OEILLET,
290601152,00025,29060115200025,O,1995-02-06,NN,,,2008-01-04T19:05:47,true,3,,3,,AV,DES LAURIERS,06610,LA GAUDE,,,06065,,,,,,,,,,,,,,,,,,,2008-01-01,A,,,,,42.99Z,NAFRev2,N,7.163798,43.73383,0.84,housenumber,3 Avenue des Lauriers 06610 La Gaude,06065_0366_00003,G,3 AVENUE DES LAURIERS,
290601160,00010,29060116000010,O,,,,,2006-11-25T09:10:20,true,1,,,,,HOTEL DE VILLE,06610,LA GAUDE,,,06065,,,,,,,,,,,,,,,,,,,,F,,,,,90.12,NAP,N,7.156756,43.717092,0.35,street,Montee de l'Oeillet 06610 La Gaude,06065_0463,G,MONTEE DE L OEILLET,
300073814,00018,30007381400018,O,,,,,,true,1,,,,LD,LES COLLES,06610,LA GAUDE,,,06065,,,,,,,,,,,,,,,,,,,1984-12-25,F,,,,,77.06,NAP,N,7.146953,43.736856,0.81,street,Chemin du Pont des Colles 06610 La Gaude,06065_0ztlo5,G,CHEMIN DU PONT DES COLLES,
300073897,00013,30007389700013,O,,,,,2007-05-09T05:29:47,true,1,,,,,QUARTIER LA BARONNE,06610,LA GAUDE,,,06065,,,,,,,,,,,,,,,,,,,1984-12-25,F,,,,,55.40,NAP,N,7.178332,43.731823,0.53,street,Route de la Baronne 06610 La Gaude,06065_0074,G,ROUTE DE LA BARONNE,
300212768,00059,30021276800059,O,,NN,,,,true,1,,,,CHE,BERANGIER,06610,LA GAUDE,,,06065,,,,,,,,,,,,,,,,,,,1991-09-30,F,,,,,64.25,NAP,N,7.149313,43.722939,0.49,street,Chemin Hugues Bérenguier 06610 La Gaude,06065_437pdp,G,CHEMIN HUGUES BERENGUIER,
300437357,00027,30043735700027,O,,NN,,,,true,1,,,,CHE,DENYS AMIEL,06610,LA GAUDE,,,06065,,,,,,,,,,,,,,,,,,,,F,,,,,77.09,NAP,N,7.151726,43.724211,0.83,street,Chemin Denys Amiel 06610 La Gaude,06065_qaleza,G,CHEMIN DENYS AMIEL,
300634375,00012,30063437500012,O,,,,,,true,1,,,,,BP N3 RTE DE ST JEANNET,06610,LA GAUDE,,,06065,,,,,,,,,,,,,,,,,,,1984-12-25,F,,,,,77.01,NAP,N,7.154831,43.732456,0.56,street,Route de Saint-jeannet 06610 La Gaude,06065_fn2e77,G,ROUTE DE SAINT JEANNET,
300663598,00021,30066359800021,O,2003-04-01,NN,,4322AZ,2017-12-28T09:01:54,true,4,,7296,,RTE,DE CAGNES SUR MER CD 18,06610,LA GAUDE,,,06065,,,,,,,,,,,,,,,,,,,2017-12-31,F,,,,,43.22A,NAFRev2,N,7.150141,43.721095,0.42,street,Route de Cagnes 06610 La Gaude,06065_0132,G,ROUTE DE CAGNES,
300774726,00107,30077472600107,O,,,,,,true,1,,8808,,RTE,DE ST LAURENT,06610,LA GAUDE,,,06065,,,,,,,,,,,,,,,,,,,1993-12-03,F,,,,,52.7H,NAF1993,N,7.156765,43.732385,0.58,street,Route de Saint-laurent 06610 La Gaude,06065_q8n89b,G,ROUTE DE SAINT LAURENT,
300967304,00035,30096730400035,O,1997-03-08,,,,,false,3,SALU'SECRET LA BARONNE,2477,,,VC MARCELLIN ALLO NO 39,06610,LA GAUDE,,,06065,,,,,,,,,,,,,,,,,,,1998-08-01,F,,,,,60.2M,NAF1993,N,,,0,,,,,,
301643342,00027,30164334200027,O,,NN,,,,true,1,,,,,QU ST PIERRE,06610,LA GAUDE,,,06065,,,,,,,,,,,,,,,,,,,1990-12-06,F,,,,,84.10,NAP,N,7.15007,43.722078,0.52,street,Rue de la Pierre 06610 La Gaude,06065_0580,G,RUE DE LA PIERRE,
301673596,00047,30167359600047,O,1993-03-01,NN,,4322AZ,2015-07-29T11:06:17,false,8,VILLA JEANNE,226,,,CRS DES OLIVIERS N 25,06610,LA GAUDE,,,06065,,,,,,,,,,,,,,,,,,,2014-12-31,F,,,,,43.22A,NAFRev2,N,,,0,,,,,,
301716619,00020,30171661900020,O,,,,,,true,1,,7183,,RTE,DE CAGNES,06610,LA GAUDE,,,06065,,,,,,,,,,,,,,,,,,,1997-03-31,F,,,,,52.5Z,NAF1993,N,7.150141,43.721095,0.62,street,Route de Cagnes 06610 La Gaude,06065_0132,G,ROUTE DE CAGNES,
301899290,00029,30189929000029,O,1900-01-01,NN,,,,true,3,ZAC LES NERTIERES,,,,LE PLAN DU BOIS,06610,LA GAUDE,,,06065,,,,,,,,,,,,,,,,,,,1995-12-25,F,,,,,74.2C,NAF1993,O,7.173051,43.728948,0.77,street,Chemin Plan du Bois 06610 La Gaude,06065_cr2y1i,G,CHEMIN PLAN DU BOIS,
302459508,00032,30245950800032,O,1982-10-01,NN,,,2009-10-27T04:22:56,true,4,,196,,,CRS DES CLAPIERS N 102,06610,LA GAUDE,,,06065,,,,,,,,,,,,,,,,,,,2009-01-01,F,,,,,71.11Z,NAFRev2,N,,,0,,,,,,
302477708,00028,30247770800028,O,1991-08-02,NN,,,,true,1,,102,,MTE,DU TRIGAN,06610,LA GAUDE,,,06065,,,,,,,,,,,,,,,,,,,2002-12-03,F,,,,,52.7H,NAF1993,N,7.147556,43.721036,0.8,housenumber,102 Montee du Trigan 06610 La Gaude,06065_0955_00102,G,102 MONTEE DU TRIGAN,
302494612,00039,30249461200039,O,1991-11-30,NN,,,,true,4,,3207,,CHE,DES COLLES ET REGAGNADES,06610,LA GAUDE,,,06065,,,,,,,,,,,,,,,,,,,2000-09-11,F,,,,,45.1A,NAF1993,O,7.149073,43.707582,0.74,street,Chemin des Colles et Regagnades 06610 La Gaude,06065_xrmfa2,G,CHEMIN DES COLLES ET REGAGNADES,
302643036,00015,30264303600015,O,,,,,,true,1,,,,,VILLA SAPI CHE DE ST LAU,06610,LA GAUDE,,,06065,,,,,,,,,,,,,,,,,,,1984-12-25,F,,,,,55.60,NAP,N,,,0,,,,,,
302745484,00014,30274548400014,O,,NN,,,,true,1,,,,QUAI,LES SEREINS,06610,LA GAUDE,,,06065,,,,,,,,,,,,,,,,,,,,F,,,,,55.60,NAP,N,,,0,,,,,,
303071294,00027,30307129400027,O,2006-09-13,,,,2007-06-28T05:11:07,true,2,,908,,,LES COLLES,06610,LA GAUDE,,,06065,,,,,,,,,,,,,,,,,,,2007-06-29,F,,,,,67.2Z,NAFRev1,N,7.15171,43.701177,0.78,housenumber,908 Cours des Colles et Regagnade 06610 La Gaude,06065_0195_00908,G,908 COUR DES COLLES ET REGAGNADE,
303275473,00013,30327547300013,O,1900-01-01,21,2018,,2020-08-25T10:22:32,true,4,CHEM DU VALLON DES VAUX,,,,LE GUEIRARD,06610,LA GAUDE,,,06065,,,,,,,,,,,,,,,,,,,2008-01-01,A,,,,,27.40Z,NAFRev2,O,,,0,,,,,,
303275473,00039,30327547300039,O,2020-01-01,,,,2020-01-27T08:07:07,false,1,,395,,RTE,DES REGAGNADES,06610,LA GAUDE,,,06065,,,,,,,,,,,,,,,,,,,2020-01-01,A,,,,,27.40Z,NAFRev2,O,7.158472,43.697332,0.86,housenumber,395 Route des Regagnades 06610 La Gaude,06065_0695_00395,G,395 ROUTE DES REGAGNADES,
303560403,00014,30356040300014,O,1975-01-01,NN,,,,true,1,,,,,LA BARONNE,06610,LA GAUDE,,,06065,,,,,,,,,,,,,,,,,,,2000-06-02,F,,,,,50.5Z,NAF1993,N,7.178332,43.731823,0.93,street,Route de la Baronne 06610 La Gaude,06065_0074,G,ROUTE DE LA BARONNE,
303602817,00023,30360281700023,O,,NN,,,,true,1,,,,LD,LA BERGERIE,06610,LA GAUDE,,,06065,,,,,,,,,,,,,,,,,,,,F,,,,,00.98,NAP,N,7.0279184,48.5682884,0.9,poi.peak,La Bergerie (Pic) Bertrambois,https://osm.org/node/3133785313,G,,
303699003,00032,30369900300032,O,1991-07-01,,,,,true,3,,3207,,CHE,DES COLLES ET REGAGNADES,06610,LA GAUDE,,,06065,,,,,,,,,,,,,,,,,,,1992-12-25,F,,,,,60.2M,NAF1993,N,7.149073,43.707582,0.74,street,Chemin des Colles et Regagnades 06610 La Gaude,06065_xrmfa2,G,CHEMIN DES COLLES ET REGAGNADES,
303768147,00017,30376814700017,O,,NN,,,,true,1,,,,,,06610,LA GAUDE,,,06065,,,,,,,,,,,,,,,,,,,,F,,,,,64.11,NAP,N,,,0,,,,,,
303832018,00038,30383201800038,O,2003-07-07,NN,,,2008-11-07T00:19:27,true,3,,176,,RTE,DE SAINT-JEANNET,06610,LA GAUDE,,,06065,,,,,,,,,,,,,,,,,,,2007-03-31,F,,,,,45.4J,NAFRev1,N,7.153598,43.733449,0.88,housenumber,176 Route de Saint-jeannet 06610 La Gaude,06065_fn2e77_00176,G,176 ROUTE DE SAINT JEANNET,
303957823,00014,30395782300014,O,,,,,,true,1,,,,,QU LES COMBES LOT 17,06610,LA GAUDE,,,06065,,,,,,,,,,,,,,,,,,,1984-12-25,F,,,,,55.71,NAP,N,,,0,,,,,,
303973697,00020,30397369700020,O,1991-09-25,NN,,,,true,1,,,,RTE,DE SAINT-JEANNET,06610,LA GAUDE,,,06065,,,,,,,,,,,,,,,,,,,1998-12-31,F,,,,,45.4J,NAF1993,N,7.154831,43.732456,0.86,street,Route de Saint-jeannet 06610 La Gaude,06065_fn2e77,G,ROUTE DE SAINT JEANNET,
304693153,00054,30469315300054,O,2012-09-20,,,,2015-06-05T10:28:56,true,3,137 CHEMIN DES VERGERS,137,,,LES VERGERS,06610,LA GAUDE,,,06065,,,,,,,,,,,,,,,,,,,2015-06-04,A,,,,,43.33Z,NAFRev2,N,7.150649,43.70834,0.77,housenumber,137 Chemin des Vergers 06610 La Gaude,06065_wqudgg_00137,G,137 CHEMIN DES VERGERS,
305192213,00034,30519221300034,O,1900-01-01,NN,,,2011-04-28T00:11:47,false,3,,3207,,CHE,DES COLLES ET REGAGNADES,06610,LA GAUDE,,,06065,,,,,,,,,,,,,,,,,,,1995-06-16,F,,,,,74.7Z,NAF1993,N,7.149073,43.707582,0.74,street,Chemin des Colles et Regagnades 06610 La Gaude,06065_xrmfa2,G,CHEMIN DES COLLES ET REGAGNADES,
305234494,00022,30523449400022,O,,,,,,true,1,,,,,LA BARONNE,06610,LA GAUDE,,,06065,,,,,,,,,,,,,,,,,,,1985-12-25,F,,,,,59.13,NAP,N,7.178332,43.731823,0.93,street,Route de la Baronne 06610 La Gaude,06065_0074,G,ROUTE DE LA BARONNE,
305306862,00031,30530686200031,O,1985-01-18,NN,,,2016-01-12T08:36:26,true,4,DOMAINE DE L ETOILE,256,,ALL,GRANDE ALLEE D ORION,06610,LA GAUDE,,,06065,,,,,,,,,,,,,,,,,,,2015-12-31,F,,,,,71.12B,NAFRev2,N,7.165226,43.698314,0.77,street,Grande Allée d'Orion 06610 La Gaude,06065_thpmr7,G,GRANDE ALLEE D ORION,
305496259,00022,30549625900022,O,,NN,,,,true,1,,,,,10566 CD18 QUART LES COLLE,06610,LA GAUDE,,,06065,,,,,,,,,,,,,,,,,,,1991-03-31,F,,,,,55.73,NAP,N,,,0,,,,,,
305496622,00021,30549662200021,O,,NN,,,,true,1,,,,CHE,DES COLLES CD89,06610,LA GAUDE,,,06065,,,,,,,,,,,,,,,,,,,1988-03-31,F,,,,,55.73,NAP,N,,,0,,,,,,
305550238,00011,30555023800011,O,,,,,,true,1,,,,,Q DE LA BARONNE,06610,LA GAUDE,,,06065,,,,,,,,,,,,,,,,,,,1990-03-31,F,,,,,67.01,NAP,N,7.178332,43.731823,0.82,street,Route de la Baronne 06610 La Gaude,06065_0074,G,ROUTE DE LA BARONNE,
305603342,00026,30560334200026,O,,NN,,,,true,1,,,,,QUARTIER ST PIERRE,06610,LA GAUDE,,,06065,,,,,,,,,,,,,,,,,,,1990-09-18,F,,,,,53.02,NAP,N,-0.761348,46.40317,0.84,poi.community_centre,Œuvres Post-scolaires DE Souil (Salle des fêtes) Saint-Pierre-le-Vieux,https://osm.org/way/136850207,G,,
305715906,00023,30571590600023,O,,NN,,,,true,1,,,,CHE,DES COMBES LD GARBASSE,06610,LA GAUDE,,,06065,,,,,,,,,,,,,,,,,,,,F,,,,,69.12,NAP,N,,,0,,,,,,
305733891,00025,30573389100025,O,1975-02-24,NN,,,2007-10-09T10:18:41,false,3,,320,,CHE,DU MONTGROS,06610,LA GAUDE,,,06065,,,,,,,,,,,,,,,,,,,2007-10-08,F,,,,,70.2A,NAFRev1,N,7.167444,43.723027,0.77,housenumber,320 Chemin du Mont Gros 06610 La Gaude,06065_0422_00320,G,320 CHEMIN DU MONT GROS,
306333295,00013,30633329500013,O,1900-01-01,NN,,,2015-05-06T08:34:31,false,4,,,,,LE PILON,06610,LA GAUDE,,,06065,,,,,,,,,,,,,,,,,,,1997-12-31,F,,,,,45.1A,NAF1993,N,7.6004868,43.9683474,0.9,poi.peak,Le Pilon (Pic) Saorge,https://osm.org/node/5383386623,G,,
306333295,00021,30633329500021,O,2015-05-02,,,4312AZ,2015-07-08T11:22:22,true,2,2437 RTE DE LA GAUDE,2437,,,CD ST LAURENT NO 118,06610,LA GAUDE,,06610,06065,,,,,,,,,,,,,,,,,,,2015-07-03,A,,,,MARCUCCI VINCENT,43.12A,NAFRev2,N,,,0,,,,,,
306576299,00011,30657629900011,O,1900-01-01,,,,2011-04-28T00:12:12,false,2,,,,,LE PEYMONT,06610,LA GAUDE,,,06065,,,,,,,,,,,,,,,,,,,1985-12-25,F,,,,,01.80,NAP,N,,,0,,,,,,
306576299,00029,30657629900029,O,2009-04-06,,,,2013-09-10T08:35:30,false,2,QUARTIER LE PEYMONT,244,,,MTE DE L OEILLET,06610,LA GAUDE,,,06065,,,,,,,,,,,,,,,,,,,2011-01-01,F,,,,,47.81Z,NAFRev2,N,7.157214,43.717949,0.82,housenumber,244 Montee de l'Oeillet 06610 La Gaude,06065_0463_00244,G,244 MONTEE DE L OEILLET,
306576299,00037,30657629900037,O,2013-09-15,,,,2018-04-13T08:41:02,true,2,RESIDENCE LES PINS,8354,,,CD ST LAURENT NO 118,06610,LA GAUDE,,,06065,,,,,,,,,,,,,,,,,,,2017-12-31,F,,,,,43.12A,NAFRev2,N,,,0,,,,,,
306676412,00027,30667641200027,O,,NN,,,,true,1,,1108,,CHE,COLLES,06610,LA GAUDE,,,06065,,,,,,,,,,,,,,,,,,,1990-09-14,F,,,,,77.01,NAP,N,7.152896,43.699723,0.71,housenumber,1108 Cours des Colles et Regagnade 06610 La Gaude,06065_0195_01108,G,1108 COUR COLLES ET REGAGNADE,
306690876,00017,30669087600017,O,,NN,,,,true,1,,,,,QU DES COMBES,06610,LA GAUDE,,,06065,,,,,,,,,,,,,,,,,,,,F,,,,,53.01,NAP,N,7.153639,43.717449,0.72,street,Chemin des Combes 06610 La Gaude,06065_okr0m6,G,CHEMIN DES COMBES,
306700683,00015,30670068300015,O,,NN,,,,true,1,,,,,BAR TABAC,06610,LA GAUDE,,,06065,,,,,,,,,,,,,,,,,,,,F,,,,,67.05,NAP,N,0.976883,49.5102814,0.91,poi.bar,Bar-Tabac Roumare,https://osm.org/way/307131335,G,,
306751983,00017,30675198300017,O,,NN,,,,true,1,,,,,LA CASERNE MAISON BONNET,06610,LA GAUDE,,,06065,,,,,,,,,,,,,,,,,,,,F,,,,,64.11,NAP,N,,,0,,,,,,
307306688,00010,30730668800010,O,1900-01-01,,,,2018-02-23T14:28:51,false,4,RTE NATIONALE 209,,,,LA BARONNE,06610,LA GAUDE,,,06065,,,,,,,,,,,,,,,,,,,2008-01-01,F,,,,,31.09B,NAFRev2,N,7.178332,43.731823,0.93,street,Route de la Baronne 06610 La Gaude,06065_0074,G,ROUTE DE LA BARONNE,
307343962,00014,30734396200014,O,,,,,,true,1,,,,CHE,DE ST JEANNET LE SEREN,06610,LA GAUDE,,,06065,,,,,,,,,,,,,,,,,,,1993-03-31,F,,,,,45.2V,NAF1993,N,,,0,,,,,,
307439281,00014,30743928100014,O,,,,,,true,1,,2,,AV,DES CHAUVETS,06610,LA GAUDE,,,06065,,,,,,,,,,,,,,,,,,,1984-12-25,F,,,,,55.60,NAP,N,,,0,,,,,,
307439299,00016,30743929900016,O,,,,,,true,1,,,,,VIL SABI PA*LES CONDAMINES,06610,LA GAUDE,,,06065,,,,,,,,,,,,,,,,,,,1984-12-25,F,,,,,79.06,NAP,N,,,0,,,,,,
307439364,00018,30743936400018,O,1972-01-01,NN,,,2017-02-16T09:51:44,true,4,,,,,TRIGAN,06610,LA GAUDE,,,06065,,,,,,,,,,,,,,,,,,,2008-01-01,A,,,,,68.20B,NAFRev2,N,7.149319,43.72256,0.92,street,Rue du Trigan 06610 La Gaude,06065_g9pq18,G,RUE DU TRIGAN,
307487553,00025,30748755300025,O,,NN,,,,true,1,,,,,QUARTIER DE LA SELLE,06610,LA GAUDE,,,06065,,,,,,,,,,,,,,,,,,,1987-12-01,F,,,,,64.25,NAP,N,2.894189,48.066352,0.8,poi.community_centre,Salle des fêtes La Selle-sur-le-Bied,https://osm.org/node/323192634,G,,
307519447,00030,30751944700030,O,1983-12-01,NN,,,,true,1,,,,CHE,DU VALLON DES VAUX,06610,LA GAUDE,,,06065,,,,,,,,,,,,,,,,,,,1996-03-11,F,,,,,45.3E,NAF1993,O,7.154924,43.732909,0.53,street,Chemin du Font de Ribe et Vallons 06610 La Gaude,06065_0274,G,CHEM DU FONT DE RIBE ET VALLONS,
307523571,00031,30752357100031,O,,NN,,,,true,1,,,,,"VALLON DES VAUX,C  SOLENTC",06610,LA GAUDE,,,06065,,,,,,,,,,,,,,,,,,,1988-05-03,F,,,,,79.01,NAP,N,,,0,,,,,,
307527622,00012,30752762200012,O,1900-01-01,NN,,,2008-01-04T19:47:08,true,3,,,,,LA BASSE GAUDE,06610,LA GAUDE,,,06065,,,,,,,,,,,,,,,,,,,2008-01-01,A,,,,,93.12Z,NAFRev2,N,,,0,,,,,,
308620434,00024,30862043400024,O,,NN,,,,true,1,,,,,VAL DE LA MAURE,06610,LA GAUDE,,,06065,,,,,,,,,,,,,,,,,,,,F,,,,,59.09,NAP,N,6.7468304,45.2957738,0.73,poi.glacier,Glacier de la Mahure Val-Cenis,https://osm.org/relation/3398528,G,,