siren,nic,siret,statutDiffusionEtablissement,dateCreationEtablissement,trancheEffectifsEtablissement,anneeEffectifsEtablissement,activitePrincipaleRegistreMetiersEtablissement,dateDernierTraitementEtablissement,etablissementSiege,nombrePeriodesEtablissement,complementAdresseEtablissement,numeroVoieEtablissement,indiceRepetitionEtablissement,typeVoieEtablissement,libelleVoieEtablissement,codePostalEtablissement,libelleCommuneEtablissement,libelleCommuneEtrangerEtablissement,distributionSpecialeEtablissement,codeCommuneEtablissement,codeCedexEtablissement,libelleCedexEtablissement,codePaysEtrangerEtablissement,libellePaysEtrangerEtablissement,complementAdresse2Etablissement,numeroVoie2Etablissement,indiceRepetition2Etablissement,typeVoie2Etablissement,libelleVoie2Etablissement,codePostal2Etablissement,libelleCommune2Etablissement,libelleCommuneEtranger2Etablissement,distributionSpeciale2Etablissement,codeCommune2Etablissement,codeCedex2Etablissement,libelleCedex2Etablissement,codePaysEtranger2Etablissement,libellePaysEtranger2Etablissement,dateDebut,etatAdministratifEtablissement,enseigne1Etablissement,enseigne2Etablissement,enseigne3Etablissement,denominationUsuelleEtablissement,activitePrincipaleEtablissement,nomenclatureActivitePrincipaleEtablissement,caractereEmployeurEtablissement,longitude,latitude,geo_score,geo_type,geo_adresse,geo_id,geo_ligne,geo_l4,geo_l5
211400544,00014,21140054400014,O,1983-03-01,01,2018,,2020-08-25T10:15:53,true,3,,,,,LE BOURG,14380,BEAUMESNIL,,,14054,,,,,,,,,,,,,,,,,,,2008-01-01,A,MAIRIE,,,,84.11Z,NAFRev2,N,-0.983135,48.894803,0.61,street,Lotissement du Bourg 14380 Beaumesnil,14054_tba20a,G,LOTISSEMENT DU BOURG,
251404174,00020,25140417400020,O,2006-12-20,02,2018,,2021-02-23T10:34:40,true,3,MAIRIE,,,,LE BOURG,14380,BEAUMESNIL,,,14054,,,,,,,,,,,,,,,,,,,2010-03-09,A,,,,,84.11Z,NAFRev2,O,2.212915,47.9910304,0.9,poi.bar,Le Bourg (Bar) Ingrannes,https://osm.org/node/1718543174,G,,
261406326,00015,26140632600015,O,1995-12-25,,,,2021-01-12T10:05:20,true,3,MAIRIE,,,,LE BOURG,14380,BEAUMESNIL,,,14054,,,,,,,,,,,,,,,,,,,2021-01-01,F,CCAS,,,,88.99B,NAFRev2,N,2.212915,47.9910304,0.9,poi.bar,Le Bourg (Bar) Ingrannes,https://osm.org/node/1718543174,G,,
291400141,00011,29140014100011,O,1984-01-16,NN,,,2006-11-25T09:10:25,true,1,,,,,LE BOURG,14380,BEAUMESNIL,,,14054,,,,,,,,,,,,,,,,,,,1998-10-12,F,,,,,70.1C,NAF1993,N,-0.983135,48.894803,0.61,street,Lotissement du Bourg 14380 Beaumesnil,14054_tba20a,G,LOTISSEMENT DU BOURG,
305395154,00019,30539515400019,O,1973-01-01,NN,,4312BA,2015-03-17T00:11:36,true,4,,,,,BOURG,14380,BEAUMESNIL,,,14054,,,,,,,,,,,,,,,,,,,2006-12-01,F,,,,,41.0Z,NAFRev1,O,-0.983135,48.894803,0.9,street,Lotissement du Bourg 14380 Beaumesnil,14054_tba20a,G,LOTISSEMENT DU BOURG,
306058272,00023,30605827200023,O,1981-12-01,NN,,,2019-02-14T19:32:39,true,5,,,,,LA LANDE,14380,BEAUMESNIL,,,14054,,,,,,,,,,,,,,,,,,,2019-01-31,F,,,,,47.89Z,NAFRev2,O,-0.5060199,44.7464063,0.9,poi.island,Île de la Lande Quinsac,https://osm.org/way/4544508,G,,
310560479,00027,31056047900027,O,,,,,,true,1,,,,,,14380,BEAUMESNIL,,,14054,,,,,,,,,,,,,,,,,,,1985-12-25,F,,,,,55.70,NAP,N,,,0,,,,,,
322507237,00012,32250723700012,O,1980-11-13,NN,,,2021-02-10T08:38:29,true,4,,,,,LA MARE,14380,BEAUMESNIL,,,14054,,,,,,,,,,,,,,,,,,,2021-02-01,F,,,,,85.53Z,NAFRev2,N,2.9722697,50.5792295,0.89,poi.water,La mare (Eau) Santes,https://osm.org/way/405755412,G,,
330957655,00013,33095765500013,O,,,,,,true,1,,,,,,14380,BEAUMESNIL,,,14054,,,,,,,,,,,,,,,,,,,1985-12-25,F,,,,,62.46,NAP,N,,,0,,,,,,
334230323,00019,33423032300019,O,1986-01-01,NN,,,,true,1,,,,,LA LANGOTIERE,14380,BEAUMESNIL,,,14054,,,,,,,,,,,,,,,,,,,1998-12-31,F,,,,,01.1A,NAF1993,N,,,0,,,,,,
334367844,00019,33436784400019,O,1986-01-01,NN,,,2008-01-04T20:50:04,true,3,,,,,LE HAMEL GOHIER,14380,BEAUMESNIL,,,14054,,,,,,,,,,,,,,,,,,,2008-01-01,A,,,,,01.42Z,NAFRev2,N,-0.982785,48.900398,0.93,locality,Le Hamel Gohier 14380 Beaumesnil,14054_b139,G,LE HAMEL GOHIER,
340807858,00030,34080785800030,O,1995-06-01,NN,,,2010-03-23T11:22:07,false,4,,,,,LE PLANT,14380,BEAUMESNIL,,,14054,,,,,,,,,,,,,,,,,,,2009-12-22,F,,,,,68.20B,NAFRev2,N,-0.8853537,48.6466844,0.89,poi.meadow,Le Plant (Prairie) Saint-Clément-Rancoudray,https://osm.org/way/293866864,G,,
349910760,00033,34991076000033,O,2007-08-15,NN,,4399CZ,2015-03-17T00:29:05,true,3,,,,,LE HAMEL BUREL,14380,BEAUMESNIL,,,14054,,,,,,,,,,,,,,,,,,,2009-01-02,F,,,,,43.99C,NAFRev2,O,-0.981239,48.890608,0.93,locality,Le Hamel Burel 14380 Beaumesnil,14054_b137,G,LE HAMEL BUREL,
351117247,00012,35111724700012,O,1989-01-01,NN,,,,true,1,,,,,,14380,BEAUMESNIL,,,14054,,,,,,,,,,,,,,,,,,,2002-12-31,F,,,,,01.1A,NAF1993,N,,,0,,,,,,
352526420,00018,35252642000018,O,1989-09-29,NN,,,2007-01-18T09:27:40,true,3,,,,,LE PLONT,14380,BEAUMESNIL,,,14054,,,,,,,,,,,,,,,,,,,1995-12-25,F,,,,,01.1A,NAF1993,N,4.5646162,45.6592251,0.78,poi.bus_stop,Le Plon (Arrêt de bus) Saint-Martin-en-Haut,https://osm.org/node/4010139177,G,,
380046433,00013,38004643300013,O,1990-11-01,NN,,,2010-04-02T05:38:02,true,5,LE MESNIL,,,,LE MESNIL,14380,BEAUMESNIL,,,14054,,,,,,,,,,,,,,,,,,,2010-01-01,F,,,,,01.42Z,NAFRev2,N,-0.981239,48.890608,0.73,locality,Le Hamel Burel 14380 Beaumesnil,14054_b137,G,LE HAMEL BUREL,
381291582,00017,38129158200017,O,1990-09-29,NN,,,,true,1,,,,,LA LANGOTTIERE,14380,BEAUMESNIL,,,14054,,,,,,,,,,,,,,,,,,,1998-01-14,F,,,,,01.3Z,NAF1993,N,-0.1825959,47.5927911,0.71,poi.spring,lavoir des langottières (Source) Baugé-en-Anjou,https://osm.org/node/2006700461,G,,
404752131,00015,40475213100015,O,1996-04-01,NN,,,2019-06-24T13:26:38,true,5,,,,,LA PAUMERIE,14380,BEAUMESNIL,,,14054,,,,,,,,,,,,,,,,,,,2018-10-01,F,,,,,01.41Z,NAFRev2,O,-0.967145,48.890724,0.91,locality,La Petite Paumerie 14380 Beaumesnil,14054_b204,G,LA PETITE PAUMERIE,
405245697,00017,40524569700017,O,1996-05-13,NN,,,2008-01-04T20:52:26,true,3,,,,,LE HAMEL GOHIER,14380,BEAUMESNIL,,,14054,,,,,,,,,,,,,,,,,,,2008-01-01,A,,,,,77.31Z,NAFRev2,N,-0.982785,48.900398,0.93,locality,Le Hamel Gohier 14380 Beaumesnil,14054_b139,G,LE HAMEL GOHIER,
407521491,00016,40752149100016,O,1996-05-01,NN,,,2011-02-07T03:41:59,true,4,,,,,LA PETITE MARE,14380,BEAUMESNIL,,,14054,,,,,,,,,,,,,,,,,,,2011-01-31,F,,,,,68.20B,NAFRev2,N,-1.0038691,48.3202912,0.9,poi.water,La Petite Mare (Eau) La Pellerine,https://osm.org/way/464590228,G,,
407573369,00011,40757336900011,O,1996-05-01,NN,,,2006-10-28T03:29:01,false,3,,,,,LA PETITE MARE,14380,BEAUMESNIL,,,14054,,,,,,,,,,,,,,,,,,,2005-10-01,F,,,,,01.3Z,NAFRev1,N,-1.0038691,48.3202912,0.9,poi.water,La Petite Mare (Eau) La Pellerine,https://osm.org/way/464590228,G,,
409209517,00013,40920951700013,O,1900-01-01,NN,,,2012-02-10T07:20:58,false,3,,,,,LA PETITE POMMERIE,14380,BEAUMESNIL,,,14054,,,,,,,,,,,,,,,,,,,1996-12-31,F,,,,,01.2A,NAF1993,N,-0.967145,48.890724,0.74,locality,La Petite Paumerie 14380 Beaumesnil,14054_b204,G,LA PETITE PAUMERIE,
409209517,00021,40920951700021,O,2012-01-01,,,,2017-08-04T11:37:06,true,2,,,,,LA GOUGEONNIERE,14380,BEAUMESNIL,,,14054,,,,,,,,,,,,,,,,,,,2017-04-28,F,,,,,01.19Z,NAFRev2,N,,,0,,,,,,
410927172,00024,41092717200024,O,2009-06-10,,,,2014-02-19T04:30:59,false,2,,,,LD,LA LANDE,14380,BEAUMESNIL,,,14054,,,,,,,,,,,,,,,,,,,2014-02-18,F,,,,,81.30Z,NAFRev2,N,-0.5060199,44.7464063,0.9,poi.island,Île de la Lande Quinsac,https://osm.org/way/4544508,G,,
413226242,00019,41322624200019,O,1982-12-31,NN,,,2008-01-04T22:30:28,true,3,,,,,LA LANDE,14380,BEAUMESNIL,,,14054,,,,,,,,,,,,,,,,,,,2008-01-01,A,,,,,01.11Z,NAFRev2,N,-0.5060199,44.7464063,0.9,poi.island,Île de la Lande Quinsac,https://osm.org/way/4544508,G,,
413226259,00013,41322625900013,O,1982-12-31,NN,,,2008-01-04T22:30:28,true,3,,,,,LA GDE MARE,14380,BEAUMESNIL,,,14054,,,,,,,,,,,,,,,,,,,2008-01-01,A,,,,,01.11Z,NAFRev2,N,0.9404862,48.9609297,0.75,poi.water,La Grande Mare (Eau) Conches-en-Ouche,https://osm.org/way/161471201,G,,
413226267,00016,41322626700016,O,1990-01-01,NN,,,,true,4,,,,,,14380,BEAUMESNIL,,,14054,,,,,,,,,,,,,,,,,,,1998-11-29,F,,,,,01.1A,NAF1993,N,,,0,,,,,,
413226275,00019,41322627500019,O,1989-12-31,NN,,,2008-01-04T22:30:28,true,3,,,,,LE BOURG,14380,BEAUMESNIL,,,14054,,,,,,,,,,,,,,,,,,,2008-01-01,A,,,,,01.43Z,NAFRev2,N,-0.983135,48.894803,0.61,street,Lotissement du Bourg 14380 Beaumesnil,14054_tba20a,G,LOTISSEMENT DU BOURG,
414898684,00017,41489868400017,O,1989-12-31,NN,,,2008-01-04T22:56:05,true,3,,,,,LA MARE,14380,BEAUMESNIL,,,14054,,,,,,,,,,,,,,,,,,,2008-01-01,A,,,,,01.42Z,NAFRev2,N,2.9722697,50.5792295,0.89,poi.water,La mare (Eau) Santes,https://osm.org/way/405755412,G,,
415302728,00019,41530272800019,O,1998-01-15,NN,,,2018-06-06T04:22:31,true,3,,,,,VILLAGE LA LANGOTTIERE,14380,BEAUMESNIL,,,14054,,,,,,,,,,,,,,,,,,,2008-01-01,A,,,,,01.11Z,NAFRev2,N,,,0,,,,,,
421694878,00032,42169487800032,O,2005-06-28,NN,,,2010-05-31T15:20:46,true,4,CHEZ MME GALLOU CATHERINE,,,LD,LA LANDE,14380,BEAUMESNIL,,,14054,,,,,,,,,,,,,,,,,,,2008-12-31,F,,,,,85.59A,NAFRev2,O,-0.5060199,44.7464063,0.9,poi.island,Île de la Lande Quinsac,https://osm.org/way/4544508,G,,
422310565,00011,42231056500011,O,1999-02-01,,,,,true,1,,,,LD,LA GRANDE MARE,14380,BEAUMESNIL,,,14054,,,,,,,,,,,,,,,,,,,1999-12-31,F,,,,,01.3Z,NAF1993,N,0.9404862,48.9609297,0.9,poi.water,La Grande Mare (Eau) Conches-en-Ouche,https://osm.org/way/161471201,G,,
427869672,00019,42786967200019,O,1968-01-01,NN,,,2006-10-31T00:33:14,true,3,,,,,LA CROIX,14380,BEAUMESNIL,,,14054,,,,,,,,,,,,,,,,,,,2005-12-25,F,,,,,01.3Z,NAFRev1,N,-0.487814,47.4496935,0.9,poi.water,La Croix (Eau) Trélazé,https://osm.org/way/126093876,G,,
429303860,00010,42930386000010,O,2000-01-01,NN,,,2008-01-05T01:37:28,true,3,,,,,LA CROIX,14380,BEAUMESNIL,,,14054,,,,,,,,,,,,,,,,,,,2008-01-01,A,,,,,01.42Z,NAFRev2,N,-0.487814,47.4496935,0.9,poi.water,La Croix (Eau) Trélazé,https://osm.org/way/126093876,G,,
430936765,00014,43093676500014,O,1968-01-01,NN,,,2007-01-18T09:43:30,true,3,,,,,LA SAUTERIE,14380,BEAUMESNIL,,,14054,,,,,,,,,,,,,,,,,,,2001-12-31,F,,,,,01.3Z,NAF1993,N,2.9408697,45.9677017,0.89,poi.track,Chemin de la Sauterie Manzat,https://osm.org/way/126258216,G,,
433066511,00026,43306651100026,O,2016-02-01,,,,2021-02-23T13:14:28,true,1,,,,LD,VILLENEUVE,14380,BEAUMESNIL,,,14054,,,,,,,,,,,,,,,,,,,2016-02-01,A,LES GARDIENS DE L ARCTIQUE,,,,01.49Z,NAFRev2,N,4.8431022,46.0204831,0.9,poi.park,(Parc) Villeneuve,https://osm.org/way/198268802,G,,
441352077,00016,44135207700016,O,2002-04-02,NN,,,2014-07-08T02:21:55,false,5,,,,,LE HAMEL GOHIER,14380,BEAUMESNIL,,,14054,,,,,,,,,,,,,,,,,,,2010-08-01,F,,,,,43.21A,NAFRev2,O,-0.982785,48.900398,0.93,locality,Le Hamel Gohier 14380 Beaumesnil,14054_b139,G,LE HAMEL GOHIER,
453809949,00010,45380994900010,O,2004-06-01,,,,2020-01-22T04:14:57,true,4,LE HAMEL GOHIER,,,,,14380,BEAUMESNIL,,,14054,,,,,,,,,,,,,,,,,,,2019-12-11,F,,,,,01.41Z,NAFRev2,N,-0.982785,48.900398,0.93,locality,Le Hamel Gohier 14380 Beaumesnil,14054_b139,D,LE HAMEL GOHIER,
478407166,00014,47840716600014,O,2004-09-15,NN,,,2015-11-10T03:34:24,false,5,,,,LD,LA LANDE,14380,BEAUMESNIL,,,14054,,,,,,,,,,,,,,,,,,,2015-10-05,F,,,,INTER EUROP EXPANSION IEE I2E,70.22Z,NAFRev2,O,-0.5060199,44.7464063,0.9,poi.island,Île de la Lande Quinsac,https://osm.org/way/4544508,G,,
482737046,00011,48273704600011,O,2005-06-03,NN,,,2014-07-10T00:12:24,true,3,,,,,LES CHENES LA SAUTERIE,14380,BEAUMESNIL,,,14054,,,,,,,,,,,,,,,,,,,2009-07-31,F,,,,,43.12A,NAFRev2,O,,,0,,,,,,
484494026,00020,48449402600020,O,2010-12-28,,,,2018-06-30T03:36:03,false,2,,,,,LES PETITES MARES,14380,BEAUMESNIL,,,14054,,,,,,,,,,,,,,,,,,,2018-04-30,F,,,,,68.20B,NAFRev2,N,-0.947244,48.901346,0.91,street,Lieu Dit les Petites Mares 14380 Beaumesnil,14054_b213,G,LIEU DIT LES PETITES MARES,
495278020,00013,49527802000013,O,2007-04-05,01,2018,,2020-08-25T10:41:38,true,4,,,,,LA LONDE,14380,BEAUMESNIL,,,14054,,,,,,,,,,,,,,,,,,,2018-05-25,A,,,,,47.91B,NAFRev2,O,0.9539797,49.3065929,0.9,poi.park,(Parc) La Londe,https://osm.org/way/442037839,G,,
500365523,00017,50036552300017,O,2007-09-13,,,,2008-01-05T01:41:27,true,2,,,,,LA CROIX,14380,BEAUMESNIL,,,14054,,,,,,,,,,,,,,,,,,,2008-01-01,A,,,,,68.20B,NAFRev2,N,-0.487814,47.4496935,0.9,poi.water,La Croix (Eau) Trélazé,https://osm.org/way/126093876,G,,
500777271,00015,50077727100015,O,1978-07-07,,,,2008-01-05T01:50:42,true,2,MME MARIE DELPHINE,4,,,LES PETITES MARES,14380,BEAUMESNIL,,,14054,,,,,,,,,,,,,,,,,,,2008-01-01,A,,,,,94.99Z,NAFRev2,N,-0.947244,48.901346,0.91,street,Lieu Dit les Petites Mares 14380 Beaumesnil,14054_b213,G,LIEU DIT LES PETITES MARES,
502321789,00013,50232178900013,O,2007-09-17,,,,2008-01-31T14:38:37,true,1,LA FORGE,,,,,14380,BEAUMESNIL,,,14054,,,,,,,,,,,,,,,,,,,2007-09-17,A,,,,,68.20B,NAFRev2,N,,,0,,,,,,
510553514,00017,51055351400017,O,2009-02-01,NN,,4399CZ,2015-03-18T00:21:35,true,2,,,,,LE HAMEL BUREL,14380,BEAUMESNIL,,,14054,,,,,,,,,,,,,,,,,,,2012-03-31,A,,,,,43.99C,NAFRev2,N,-0.981239,48.890608,0.93,locality,Le Hamel Burel 14380 Beaumesnil,14054_b137,G,LE HAMEL BUREL,
511743601,00011,51174360100011,O,2009-04-06,,,,2013-08-26T08:16:28,true,2,,,,RTE,D'ANNEBECQ,14380,BEAUMESNIL,,,14054,,,,,,,,,,,,,,,,,,,2013-08-22,F,,,,,90.03B,NAFRev2,N,-0.264142,48.633638,0.71,poi.place_of_worship,(Lieu de culte) Saint-Georges-d'Annebecq,https://osm.org/way/243023687,G,,
532360864,00013,53236086400013,O,2011-05-01,,,,2012-02-10T09:37:42,false,2,,,,,LA GOUGEONNIERE,14380,BEAUMESNIL,,,14054,,,,,,,,,,,,,,,,,,,2011-12-31,F,,,,,01.50Z,NAFRev2,N,,,0,,,,,,
538474388,00013,53847438800013,O,2011-12-01,,,,2016-08-30T11:22:33,true,2,,,,,LA LANGOTTIERE,14380,BEAUMESNIL,,,14054,,,,,,,,,,,,,,,,,,,2016-06-30,F,,,,,01.41Z,NAFRev2,N,-0.1825959,47.5927911,0.71,poi.spring,lavoir des langottières (Source) Baugé-en-Anjou,https://osm.org/node/2006700461,G,,
780692224,00014,78069222400014,O,,,,,,true,1,,,,,,14380,BEAUMESNIL,,,14054,,,,,,,,,,,,,,,,,,,1984-12-25,F,,,,,55.71,NAP,N,,,0,,,,,,
780692232,00017,78069223200017,O,,NN,,,,true,1,,,,,,14380,BEAUMESNIL,,,14054,,,,,,,,,,,,,,,,,,,1988-03-01,F,,,,,41.07,NAP,N,,,0,,,,,,
780692240,00010,78069224000010,O,,NN,,,,true,1,,,,,,14380,BEAUMESNIL,,,14054,,,,,,,,,,,,,,,,,,,1987-10-29,F,,,,,41.02,NAP,N,,,0,,,,,,
780692265,00017,78069226500017,O,,,,,,true,1,,,,,,14380,BEAUMESNIL,,,14054,,,,,,,,,,,,,,,,,,,1984-12-25,F,,,,,67.02,NAP,N,,,0,,,,,,
795287085,00018,79528708500018,O,2013-09-12,,,,2013-11-15T09:12:07,false,2,,10,,RTE,AUX FORGES,14380,BEAUMESNIL,,,14054,,,,,,,,,,,,,,,,,,,2013-10-07,F,,,,,96.09Z,NAFRev2,N,,,0,,,,,,
815269436,00011,81526943600011,O,2014-01-17,,,,2017-04-12T08:29:46,true,2,,,,,LA GOUGEONNIERE,14380,BEAUMESNIL,,,14054,,,,,,,,,,,,,,,,,,,2015-09-30,F,,,,,47.99A,NAFRev2,N,,,0,,,,,,
819455312,00010,81945531200010,O,2016-04-25,,,1105ZZ,2017-05-31T04:49:19,false,2,,,,,LA FORGE,14380,BEAUMESNIL,,,14054,,,,,,,,,,,,,,,,,,,2017-06-01,F,,,,LA BRASSERIE DU BOCAGE,11.05Z,NAFRev2,N,-3.283489,48.0883275,0.9,poi.bar,Bar la Forge Ploërdut,https://osm.org/way/296629848,G,,
823409271,00017,82340927100017,O,2016-10-26,,,,2018-04-05T19:33:47,true,1,,,,,LA PAUMERIE,14380,BEAUMESNIL,,,14054,,,,,,,,,,,,,,,,,,,2016-10-26,F,,,,,47.81Z,NAFRev2,N,-0.967145,48.890724,0.91,locality,La Petite Paumerie 14380 Beaumesnil,14054_b204,G,LA PETITE PAUMERIE,
827943986,00014,82794398600014,O,2016-10-17,,,4399CZ,2017-02-26T04:43:31,true,1,,,,,LD LA VAIGNERIE,14380,BEAUMESNIL,,,14054,,,,,,,,,,,,,,,,,,,2016-10-17,A,,,,,43.99C,NAFRev2,N,-0.959567,48.896535,0.79,locality,La Vai Gnerie 14380 Beaumesnil,14054_b293,G,LA VAI GNERIE,
830454633,00017,83045463300017,O,2017-06-22,,,5610CQ,2017-06-23T08:26:06,true,1,,,,,LA LANDE,14380,BEAUMESNIL,,,14054,,,,,,,,,,,,,,,,,,,2017-06-22,A,,,,LA ROTISSERIE DU COCHON DE LAIT,47.81Z,NAFRev2,N,-0.5060199,44.7464063,0.9,poi.island,Île de la Lande Quinsac,https://osm.org/way/4544508,G,,
834193740,00018,83419374000018,O,2017-12-15,,,,2020-03-06T19:33:23,false,2,,,,,LES PETITES MARES,14380,BEAUMESNIL,,,14054,,,,,,,,,,,,,,,,,,,2020-02-21,F,,,,,68.20B,NAFRev2,N,-0.947244,48.901346,0.91,street,Lieu Dit les Petites Mares 14380 Beaumesnil,14054_b213,G,LIEU DIT LES PETITES MARES,
843081175,00013,84308117500013,O,2018-08-11,,,,2018-10-15T10:09:27,true,1,,,,,LE PLANT,14380,BEAUMESNIL,,,14054,,,,,,,,,,,,,,,,,,,2018-08-11,A,,,,LES SAPINS,55.20Z,NAFRev2,N,-0.8853537,48.6466844,0.89,poi.meadow,Le Plant (Prairie) Saint-Clément-Rancoudray,https://osm.org/way/293866864,G,,
843618745,00015,84361874500015,O,2018-10-16,,,,2018-11-06T10:51:18,true,1,,4,,LOT,DU BOURG,14380,BEAUMESNIL,,,14054,,,,,,,,,,,,,,,,,,,2018-10-16,A,,,,,94.99Z,NAFRev2,N,-0.983269,48.895113,0.86,housenumber,4 Lotissement du Bourg 14380 Beaumesnil,14054_tba20a_00004,G,4 LOTISSEMENT DU BOURG,
849830567,00012,84983056700012,O,2019-04-01,,,,2019-04-09T09:18:12,true,1,,,,,LIEU DIT LA LANGOTIERE ,14380,BEAUMESNIL,,,14054,,,,,,,,,,,,,,,,,,,2019-04-01,A,,,,,68.20B,NAFRev2,N,,,0,,,,,,
849965538,00010,84996553800010,O,2019-04-07,,,,2019-06-03T03:32:58,true,2,,,,,LIEU DIT VILLENEUVE,14380,BEAUMESNIL,,,14054,,,,,,,,,,,,,,,,,,,2019-05-29,F,,,,,47.99A,NAFRev2,N,4.8431022,46.0204831,0.9,poi.park,(Parc) Villeneuve,https://osm.org/way/198268802,G,,
850249558,00014,85024955800014,O,2019-03-27,,,,2019-07-25T19:33:46,true,2,,,,,LE HAMEL GUILBERT ,14380,BEAUMESNIL,,,14054,,,,,,,,,,,,,,,,,,,2019-06-28,F,,,,,68.20B,NAFRev2,N,-0.964868,48.895567,0.93,locality,Le Hamel Guilbert 14380 Beaumesnil,14054_b140,G,LE HAMEL GUILBERT,
851108258,00019,85110825800019,O,2019-04-22,,,,2019-07-08T09:03:11,true,1,,,,LD,LE PLANT BEAUMESNIL,14380,BEAUMESNIL,,,14054,,,,,,,,,,,,,,,,,,,2019-04-22,A,,,,TELFORD CLEANING,96.09Z,NAFRev2,N,,,0,,,,,,
887724482,00013,88772448200013,O,2020-07-23,,,,2020-08-01T03:51:32,true,1,,,,,LAUNAY ,14380,BEAUMESNIL,,,14054,,,,,,,,,,,,,,,,,,,2020-07-23,A,,,,,68.20B,NAFRev2,N,0.7289654,49.1140532,0.89,poi,(Pont) Launay,https://osm.org/way/201387533,G,,
946071859,00015,94607185900015,O,,,,,,true,1,,,,,,14380,BEAUMESNIL,,,14054,,,,,,,,,,,,,,,,,,,1984-12-25,F,,,,,48.01,NAP,N,,,0,,,,,,
950645416,00013,95064541600013,O,1989-10-02,NN,,1103ZZ,2015-04-03T13:21:16,false,5,,,,LD,LA LANDE,14380,BEAUMESNIL,,,14054,,,,,,,,,,,,,,,,,,,2008-01-01,A,,,,,11.03Z,NAFRev2,N,-0.5060199,44.7464063,0.9,poi.island,Île de la Lande Quinsac,https://osm.org/way/4544508,G,,
950645416,00021,95064541600021,O,2006-01-05,,,,2021-02-23T18:21:02,true,3,,,,,LA LANDE,14380,BEAUMESNIL,,,14054,,,,,,,,,,,,,,,,,,,2016-01-01,A,,,,,01.42Z,NAFRev2,N,-0.5060199,44.7464063,0.9,poi.island,Île de la Lande Quinsac,https://osm.org/way/4544508,G,,
950645416,00039,95064541600039,O,2006-01-05,,,,2009-01-22T15:20:27,false,2,,,,,LA LANDE,14380,BEAUMESNIL,,,14054,,,,,,,,,,,,,,,,,,,2008-01-01,F,,,,,01.50Z,NAFRev2,N,-0.5060199,44.7464063,0.9,poi.island,Île de la Lande Quinsac,https://osm.org/way/4544508,G,,
