siren,nic,siret,statutDiffusionEtablissement,dateCreationEtablissement,trancheEffectifsEtablissement,anneeEffectifsEtablissement,activitePrincipaleRegistreMetiersEtablissement,dateDernierTraitementEtablissement,etablissementSiege,nombrePeriodesEtablissement,complementAdresseEtablissement,numeroVoieEtablissement,indiceRepetitionEtablissement,typeVoieEtablissement,libelleVoieEtablissement,codePostalEtablissement,libelleCommuneEtablissement,libelleCommuneEtrangerEtablissement,distributionSpecialeEtablissement,codeCommuneEtablissement,codeCedexEtablissement,libelleCedexEtablissement,codePaysEtrangerEtablissement,libellePaysEtrangerEtablissement,complementAdresse2Etablissement,numeroVoie2Etablissement,indiceRepetition2Etablissement,typeVoie2Etablissement,libelleVoie2Etablissement,codePostal2Etablissement,libelleCommune2Etablissement,libelleCommuneEtranger2Etablissement,distributionSpeciale2Etablissement,codeCommune2Etablissement,codeCedex2Etablissement,libelleCedex2Etablissement,codePaysEtranger2Etablissement,libellePaysEtranger2Etablissement,dateDebut,etatAdministratifEtablissement,enseigne1Etablissement,enseigne2Etablissement,enseigne3Etablissement,denominationUsuelleEtablissement,activitePrincipaleEtablissement,nomenclatureActivitePrincipaleEtablissement,caractereEmployeurEtablissement,longitude,latitude,geo_score,geo_type,geo_adresse,geo_id,geo_ligne,geo_l4,geo_l5
212702286,00015,21270228600015,O,1983-03-01,01,2018,,2020-08-25T10:16:28,true,3,,,,,,27350,ETURQUERAYE,,,27228,,,,,,,,,,,,,,,,,,,2008-01-01,A,MAIRIE,,,,84.11Z,NAFRev2,N,,,0,,,,,,
262704885,00017,26270488500017,O,1995-12-25,NN,,,2008-01-04T18:57:24,true,2,MAIRIE,,,,,27350,ETURQUERAYE,,,27228,,,,,,,,,,,,,,,,,,,2008-01-01,A,CCAS,,,,88.99B,NAFRev2,N,,,0,,,,,,
307054593,00024,30705459300024,O,1982-08-16,NN,,,2008-11-07T00:22:39,true,4,,,,,VIENNE,27350,ETURQUERAYE,,,27228,,,,,,,,,,,,,,,,,,,2003-12-31,F,,,,,45.2K,NAFRev1,N,0.67949,49.377439,0.93,street,Vienne 27350 Éturqueraye,27228_psy775,G,VIENNE,
321085425,00023,32108542500023,O,1985-10-01,NN,,,2008-11-07T00:37:12,false,4,,,,HAM,LES BORDEAUX,27350,ETURQUERAYE,,,27228,,,,,,,,,,,,,,,,,,,2006-08-01,F,,,,,60.2L,NAFRev1,N,0.70046,49.364401,0.78,street,Rue des Bordeaux 27350 Éturqueraye,27228_0040,G,RUE DES BORDEAUX,
321606576,00015,32160657600015,O,,NN,,,,true,1,,,,,,27350,ETURQUERAYE,,,27228,,,,,,,,,,,,,,,,,,,,F,,,,,21.11,NAP,N,,,0,,,,,,
324952688,00020,32495268800020,O,1999-08-01,NN,,,,true,1,,,,,,27350,ETURQUERAYE,,,27228,,,,,,,,,,,,,,,,,,,2000-06-01,F,,,,,70.2C,NAF1993,N,,,0,,,,,,
326224193,00028,32622419300028,O,2017-07-29,,,,2021-02-23T10:48:21,true,1,,244,,RUE,D'AMFREVILLE,27350,ETURQUERAYE,,,27228,,,,,,,,,,,,,,,,,,,2017-07-29,A,,,,,68.20B,NAFRev2,N,0.696133,49.374915,0.93,housenumber,244 Rue d'Amfreville 27350 Éturqueraye,27228_0010_00244,G,244 RUE D AMFREVILLE,
327003083,00018,32700308300018,O,1983-02-01,NN,,,2008-11-07T00:44:28,false,4,,,,,,27350,ETURQUERAYE,,,27228,,,,,,,,,,,,,,,,,,,1997-11-01,F,,,,,50.1Z,NAF1993,O,,,0,,,,,,
327187597,00015,32718759700015,O,,NN,,,,true,1,,,,,,27350,ETURQUERAYE,,,27228,,,,,,,,,,,,,,,,,,,,F,,,,,66.04,NAP,N,,,0,,,,,,
330932450,00019,33093245000019,O,,NN,,,,true,1,,,,,,27350,ETURQUERAYE,,,27228,,,,,,,,,,,,,,,,,,,,F,,,,,56.01,NAP,N,,,0,,,,,,
332722446,00041,33272244600041,O,2012-10-01,,,,2021-02-23T10:52:24,true,1,,387,,RUE,DES EPIVENTS,27350,ETURQUERAYE,,,27228,,,,,,,,,,,,,,,,,,,2012-10-01,A,,,,,82.11Z,NAFRev2,N,0.684688,49.363555,0.93,housenumber,387 Rue des Epivents 27350 Éturqueraye,27228_0140_00387,G,387 RUE DES EPIVENTS,
333469203,00017,33346920300017,O,,NN,,,,true,1,,,,,,27350,ETURQUERAYE,,,27228,,,,,,,,,,,,,,,,,,,,F,,,,,64.11,NAP,N,,,0,,,,,,
335222667,00024,33522266700024,O,1990-06-01,NN,,,2014-07-08T00:40:57,true,4,,,,HAM,LES EPIVENTS,27350,ETURQUERAYE,,,27228,,,,,,,,,,,,,,,,,,,2009-05-31,F,,,,,43.21A,NAFRev2,N,0.684615,49.366355,0.78,street,Rue des Epivents 27350 Éturqueraye,27228_0140,G,RUE DES EPIVENTS,
347692451,00037,34769245100037,O,2014-06-18,,,,2017-04-10T09:24:05,false,2,,77,,RTE,DE BRUMARE,27350,ETURQUERAYE,,,27228,,,,,,,,,,,,,,,,,,,2015-12-30,F,,,,,47.99A,NAFRev2,N,0.698776,49.357907,0.83,housenumber,77 Route de Brumare 27350 Éturqueraye,27228_0060_00077,G,77 ROUTE DE BRUMARE,
379903248,00027,37990324800027,O,2004-04-01,,,,2020-11-27T08:47:52,true,4,,,,,LES GRIS,27350,ETURQUERAYE,,,27228,,,,,,,,,,,,,,,,,,,2020-12-26,F,,,,,85.52Z,NAFRev2,N,0.681593,49.374234,0.93,street,Les Gris 27350 Éturqueraye,27228_axskau,G,LES GRIS,
385034921,00010,38503492100010,O,1900-01-01,NN,,,2011-04-28T00:51:24,false,3,,,,,FERME DE VIENNE,27350,ETURQUERAYE,,,27228,,,,,,,,,,,,,,,,,,,1996-04-30,F,,,,,01.2A,NAF1993,N,4.8616318,49.1516368,0.89,poi.farmyard,Ferme de la Noue (Corps de ferme) Vienne-la-Ville,https://osm.org/way/534205923,G,,
385034921,00028,38503492100028,O,2005-03-01,NN,,,2021-02-23T11:13:09,true,2,FERME DE VIENNE,,,,,27350,ETURQUERAYE,,,27228,,,,,,,,,,,,,,,,,,,2008-01-01,A,,,,,01.11Z,NAFRev2,N,,,0,,,,,,
387070063,00012,38707006300012,O,,NN,,,,true,1,,,,PL,DE L EGLISE,27350,ETURQUERAYE,,,27228,,,,,,,,,,,,,,,,,,,1988-04-01,F,,,,,67.07,NAP,N,0.694445,49.369613,0.81,street,Place de l'Église 27350 Éturqueraye,27228_0120,G,PLACE DE L EGLISE,
387270150,00015,38727015000015,O,,NN,,,,true,1,,,,,,27350,ETURQUERAYE,,,27228,,,,,,,,,,,,,,,,,,,,F,,,,,01.00,NAP,N,,,0,,,,,,
387853971,00019,38785397100019,O,1992-07-20,NN,,,2006-11-25T11:50:36,true,3,,,,HAM,LES BEAUDOIN,27350,ETURQUERAYE,,,27228,,,,,,,,,,,,,,,,,,,2004-12-31,F,,,,,60.2M,NAFRev1,N,0.686499,49.360482,0.71,street,Rue des Beaudoins 27350 Éturqueraye,27228_0020,G,RUE DES BEAUDOINS,
392368437,00019,39236843700019,O,1984-10-01,NN,,,2008-01-05T00:04:05,true,3,,,,,LES BEAUDOINS,27350,ETURQUERAYE,,,27228,,,,,,,,,,,,,,,,,,,2008-01-01,A,,,,,01.11Z,NAFRev2,N,0.686499,49.360482,0.79,street,Rue des Beaudoins 27350 Éturqueraye,27228_0020,G,RUE DES BEAUDOINS,
392407292,00011,39240729200011,O,1976-11-01,NN,,,2008-01-05T00:04:30,true,4,,,,,,27350,ETURQUERAYE,,,27228,,,,,,,,,,,,,,,,,,,2008-01-01,A,,,,,68.20B,NAFRev2,N,,,0,,,,,,
392407409,00011,39240740900011,O,1985-01-01,NN,,,2007-01-18T09:34:18,true,3,,,,,,27350,ETURQUERAYE,,,27228,,,,,,,,,,,,,,,,,,,2005-12-25,F,,,,,01.1A,NAFRev1,N,,,0,,,,,,
392407482,00018,39240748200018,O,1978-10-01,NN,,,2008-01-05T00:04:30,true,3,,,,,LES DESCHAMPS,27350,ETURQUERAYE,,,27228,,,,,,,,,,,,,,,,,,,2008-01-01,A,,,,,01.41Z,NAFRev2,N,0.708551,49.379315,0.93,street,Les Deschamps 27350 Éturqueraye,27228_aa5sxe,G,LES DESCHAMPS,
392408118,00017,39240811800017,O,1982-01-01,NN,,,2006-10-28T01:51:56,true,3,,,,,,27350,ETURQUERAYE,,,27228,,,,,,,,,,,,,,,,,,,2006-08-01,F,,,,,01.1A,NAFRev1,N,,,0,,,,,,
392418331,00014,39241833100014,O,1984-01-01,NN,,,,true,4,,,,,LES CHIONS,27350,ETURQUERAYE,,,27228,,,,,,,,,,,,,,,,,,,2003-09-30,F,,,,,01.2A,NAFRev1,N,0.705895,49.372733,0.93,street,Les Chions 27350 Éturqueraye,27228_d435bo,G,LES CHIONS,
393932066,00011,39393206600011,O,1994-01-01,NN,,,2007-01-18T09:35:18,true,3,,,,,,27350,ETURQUERAYE,,,27228,,,,,,,,,,,,,,,,,,,1998-12-25,F,,,,,01.3Z,NAF1993,N,,,0,,,,,,
407918853,00018,40791885300018,O,,NN,,,,true,1,,,,,,27350,ETURQUERAYE,,,27228,,,,,,,,,,,,,,,,,,,1996-12-31,F,,,,,01.1A,NAF1993,N,,,0,,,,,,
408310555,00011,40831055500011,O,1995-01-01,NN,,,2012-07-28T15:00:09,true,4,,,,,,27350,ETURQUERAYE,,,27228,,,,,,,,,,,,,,,,,,,2011-12-25,F,,,,,01.42Z,NAFRev2,N,,,0,,,,,,
411008469,00016,41100846900016,O,1997-02-10,NN,,,2017-06-07T03:51:37,true,4,LES BEAUDOINS,,,,,27350,ETURQUERAYE,,,27228,,,,,,,,,,,,,,,,,,,2016-02-29,F,,,,,01.11Z,NAFRev2,N,0.686499,49.360482,0.79,street,Rue des Beaudoins 27350 Éturqueraye,27228_0020,D,RUE DES BEAUDOINS,
421435959,00026,42143595900026,O,2008-03-26,,,,2021-02-23T11:42:45,false,1,,,,,LES BEAUDOUINS,27350,ETURQUERAYE,,,27228,,,,,,,,,,,,,,,,,,,2008-03-26,A,,,,,90.03A,NAFRev2,N,,,0,,,,,,
425041910,00018,42504191000018,O,1999-09-15,NN,,4520AB,2015-03-17T00:57:58,true,4,,,,,LES FEVES,27350,ETURQUERAYE,,,27228,,,,,,,,,,,,,,,,,,,2000-11-24,F,,,,,50.1Z,NAF1993,O,0.702542,49.369138,0.93,street,Les Fèves 27350 Éturqueraye,27228_1bvtrz,G,LES FEVES,
428608756,00014,42860875600014,O,1999-09-15,,,,2006-11-25T16:43:27,true,1,,,,,LES FEVES,27350,ETURQUERAYE,,,27228,,,,,,,,,,,,,,,,,,,2000-11-24,F,,,,,74.1J,NAF1993,N,0.702542,49.369138,0.93,street,Les Fèves 27350 Éturqueraye,27228_1bvtrz,G,LES FEVES,
430942961,00011,43094296100011,O,1971-01-01,NN,,,2008-01-05T01:57:32,true,3,,,,,L EGLISE,27350,ETURQUERAYE,,,27228,,,,,,,,,,,,,,,,,,,2008-01-01,A,,,,,01.11Z,NAFRev2,N,0.694636,49.369711,0.91,street,Rue de l'Église 27350 Éturqueraye,27228_0130,G,RUE DE L EGLISE,
432206324,00027,43220632400027,O,2020-02-01,,,4321AB,2021-02-23T13:13:20,true,1,,628,,RUE,DES EPIVENTS,27350,ETURQUERAYE,,,27228,,,,,,,,,,,,,,,,,,,2020-02-01,A,,,,DELEC,43.21A,NAFRev2,N,0.684309,49.361356,0.93,housenumber,628 Rue des Epivents 27350 Éturqueraye,27228_0140_00628,G,628 RUE DES EPIVENTS,
434027496,00018,43402749600018,O,2001-01-08,NN,,4321AA,2020-01-25T03:49:37,true,4,,,,,LES BEAUDOUINS,27350,ETURQUERAYE,,,27228,,,,,,,,,,,,,,,,,,,2019-12-31,F,,,,,43.21A,NAFRev2,N,,,0,,,,,,
434713509,00017,43471350900017,O,2001-02-20,01,2018,,2020-08-25T10:23:16,true,3,,,,HAM,AMFREVILLE,27350,ETURQUERAYE,,,27228,,,,,,,,,,,,,,,,,,,2008-01-01,A,,,,,01.50Z,NAFRev2,N,0.696175,49.374191,0.93,street,Amfreville 27350 Éturqueraye,27228_050e2t,G,AMFREVILLE,
442169827,00015,44216982700015,O,2002-06-01,NN,,,2008-11-08T02:15:26,false,3,,,,,LE BOURG,27350,ETURQUERAYE,,,27228,,,,,,,,,,,,,,,,,,,2006-01-01,F,,,,,45.2J,NAFRev1,O,2.212915,47.9910304,0.9,poi.bar,Le Bourg (Bar) Ingrannes,https://osm.org/node/1718543174,G,,
442885497,00010,44288549700010,O,2002-07-19,NN,,,2019-10-03T14:00:11,false,4,,,,,LEZS BEAUDOINS,27350,ETURQUERAYE,,,27228,,,,,,,,,,,,,,,,,,,2019-06-01,F,,,,,68.20A,NAFRev2,N,,,0,,,,,,
483387809,00013,48338780900013,O,2005-09-01,,,,2008-01-05T01:08:09,true,2,CLOS DES CHAUMIERES,,,,LES EPIVENTS,27350,ETURQUERAYE,,,27228,,,,,,,,,,,,,,,,,,,2008-01-01,A,,,,,46.19B,NAFRev2,N,0.684615,49.366355,0.78,street,Rue des Epivents 27350 Éturqueraye,27228_0140,G,RUE DES EPIVENTS,
491093167,00014,49109316700014,O,2006-08-01,,,,2009-11-05T04:45:46,true,3,,,,RTE,NATIONALE,27350,ETURQUERAYE,,,27228,,,,,,,,,,,,,,,,,,,2009-09-30,F,,,,,01.11Z,NAFRev2,N,1.2279812,49.230352,0.77,poi,Route Nationale (Pont) Saint-Pierre-du-Vauvray,https://osm.org/way/95838375,G,,
498378934,00018,49837893400018,O,2007-05-25,00,2018,4332AA,2020-08-25T10:42:53,true,3,,,,,LES BORDEAUX,27350,ETURQUERAYE,,,27228,,,,,,,,,,,,,,,,,,,2008-01-01,A,,,,,43.32A,NAFRev2,O,0.70046,49.364401,0.78,street,Rue des Bordeaux 27350 Éturqueraye,27228_0040,G,RUE DES BORDEAUX,
502985740,00013,50298574000013,O,2008-04-01,,,,2019-10-29T19:32:55,true,3,,80,,RTE,DE BRUMARE,27350,ETURQUERAYE,,,27228,,,,,,,,,,,,,,,,,,,2019-10-31,F,,,,,47.89Z,NAFRev2,N,0.697703,49.357964,0.83,housenumber,80 Route de Brumare 27350 Éturqueraye,27228_0060_00080,G,80 ROUTE DE BRUMARE,
514808690,00010,51480869000010,O,2009-10-01,,,4334ZC,2021-02-08T14:10:17,true,6,,515,,RUE,DES MARES,27350,ETURQUERAYE,,,27228,,,,,,,,,,,,,,,,,,,2021-02-05,A,AUTHENTIQUE RENOVATION,,,AUTHENTIQUE RENOVATION,41.20B,NAFRev2,N,0.688319,49.367335,0.93,housenumber,515 Rue des Mares 27350 Éturqueraye,27228_0190_00515,G,515 RUE DES MARES,
515116903,00011,51511690300011,O,2009-09-17,,,,2009-09-29T09:32:56,true,1,,1223,,RTE,DE ROUEN,27350,ETURQUERAYE,,,27228,,,,,,,,,,,,,,,,,,,2009-09-17,A,,,,,68.20B,NAFRev2,N,0.684262,49.35756,0.84,housenumber,1223 Route de Rouen 27350 Éturqueraye,27228_0220_01223,G,1223 ROUTE DE ROUEN,
517830600,00014,51783060000014,O,2009-11-05,,,,2021-02-23T15:28:38,true,5,,236,,IMP,LES GRIS,27350,ETURQUERAYE,,,27228,,,,,,,,,,,,,,,,,,,2020-12-10,A,,,,,86.90E,NAFRev2,N,,,0,,,,,,
518425350,00015,51842535000015,O,2009-11-10,,,,2012-11-10T01:31:34,false,2,,271,,,DE PONT-AUDEMER,27350,ETURQUERAYE,,,27228,,,,,,,,,,,,,,,,,,,2010-11-23,F,,,,,47.81Z,NAFRev2,N,0.509499,49.3552823,0.9,poi.park,Parc de Pont-Audemer Pont-Audemer,https://osm.org/way/580953805,G,,
518425350,00023,51842535000023,O,2010-11-23,,,,2019-08-12T11:02:42,true,2,,271,,RTE,DE ROUEN,27350,ETURQUERAYE,,,27228,,,,,,,,,,,,,,,,,,,2012-12-31,F,,,,,47.81Z,NAFRev2,N,0.696616,49.358381,0.83,housenumber,271 Route de Rouen 27350 Éturqueraye,27228_0220_00271,G,271 ROUTE DE ROUEN,
518512090,00011,51851209000011,O,2009-12-08,,,,2015-07-02T03:26:30,true,2,,815,,RUE,DES FEVES,27350,ETURQUERAYE,,,27228,,,,,,,,,,,,,,,,,,,2012-02-20,F,,,,,46.19B,NAFRev2,N,0.702886,49.368252,0.93,housenumber,815 Rue des Fèves 27350 Éturqueraye,27228_0160_00815,G,815 RUE DES FEVES,
523295384,00011,52329538400011,O,2010-06-21,,,,2012-11-10T02:16:19,true,2,,112,,RUE,DES FEVES,27350,ETURQUERAYE,,,27228,,,,,,,,,,,,,,,,,,,2011-09-14,F,,,,,86.90F,NAFRev2,N,0.696617,49.369888,0.93,housenumber,112 Rue des Fèves 27350 Éturqueraye,27228_0160_00112,G,112 RUE DES FEVES,
523592277,00017,52359227700017,O,2010-07-01,,,,2018-04-04T03:49:48,true,1,,244,,RUE,D'AMFREVILLE,27350,ETURQUERAYE,,,27228,,,,,,,,,,,,,,,,,,,2010-07-01,A,,,,,68.20B,NAFRev2,N,0.696133,49.374915,0.93,housenumber,244 Rue d'Amfreville 27350 Éturqueraye,27228_0010_00244,G,244 RUE D AMFREVILLE,
524818200,00015,52481820000015,O,2010-10-01,,,,2016-01-08T09:59:23,false,2,,97,,IMP,DES GRIS,27350,ETURQUERAYE,,,27228,,,,,,,,,,,,,,,,,,,2013-09-24,F,,,,,71.20A,NAFRev2,N,,,0,,,,,,
535163406,00023,53516340600023,O,2012-07-01,NN,,,2021-02-23T15:57:19,true,1,,112,,,RUE DES FEVES,27350,ETURQUERAYE,,,27228,,,,,,,,,,,,,,,,,,,2012-07-01,A,,,,,94.99Z,NAFRev2,O,0.696617,49.369888,0.93,housenumber,112 Rue des Fèves 27350 Éturqueraye,27228_0160_00112,G,112 RUE DES FEVES,
538692294,00019,53869229400019,O,2012-01-09,,,,2021-02-08T12:17:24,true,2,,451,,RUE,DES MARES,27350,ETURQUERAYE,,,27228,,,,,,,,,,,,,,,,,,,2013-03-05,F,BATICE CONSTRUCTION,,,BATICE CONSTRUCTION,43.99C,NAFRev2,N,0.688777,49.367322,0.93,housenumber,451 Rue des Mares 27350 Éturqueraye,27228_0190_00451,G,451 RUE DES MARES,
750701047,00011,75070104700011,O,2012-04-01,,,,2017-12-27T11:35:34,false,2,,329,,RUE,DES MARES,27350,ETURQUERAYE,,,27228,,,,,,,,,,,,,,,,,,,2017-11-01,F,,,,,72.19Z,NAFRev2,N,0.689892,49.367874,0.93,housenumber,329 Rue des Mares 27350 Éturqueraye,27228_0190_00329,G,329 RUE DES MARES,
753251958,00017,75325195800017,O,2012-09-01,,,,2014-05-14T12:23:39,true,2,,,,,LIEU DIT LES BEAUDOINS,27350,ETURQUERAYE,,,27228,,,,,,,,,,,,,,,,,,,2014-01-01,F,,,,,10.71C,NAFRev2,N,0.686499,49.360482,0.79,street,Rue des Beaudoins 27350 Éturqueraye,27228_0020,G,RUE DES BEAUDOINS,
789130044,00017,78913004400017,O,2012-11-01,,,,2018-11-22T14:06:11,false,2,LA VIERGE BLANCHE,1205,,RUE,DES BAUDOINS,27350,ETURQUERAYE,,,27228,,,,,,,,,,,,,,,,,,,2018-11-15,F,,,,,70.21Z,NAFRev2,N,0.68621,49.359561,0.85,housenumber,1205 Rue des Beaudoins 27350 Éturqueraye,27228_0020_01205,G,1205 RUE DES BEAUDOINS,
792311326,00013,79231132600013,O,2013-04-01,,,,2018-04-04T03:49:48,true,1,,244,,RUE,D'AMFREVILLE,27350,ETURQUERAYE,,,27228,,,,,,,,,,,,,,,,,,,2013-04-01,A,,,,,68.20B,NAFRev2,N,0.696133,49.374915,0.93,housenumber,244 Rue d'Amfreville 27350 Éturqueraye,27228_0010_00244,G,244 RUE D AMFREVILLE,
801956327,00010,80195632700010,O,2014-05-02,,,,2014-04-28T12:12:23,true,1,,249,,IMP,DES BORDEAUX,27350,ETURQUERAYE,,,27228,,,,,,,,,,,,,,,,,,,2014-05-02,A,,,,,68.20B,NAFRev2,N,0.700378,49.362578,0.71,housenumber,249 Rue des Bordeaux 27350 Éturqueraye,27228_0040_00249,G,249 RUE DES BORDEAUX,
802264572,00016,80226457200016,O,2014-05-05,,,,2019-06-14T14:31:59,false,1,,179,,HAM,LES BORDEAUX,27350,ETURQUERAYE,,,27228,,,,,,,,,,,,,,,,,,,2014-05-05,F,,,,,81.21Z,NAFRev2,N,0.700408,49.363403,0.77,housenumber,179 Rue des Bordeaux 27350 Éturqueraye,27228_0040_00179,G,179 RUE DES BORDEAUX,
803682822,00017,80368282200017,O,2014-07-07,,,,2018-09-21T04:26:36,false,4,,1030,,RTE,DE ROUEN,27350,ETURQUERAYE,,,27228,,,,,,,,,,,,,,,,,,,2018-10-01,F,,,,,86.90E,NAFRev2,N,0.686778,49.359384,0.84,housenumber,1030 Route de Rouen 27350 Éturqueraye,27228_0220_01030,G,1030 ROUTE DE ROUEN,
804113660,00018,80411366000018,O,1989-02-20,,,,2014-08-19T17:05:33,true,1,,,,,MAIRIE,27350,ETURQUERAYE,,,27228,,,,,,,,,,,,,,,,,,,1989-02-20,A,,,,,94.99Z,NAFRev2,N,3.0709671,50.6304695,0.92,poi.townhall,Hôtel de Ville Lille,https://osm.org/way/40917078,G,,
807879549,00010,80787954900010,O,1980-12-24,,,,2014-11-20T11:19:28,true,1,MAIRIE,,,,,27350,ETURQUERAYE,,,27228,,,,,,,,,,,,,,,,,,,1980-12-24,A,,,,,94.99Z,NAFRev2,N,,,0,,,,,,
808557201,00015,80855720100015,O,1979-06-05,,,,2014-12-22T15:19:08,true,1,MAIRIE,,,,,27350,ETURQUERAYE,,,27228,,,,,,,,,,,,,,,,,,,1979-06-05,A,,,,,94.91Z,NAFRev2,N,,,0,,,,,,
808748404,00015,80874840400015,O,2015-01-01,,,,2015-10-07T04:26:39,true,1,,244,,RUE,D'AMREVILLE,27350,ETURQUERAYE,,,27228,,,,,,,,,,,,,,,,,,,2015-01-01,A,,,,,71.11Z,NAFRev2,N,0.696133,49.374915,0.84,housenumber,244 Rue d'Amfreville 27350 Éturqueraye,27228_0010_00244,G,244 RUE D AMFREVILLE,
811160779,00013,81116077900013,O,2015-03-20,,,,2019-09-27T14:00:34,true,2,,496,,RUE,DES EPIVENTS,27350,ETURQUERAYE,,,27228,,,,,,,,,,,,,,,,,,,2015-03-20,F,,,,,47.99A,NAFRev2,N,0.683769,49.362786,0.93,housenumber,496 Rue des Epivents 27350 Éturqueraye,27228_0140_00496,G,496 RUE DES EPIVENTS,
814548020,00019,81454802000019,O,2015-11-09,01,2018,,2020-08-25T11:23:12,true,2,,244,,RUE,D'AMFREVILLE,27350,ETURQUERAYE,,,27228,,,,,,,,,,,,,,,,,,,2018-08-01,A,,,,SICERA,47.25Z,NAFRev2,O,0.696133,49.374915,0.93,housenumber,244 Rue d'Amfreville 27350 Éturqueraye,27228_0010_00244,G,244 RUE D AMFREVILLE,
815131321,00011,81513132100011,O,2016-01-02,,,9602AB,2015-12-09T03:52:22,true,1,,415,,,LES MARES,27350,ETURQUERAYE,,,27228,,,,,,,,,,,,,,,,,,,2016-01-02,A,ANNABELLE COIFFURE DOMICILE,,,,96.02A,NAFRev2,N,0.689566,49.36749,0.71,housenumber,415 Rue des Mares 27350 Éturqueraye,27228_0190_00415,G,415 RUE DES MARES,
831102439,00013,83110243900013,O,2017-01-01,01,2018,,2020-08-25T11:37:05,false,3,,244,,RUE,D'AMFREVILLE,27350,ETURQUERAYE,,,27228,,,,,,,,,,,,,,,,,,,2019-04-01,F,,,,NUANCES ARCHICTURE ET PAYSAGE,71.11Z,NAFRev2,O,0.696133,49.374915,0.93,housenumber,244 Rue d'Amfreville 27350 Éturqueraye,27228_0010_00244,G,244 RUE D AMFREVILLE,
831428313,00017,83142831300017,O,2017-08-09,,,,2017-08-10T11:42:27,true,1,,244,,RUE,D'AMFREVILLE,27350,ETURQUERAYE,,,27228,,,,,,,,,,,,,,,,,,,2017-08-09,A,,,,,68.20B,NAFRev2,N,0.696133,49.374915,0.93,housenumber,244 Rue d'Amfreville 27350 Éturqueraye,27228_0010_00244,G,244 RUE D AMFREVILLE,
834856643,00012,83485664300012,O,2018-01-15,,,,2018-03-12T14:33:13,true,1,,2,,RTE,DE ROUEN,27350,ETURQUERAYE,,,27228,,,,,,,,,,,,,,,,,,,2018-01-15,A,,,,SALENZARA,47.71Z,NAFRev2,N,0.700593,49.358838,0.82,housenumber,2 Route de Rouen 27350 Éturqueraye,27228_0220_00002,G,2 ROUTE DE ROUEN,
840776660,00010,84077666000010,O,2018-06-17,,,4399CZ,2018-07-02T19:32:33,true,1,,1114,,RUE,DES BEAUDOINS,27350,ETURQUERAYE,,,27228,,,,,,,,,,,,,,,,,,,2018-06-17,A,,,,M&S,43.99C,NAFRev2,N,0.685201,49.360019,0.93,housenumber,1114 Rue des Beaudoins 27350 Éturqueraye,27228_0020_01114,G,1114 RUE DES BEAUDOINS,
841477144,00015,84147714400015,O,2018-06-25,,,,2018-08-01T14:57:38,true,1,,284,,RUE,DES EPIVENTS,27350,ETURQUERAYE,,,27228,,,,,,,,,,,,,,,,,,,2018-06-25,A,,,,,94.99Z,NAFRev2,N,0.684089,49.364657,0.93,housenumber,284 Rue des Epivents 27350 Éturqueraye,27228_0140_00284,G,284 RUE DES EPIVENTS,
879738599,00015,87973859900015,O,2019-10-22,,,,2019-12-13T08:54:35,true,1,,54,,PL,DE L'EGLISE,27350,ETURQUERAYE,,,27228,,,,,,,,,,,,,,,,,,,2019-10-22,A,,,,,68.20A,NAFRev2,N,0.695369,49.369896,0.83,housenumber,54 Place de l'Église 27350 Éturqueraye,27228_0120_00054,G,54 PLACE DE L EGLISE,
894520832,00011,89452083200011,O,2021-02-24,,,,2021-02-26T08:44:49,true,1,,534,,RUE,DES FEVES,27350,ETURQUERAYE,,,27228,,,,,,,,,,,,,,,,,,,2021-02-24,A,,,,,68.20B,NAFRev2,N,,,0,,,,,,
