siren,nic,siret,statutDiffusionEtablissement,dateCreationEtablissement,trancheEffectifsEtablissement,anneeEffectifsEtablissement,activitePrincipaleRegistreMetiersEtablissement,dateDernierTraitementEtablissement,etablissementSiege,nombrePeriodesEtablissement,complementAdresseEtablissement,numeroVoieEtablissement,indiceRepetitionEtablissement,typeVoieEtablissement,libelleVoieEtablissement,codePostalEtablissement,libelleCommuneEtablissement,libelleCommuneEtrangerEtablissement,distributionSpecialeEtablissement,codeCommuneEtablissement,codeCedexEtablissement,libelleCedexEtablissement,codePaysEtrangerEtablissement,libellePaysEtrangerEtablissement,complementAdresse2Etablissement,numeroVoie2Etablissement,indiceRepetition2Etablissement,typeVoie2Etablissement,libelleVoie2Etablissement,codePostal2Etablissement,libelleCommune2Etablissement,libelleCommuneEtranger2Etablissement,distributionSpeciale2Etablissement,codeCommune2Etablissement,codeCedex2Etablissement,libelleCedex2Etablissement,codePaysEtranger2Etablissement,libellePaysEtranger2Etablissement,dateDebut,etatAdministratifEtablissement,enseigne1Etablissement,enseigne2Etablissement,enseigne3Etablissement,denominationUsuelleEtablissement,activitePrincipaleEtablissement,nomenclatureActivitePrincipaleEtablissement,caractereEmployeurEtablissement,longitude,latitude,geo_score,geo_type,geo_adresse,geo_id,geo_ligne,geo_l4,geo_l5
213303548,00019,21330354800019,O,1983-03-01,02,2018,,2020-08-25T10:16:50,true,4,,,,,,33220,RIOCAUD,,,33354,,,,,,,,,,,,,,,,,,,2008-01-01,A,MAIRIE,,,,84.11Z,NAFRev2,O,,,0,,,,,,
213303548,00027,21330354800027,O,2003-11-26,,,,2008-06-06T05:50:01,false,4,,,,,,33220,RIOCAUD,,,33354,,,,,,,,,,,,,,,,,,,2008-06-04,F,REHABILITATION LOGEMENTS SOCIAUX,,,,68.20A,NAFRev2,N,,,0,,,,,,
263303489,00011,26330348900011,O,1983-03-01,NN,,,2016-07-23T12:29:24,true,4,,,,,,33220,RIOCAUD,,,33354,,,,,,,,,,,,,,,,,,,2016-01-01,F,CCAS,,,,88.99B,NAFRev2,N,,,0,,,,,,
306145798,00014,30614579800014,O,1976-01-01,NN,,,2008-11-07T00:21:54,true,3,,,,,,33220,RIOCAUD,,,33354,,,,,,,,,,,,,,,,,,,2005-12-31,F,,,,,45.4C,NAFRev1,N,,,0,,,,,,
312166341,00023,31216634100023,O,,,,,,true,1,,,,,,33220,RIOCAUD,,,33354,,,,,,,,,,,,,,,,,,,1984-12-25,F,,,,,48.01,NAP,N,,,0,,,,,,
314708652,00024,31470865200024,O,,NN,,,,true,1,,,,LD,LES PERRICHONS,33220,RIOCAUD,,,33354,,,,,,,,,,,,,,,,,,,1987-04-06,F,,,,,21.12,NAP,N,0.196764,44.753393,0.82,street,Les Perichons 33220 Riocaud,33354_ars7hh,G,LES PERICHONS,
315921114,00015,31592111400015,O,1979-01-01,NN,,,2008-04-05T00:16:29,true,3,,,,,L AVOCAT,33220,RIOCAUD,,,33354,,,,,,,,,,,,,,,,,,,2008-01-01,A,,,,,68.20B,NAFRev2,N,0.206433,44.736849,0.9,street,La Maisonnette de l'Avocat 33220 Riocaud,33354_b040,G,LA MAISONNETTE DE L AVOCAT,
317454684,00018,31745468400018,O,,NN,,,,true,1,,,,,,33220,RIOCAUD,,,33354,,,,,,,,,,,,,,,,,,,1987-12-15,F,,,,,48.01,NAP,N,,,0,,,,,,
320256050,00024,32025605000024,O,1998-01-01,NN,,,2008-01-04T18:12:05,true,3,,,,LD,STE CROIX DES EGRONS,33220,RIOCAUD,,,33354,,,,,,,,,,,,,,,,,,,2008-01-01,A,,,,,68.20B,NAFRev2,N,,,0,,,,,,
324489681,00027,32448968100027,O,,NN,,,,true,1,,,,,AU BOURG,33220,RIOCAUD,,,33354,,,,,,,,,,,,,,,,,,,1994-12-31,F,,,,,60.2L,NAF1993,O,-1.9115621,47.1089349,0.88,poi.track,Chemin du Breil au Bourg Chaumes-en-Retz,https://osm.org/way/283246644,G,,
326222569,00039,32622256900039,O,2006-01-10,,,,2008-03-30T05:50:48,true,2,LA MAISONNETTE DE L AVOCAT,,,,,33220,RIOCAUD,,,33354,,,,,,,,,,,,,,,,,,,2008-01-01,A,,,,,01.21Z,NAFRev2,N,0.206433,44.736849,0.93,street,La Maisonnette de l'Avocat 33220 Riocaud,33354_b040,D,LA MAISONNETTE DE L AVOCAT,
333425601,00015,33342560100015,O,,NN,,,2007-01-18T09:20:53,true,1,,,,LD,AUX TROIS PIERRES,33220,RIOCAUD,,,33354,,,,,,,,,,,,,,,,,,,1988-12-31,F,,,,,01.1A,NAF1993,N,0.199642,44.747426,0.72,street,Les Trois Pierres 33220 Riocaud,33354_b068,G,LES TROIS PIERRES,
333452936,00011,33345293600011,O,1985-09-01,NN,,,2008-04-05T00:36:06,true,3,,,,LD,AUX TROIS PIERRES,33220,RIOCAUD,,,33354,,,,,,,,,,,,,,,,,,,2008-01-01,A,,,,,68.20B,NAFRev2,N,0.199642,44.747426,0.72,street,Les Trois Pierres 33220 Riocaud,33354_b068,G,LES TROIS PIERRES,
343460820,00024,34346082000024,O,2005-07-01,NN,,,2017-05-04T05:38:51,true,2,,3,,,MONRAVE,33220,RIOCAUD,,,33354,,,,,,,,,,,,,,,,,,,2008-01-01,A,,,,,01.21Z,NAFRev2,N,0.203511,44.756001,0.93,housenumber,3 Monrave 33220 Riocaud,33354_un9t7i_00003,G,3 MONRAVE,
345015689,00010,34501568900010,O,,NN,,,2007-01-18T09:25:46,true,1,,,,,LE PRESIDENT,33220,RIOCAUD,,,33354,,,,,,,,,,,,,,,,,,,1989-03-13,F,,,,,01.1G,NAF1993,N,3.0642623,45.7746426,0.9,poi.bar,Le Président (Bar) Chamalières,https://osm.org/node/4741975922,G,,
348147711,00017,34814771100017,O,1988-08-11,NN,,,2018-04-10T03:44:05,true,3,,,,,MONRAVE,33220,RIOCAUD,,,33354,,,,,,,,,,,,,,,,,,,2008-01-01,A,,,,,68.20B,NAFRev2,N,0.203511,44.756001,0.93,street,Monrave 33220 Riocaud,33354_un9t7i,G,MONRAVE,
351688205,00019,35168820500019,O,1989-07-10,01,2018,,2020-08-25T10:11:54,true,3,,,,LD,LES MERVEILLEAUX,33220,RIOCAUD,,,33354,,,,,,,,,,,,,,,,,,,2008-01-01,A,,,,,01.21Z,NAFRev2,N,0.190858,44.769235,0.78,street,Les Merveillaux 33220 Riocaud,33354_eb60pn,G,LES MERVEILLAUX,
353954423,00011,35395442300011,O,1990-01-04,,,,,false,3,,,,LD,LAFOSSE,33220,RIOCAUD,,,33354,,,,,,,,,,,,,,,,,,,1999-06-27,F,,,,,01.1G,NAF1993,N,-0.740624,48.0815973,0.88,poi.bus_stop,Lafosse (Arrêt de bus) Laval,https://osm.org/node/1480284742,G,,
378354336,00034,37835433600034,O,2009-06-01,,,,2012-11-09T00:44:37,true,2,,9,,,LE BOURG,33220,RIOCAUD,,,33354,,,,,,,,,,,,,,,,,,,2010-03-01,F,,,,,47.78C,NAFRev2,N,0.207131,44.764816,0.93,housenumber,9 Le Bourg 33220 Riocaud,33354_kbqtfe_00009,G,9 LE BOURG,
379363336,00015,37936333600015,O,,NN,,,,true,1,,,,,CHATEAU DES EGRANS,33220,RIOCAUD,,,33354,,,,,,,,,,,,,,,,,,,1991-11-11,F,,,,,67.01,NAP,N,,,0,,,,,,
379875800,00029,37987580000029,O,1995-03-01,NN,,,2014-08-04T11:23:27,false,4,,,,LD,MONRAVE,33220,RIOCAUD,,,33354,,,,,,,,,,,,,,,,,,,2008-01-01,F,,,,,01.21Z,NAFRev2,N,0.203511,44.756001,0.93,street,Monrave 33220 Riocaud,33354_un9t7i,G,MONRAVE,
379875800,00037,37987580000037,O,2007-08-10,,,,2015-10-09T08:58:20,true,5,,3,,LD,MONRAVE,33220,RIOCAUD,,,33354,,,,,,,,,,,,,,,,,,,2015-11-01,F,,,,,46.18Z,NAFRev2,N,0.203511,44.756001,0.93,housenumber,3 Monrave 33220 Riocaud,33354_un9t7i_00003,G,3 MONRAVE,
382129617,00017,38212961700017,O,1991-03-02,NN,,,2008-01-04T22:05:50,true,3,,,,LD,LES PEYRICHONS,33220,RIOCAUD,,,33354,,,,,,,,,,,,,,,,,,,2008-01-01,A,,,,,01.21Z,NAFRev2,N,0.196764,44.753393,0.76,street,Les Perichons 33220 Riocaud,33354_ars7hh,G,LES PERICHONS,
382948701,00018,38294870100018,O,1991-07-21,NN,,,2008-01-04T22:17:08,true,3,,,,,LES MAYETS,33220,RIOCAUD,,,33354,,,,,,,,,,,,,,,,,,,2008-01-01,A,,,,,68.20A,NAFRev2,N,3.6596053,46.0712934,0.72,poi.waste_disposal,(Élimination des déchets) Le Mayet-de-Montagne,https://osm.org/way/569408027,G,,
384736278,00019,38473627800019,O,1989-01-01,NN,,,2008-01-04T22:43:00,true,3,,,,,LES BARDONS,33220,RIOCAUD,,,33354,,,,,,,,,,,,,,,,,,,2008-01-01,A,,,,,01.21Z,NAFRev2,N,0.205589,44.769492,0.93,street,Les Bardons 33220 Riocaud,33354_1vhrcj,G,LES BARDONS,
384753851,00011,38475385100011,O,1992-02-12,NN,,,2019-06-24T13:14:07,true,3,,,,LD,LES PEYRICHONS,33220,RIOCAUD,,,33354,,,,,,,,,,,,,,,,,,,2008-01-01,A,,,,,01.21Z,NAFRev2,N,0.196764,44.753393,0.76,street,Les Perichons 33220 Riocaud,33354_ars7hh,G,LES PERICHONS,
387965072,00011,38796507200011,O,1992-07-06,NN,,,,false,4,,,,,,33220,RIOCAUD,,,33354,,,,,,,,,,,,,,,,,,,2003-07-18,F,,,,,70.2A,NAFRev1,N,,,0,,,,,,
388886152,00015,38888615200015,O,1992-09-26,NN,,,2008-01-04T23:16:06,true,3,,,,,LA CROIX,33220,RIOCAUD,,,33354,,,,,,,,,,,,,,,,,,,2008-01-01,A,,,,,68.20B,NAFRev2,N,0.208707,44.76412,0.93,street,La Croix 33220 Riocaud,33354_x0txbe,G,LA CROIX,
389919770,00013,38991977000013,O,1983-01-01,NN,,,2008-01-04T23:32:08,true,4,,,,,LES PERICHONS,33220,RIOCAUD,,,33354,,,,,,,,,,,,,,,,,,,2008-01-01,A,,,,,68.20B,NAFRev2,O,0.196764,44.753393,0.93,street,Les Perichons 33220 Riocaud,33354_ars7hh,G,LES PERICHONS,
390519148,00014,39051914800014,O,1992-09-26,NN,,,2008-01-04T23:41:07,true,3,,,,,LA CROIX,33220,RIOCAUD,,,33354,,,,,,,,,,,,,,,,,,,2008-01-01,A,,,,,01.21Z,NAFRev2,N,0.208707,44.76412,0.93,street,La Croix 33220 Riocaud,33354_x0txbe,G,LA CROIX,
390519148,00022,39051914800022,O,1900-01-01,NN,,,2011-04-28T00:54:50,false,4,,,,,BOURG,33220,RIOCAUD,,,33354,,,,,,,,,,,,,,,,,,,1999-12-31,F,,,,,01.1G,NAF1993,N,0.207613,44.763655,0.91,street,Le Bourg 33220 Riocaud,33354_kbqtfe,G,LE BOURG,
393735717,00034,39373571700034,O,2016-04-01,,,4332BB,2021-02-23T11:19:28,true,1,LA ROUARGUE,1,,,,33220,RIOCAUD,,,33354,,,,,,,,,,,,,,,,,,,2016-04-01,A,,,,FRIGERI PATRICK,33.20A,NAFRev2,N,0.208317,44.761874,0.93,housenumber,1 La Rouargue 33220 Riocaud,33354_y01ama_00001,D,1 LA ROUARGUE,
393831094,00015,39383109400015,O,1994-01-20,NN,,1610AQ,2019-07-24T03:37:03,true,6,,,,,,33220,RIOCAUD,,,33354,,,,,,,,,,,,,,,,,,,2019-02-14,F,,,,,16.10A,NAFRev2,N,,,0,,,,,,
400692620,00026,40069262000026,O,1996-02-12,NN,,,2006-11-25T14:38:40,false,3,,,,,LAFOSSE,33220,RIOCAUD,,,33354,,,,,,,,,,,,,,,,,,,2005-06-13,F,,,,,70.3A,NAFRev1,N,-0.740624,48.0815973,0.88,poi.bus_stop,Lafosse (Arrêt de bus) Laval,https://osm.org/node/1480284742,G,,
400695797,00037,40069579700037,O,1999-02-10,NN,,,2006-10-28T02:53:01,false,3,,,,,A FOSSE,33220,RIOCAUD,,,33354,,,,,,,,,,,,,,,,,,,2005-06-13,F,,,,,01.3Z,NAFRev1,N,0.206564,44.7564,0.81,street,La Fosse 33220 Riocaud,33354_oue3d0,G,LA FOSSE,
400895140,00012,40089514000012,O,1995-04-14,NN,,,,false,4,,,,LD,LAFOSSE,33220,RIOCAUD,,,33354,,,,,,,,,,,,,,,,,,,1996-12-25,F,,,,,01.1A,NAF1993,N,-0.740624,48.0815973,0.88,poi.bus_stop,Lafosse (Arrêt de bus) Laval,https://osm.org/node/1480284742,G,,
403003452,00014,40300345200014,O,1995-11-29,NN,,,2018-12-22T04:07:38,true,3,LES RAMBAUDS,,,,LES RAMBAUDS,33220,RIOCAUD,,,33354,,,,,,,,,,,,,,,,,,,2008-01-01,A,,,,,01.21Z,NAFRev2,N,0.204582,44.763841,0.92,street,Les Rambauds Est 33220 Riocaud,33354_b063,G,LES RAMBAUDS EST,
410738348,00011,41073834800011,O,1996-12-16,NN,,,2016-05-04T11:04:38,false,4,,,,,STE CROIX DES EGRONS,33220,RIOCAUD,,,33354,,,,,,,,,,,,,,,,,,,2015-12-31,F,,,,,68.20B,NAFRev2,N,,,0,,,,,,
410738348,00029,41073834800029,O,2014-11-02,NN,,,2019-06-24T13:29:07,true,1,SAINTE CROIX DES EGRONS,,,,STE CROIX DES EGRONS,33220,RIOCAUD,,,33354,,,,,,,,,,,,,,,,,,,2014-11-02,A,,,,,01.21Z,NAFRev2,N,,,0,,,,,,
411118177,00012,41111817700012,O,1996-12-27,NN,,,2016-04-26T04:01:25,true,3,,,,,SAINT CROIX DES EGRONS,33220,RIOCAUD,,,33354,,,,,,,,,,,,,,,,,,,2008-01-01,A,,,,,01.21Z,NAFRev2,N,,,0,,,,,,
412740664,00021,41274066400021,O,1985-01-01,,,,,false,3,,,,,,33220,RIOCAUD,,,33354,,,,,,,,,,,,,,,,,,,2000-12-31,F,,,,,01.1G,NAF1993,N,,,0,,,,,,
412745648,00011,41274564800011,O,1994-01-01,NN,,,,true,4,,,,,LES RAMBAUDS,33220,RIOCAUD,,,33354,,,,,,,,,,,,,,,,,,,2003-03-31,F,,,,,01.1G,NAFRev1,N,0.204582,44.763841,0.92,street,Les Rambauds Est 33220 Riocaud,33354_b063,G,LES RAMBAUDS EST,
412746307,00013,41274630700013,O,1987-12-31,NN,,,2015-05-14T08:00:56,true,4,,,,,LES 4 JAMBES,33220,RIOCAUD,,,33354,,,,,,,,,,,,,,,,,,,2013-06-30,F,,,,,01.21Z,NAFRev2,N,,,0,,,,,,
412746406,00013,41274640600013,O,1987-12-31,NN,,,2019-02-06T03:36:20,true,4,,,,,,33220,RIOCAUD,,,33354,,,,,,,,,,,,,,,,,,,2018-12-31,F,,,,,01.21Z,NAFRev2,N,,,0,,,,,,
412746711,00016,41274671100016,O,1987-12-31,NN,,,2018-09-29T12:37:48,true,5,,,,,LA MISSE N 4,33220,RIOCAUD,,,33354,,,,,,,,,,,,,,,,,,,2016-12-31,F,,,,,01.21Z,NAFRev2,O,,,0,,,,,,
412747610,00019,41274761000019,O,1997-01-01,NN,,,2008-01-04T22:21:45,true,3,,,,,JOLIVERT,33220,RIOCAUD,,,33354,,,,,,,,,,,,,,,,,,,2008-01-01,A,,,,,01.21Z,NAFRev2,N,0.188669,44.75962,0.93,street,Jolivert 33220 Riocaud,33354_s2e5ly,G,JOLIVERT,
413876210,00019,41387621000019,O,1987-12-31,NN,,,2006-02-21T06:19:56,true,3,,3,,,LES 3 PIERRES,33220,RIOCAUD,,,33354,,,,,,,,,,,,,,,,,,,2002-12-31,F,,,,,01.1G,NAF1993,N,0.199642,44.747426,0.77,street,Les Trois Pierres 33220 Riocaud,33354_b068,G,LES TROIS PIERRES,
423531367,00013,42353136700013,O,1999-07-05,NN,,,2014-07-08T02:00:40,true,5,,,,LD,LES HUMEAUX,33220,RIOCAUD,,,33354,,,,,,,,,,,,,,,,,,,2010-12-31,F,,,,,41.20A,NAFRev2,N,0.2134,44.763482,0.93,street,Les Humeaux 33220 Riocaud,33354_2yf5q3,G,LES HUMEAUX,
425289634,00015,42528963400015,O,1968-01-01,,,,,true,1,,,,,,33220,RIOCAUD,,,33354,,,,,,,,,,,,,,,,,,,1999-12-31,F,,,,,01.3Z,NAF1993,N,,,0,,,,,,
429414790,00015,42941479000015,O,2000-03-06,NN,,4334ZB,2019-07-26T09:33:20,false,3,,,,,LES BARDONS EST,33220,RIOCAUD,,,33354,,,,,,,,,,,,,,,,,,,2004-05-24,F,,,,,45.4J,NAFRev1,N,0.205877,44.769514,0.93,street,Les Bardons Est 33220 Riocaud,33354_b004,G,LES BARDONS EST,
430568725,00013,43056872500013,O,1973-01-01,NN,,,2012-07-28T16:21:50,true,4,,,,,MONRAVE EST,33220,RIOCAUD,,,33354,,,,,,,,,,,,,,,,,,,2011-12-25,F,,,,,68.20B,NAFRev2,N,0.204972,44.7571,0.93,street,Monrave-est 33220 Riocaud,33354_b044,G,MONRAVE EST,
430569202,00012,43056920200012,O,1991-01-01,NN,,,2012-01-05T10:37:20,true,4,,3,,LD,SAINTE CROIX,33220,RIOCAUD,,,33354,,,,,,,,,,,,,,,,,,,2008-01-01,F,,,,,01.21Z,NAFRev2,N,0.205778,44.728631,0.93,housenumber,3 Sainte-croix 33220 Riocaud,33354_b066_00003,G,3 SAINTE CROIX,
430569566,00010,43056956600010,O,1983-01-01,,,,,true,1,,,,,BOIS DE MONRAVE,33220,RIOCAUD,,,33354,,,,,,,,,,,,,,,,,,,2000-10-17,F,,,,,01.3Z,NAF1993,N,0.197638,44.75486,0.93,street,Bois de Monrave 33220 Riocaud,33354_b009,G,BOIS DE MONRAVE,
434808598,00016,43480859800016,O,1986-01-01,NN,,,2012-06-15T05:28:16,true,4,,,,LD,RAMBAUDS,33220,RIOCAUD,,,33354,,,,,,,,,,,,,,,,,,,2008-01-01,F,,,,,01.21Z,NAFRev2,N,0.204582,44.763841,0.91,street,Les Rambauds Est 33220 Riocaud,33354_b063,G,LES RAMBAUDS EST,
440993079,00019,44099307900019,O,2001-12-12,NN,,,,false,4,,,,,,33220,RIOCAUD,,,33354,,,,,,,,,,,,,,,,,,,2003-03-24,F,,,,,01.1G,NAFRev1,N,,,0,,,,,,
441098597,00012,44109859700012,O,2002-02-27,NN,,,2008-01-04T21:12:10,true,3,,,,,,33220,RIOCAUD,,,33354,,,,,,,,,,,,,,,,,,,2008-01-01,A,,,,,01.21Z,NAFRev2,N,,,0,,,,,,
441501277,00012,44150127700012,O,2002-04-03,NN,,,2008-11-08T02:13:24,true,4,,,,,LA CROIX,33220,RIOCAUD,,,33354,,,,,,,,,,,,,,,,,,,2008-06-17,F,,,,,31.09B,NAFRev2,N,0.208707,44.76412,0.93,street,La Croix 33220 Riocaud,33354_x0txbe,G,LA CROIX,
443683420,00014,44368342000014,O,2002-09-01,NN,,,2008-01-04T22:08:59,true,3,,,,,LES MERVEILLAUX,33220,RIOCAUD,,,33354,,,,,,,,,,,,,,,,,,,2008-01-01,A,,,,,68.20B,NAFRev2,N,0.190858,44.769235,0.93,street,Les Merveillaux 33220 Riocaud,33354_eb60pn,G,LES MERVEILLAUX,
453914541,00025,45391454100025,O,2007-07-27,,,,2021-02-23T13:38:30,true,2,,,,,LIEUDIT PRESIDENT,33220,RIOCAUD,,,33354,,,,,,,,,,,,,,,,,,,2008-01-01,A,,,,,68.20B,NAFRev2,N,5.8617624,45.1263059,0.89,poi.tree,Arbre Président Saint-Martin-d'Uriage,https://osm.org/node/3543975659,G,,
482663101,00012,48266310100012,O,2005-02-01,02,2018,,2020-08-25T10:27:30,true,2,2 LES PERICHONS,2,,,LES PERICHONS,33220,RIOCAUD,,,33354,,,,,,,,,,,,,,,,,,,2008-01-01,A,,,,,01.21Z,NAFRev2,N,0.196764,44.753393,0.93,housenumber,2 Les Perichons 33220 Riocaud,33354_ars7hh_00002,G,2 LES PERICHONS,
488413303,00014,48841330300014,O,2005-08-25,,,,2016-01-12T00:26:31,false,2,SAINTE CROIX DES EGRONS,,,,,33220,RIOCAUD,,,33354,,,,,,,,,,,,,,,,,,,2008-01-01,A,,,,,68.20B,NAFRev2,N,,,0,,,,,,
488413303,00022,48841330300022,O,2013-08-01,,,,2015-06-16T08:31:41,false,2,,,,LD,PRESIDENT,33220,RIOCAUD,,,33354,,,,,,,,,,,,,,,,,,,2015-05-31,F,,,,,01.61Z,NAFRev2,N,5.8617624,45.1263059,0.89,poi.tree,Arbre Président Saint-Martin-d'Uriage,https://osm.org/node/3543975659,G,,
488413303,00030,48841330300030,O,2014-11-02,01,2018,,2020-08-25T10:32:39,true,1,LE PRESIDENT,,,,,33220,RIOCAUD,,,33354,,,,,,,,,,,,,,,,,,,2014-11-02,A,,,,,01.21Z,NAFRev2,N,,,0,,,,,,
493364392,00016,49336439200016,O,2007-01-01,,,,2010-03-05T19:50:29,true,4,,,,,LA ROUARGUE,33220,RIOCAUD,,,33354,,,,,,,,,,,,,,,,,,,2009-12-31,F,,,,,64.20Z,NAFRev2,N,0.208317,44.761874,0.93,street,La Rouargue 33220 Riocaud,33354_y01ama,G,LA ROUARGUE,
493419097,00016,49341909700016,O,2007-01-02,,,,2011-03-07T08:46:09,false,3,,2,,,LE BARDONS,33220,RIOCAUD,,,33354,,,,,,,,,,,,,,,,,,,2011-01-30,F,,,,,64.20Z,NAFRev2,N,0.205589,44.769492,0.79,housenumber,2 Les Bardons 33220 Riocaud,33354_1vhrcj_00002,G,2 LES BARDONS,
508915972,00014,50891597200014,O,2008-10-01,03,2018,4391BZ,2020-08-25T10:22:12,false,2,,,,LD,STE CROIX DES EGRONS,33220,RIOCAUD,,,33354,,,,,,,,,,,,,,,,,,,2019-02-25,F,,,,,43.91B,NAFRev2,O,,,0,,,,,,
514980978,00019,51498097800019,O,2009-09-01,,,,2016-11-02T03:21:40,false,2,,2,,,LES BARDONS,33220,RIOCAUD,,,33354,,,,,,,,,,,,,,,,,,,2016-10-06,F,,,,,75.00Z,NAFRev2,N,0.205589,44.769492,0.93,housenumber,2 Les Bardons 33220 Riocaud,33354_1vhrcj_00002,G,2 LES BARDONS,
519791552,00028,51979155200028,O,2018-01-01,,,9602BB,2021-02-23T15:32:33,true,1,,,,RUE,LES RAMBAUDS,33220,RIOCAUD,,,33354,,,,,,,,,,,,,,,,,,,2018-01-01,A,,,,PEAU M',96.02B,NAFRev2,N,,,0,,,,,,
521591016,00030,52159101600030,O,2019-09-10,,,9602BB,2021-02-23T15:36:03,true,1,,4,,ALL,DES QUATRES JAMBES,33220,RIOCAUD,,,33354,,,,,,,,,,,,,,,,,,,2019-09-10,A,,,,,96.02B,NAFRev2,N,0.217067,44.755716,0.77,housenumber,4 Allee des Quatre Jambes 33220 Riocaud,33354_99jmzd_00004,G,4 ALLEE DES QUATRE JAMBES,
521795039,00010,52179503900010,O,2010-05-01,,,,2010-04-16T10:52:47,true,1,,,,,LA CROIX,33220,RIOCAUD,,,33354,,,,,,,,,,,,,,,,,,,2010-05-01,A,,,,,59.20Z,NAFRev2,N,0.208707,44.76412,0.93,street,La Croix 33220 Riocaud,33354_x0txbe,G,LA CROIX,
524758612,00021,52475861200021,O,2018-09-10,01,2018,4399CZ,2021-02-23T15:42:04,true,1,,,,,LD MONRAVE,33220,RIOCAUD,,,33354,,,,,,,,,,,,,,,,,,,2018-09-10,A,,,,,43.99C,NAFRev2,N,0.203511,44.756001,0.93,street,Monrave 33220 Riocaud,33354_un9t7i,G,MONRAVE,
531668812,00013,53166881200013,O,2011-04-01,01,2018,,2020-08-25T10:44:34,true,2,LES 4 JAMBES,,,,LES 4 JAMBES,33220,RIOCAUD,,,33354,,,,,,,,,,,,,,,,,,,2011-09-05,A,,,,,51.10Z,NAFRev2,O,,,0,,,,,,
532069697,00011,53206969700011,O,2011-04-15,,,4391BZ,2015-03-18T00:36:29,true,1,,,,,LA POTENCE,33220,RIOCAUD,,,33354,,,,,,,,,,,,,,,,,,,2011-04-15,A,,,,,43.91B,NAFRev2,N,0.207527,44.763281,0.91,street,Lieu Dit la Potence 33220 Riocaud,33354_06r6g1,G,LIEU DIT LA POTENCE,
539727321,00017,53972732100017,O,2012-01-09,,,,2015-02-19T04:20:40,true,2,,,,,LES MAILLETS,33220,RIOCAUD,,,33354,,,,,,,,,,,,,,,,,,,2014-08-31,F,,,,,55.20Z,NAFRev2,N,0.199303,44.77038,0.93,street,Les Maillets 33220 Riocaud,33354_juwily,G,LES MAILLETS,
539757344,00012,53975734400012,O,2012-01-09,,,,2013-04-18T19:29:28,true,2,,,,,LES MAILLETS,33220,RIOCAUD,,,33354,,,,,,,,,,,,,,,,,,,2013-04-01,A,,,,,56.10A,NAFRev2,N,0.199303,44.77038,0.93,street,Les Maillets 33220 Riocaud,33354_juwily,G,LES MAILLETS,
595941667,00015,59594166700015,O,,,,,,true,1,,,,,,33220,RIOCAUD,,,33354,,,,,,,,,,,,,,,,,,,1984-12-25,F,,,,,00.97,NAP,N,,,0,,,,,,
596042820,00016,59604282000016,O,,,,,,true,1,,,,,,33220,RIOCAUD,,,33354,,,,,,,,,,,,,,,,,,,1984-12-25,F,,,,,00.97,NAP,N,,,0,,,,,,
596043489,00019,59604348900019,O,,,,,,true,1,,,,,,33220,RIOCAUD,,,33354,,,,,,,,,,,,,,,,,,,1984-12-25,F,,,,,62.43,NAP,N,,,0,,,,,,
596642470,00014,59664247000014,O,,NN,,,,true,1,,,,,,33220,RIOCAUD,,,33354,,,,,,,,,,,,,,,,,,,1990-06-26,F,,,,,81.21,NAP,N,,,0,,,,,,
597241322,00036,59724132200036,O,1987-12-31,NN,,,2008-01-05T02:33:19,false,3,,3,,,LES 3 PIERRES,33220,RIOCAUD,,,33354,,,,,,,,,,,,,,,,,,,2008-01-01,A,,,,,01.21Z,NAFRev2,N,0.199642,44.747426,0.77,street,Les Trois Pierres 33220 Riocaud,33354_b068,G,LES TROIS PIERRES,
750876880,00014,75087688000014,O,2012-04-11,00,2018,1610AQ,2021-02-23T16:05:59,true,4,,,,,LD MONRAVE,33220,RIOCAUD,,,33354,,,,,,,,,,,,,,,,,,,2017-10-03,A,BST,,,,16.10A,NAFRev2,N,0.203511,44.756001,0.93,street,Monrave 33220 Riocaud,33354_un9t7i,G,MONRAVE,
781976576,00012,78197657600012,O,,,,,,true,1,,,,,,33220,RIOCAUD,,,33354,,,,,,,,,,,,,,,,,,,1985-12-25,F,,,,,01.00,NAP,N,,,0,,,,,,
781976626,00015,78197662600015,O,,NN,,,,true,1,,,,,,33220,RIOCAUD,,,33354,,,,,,,,,,,,,,,,,,,,F,,,,,00.97,NAP,N,,,0,,,,,,
791947492,00025,79194749200025,O,2014-12-21,,,8121ZZ,2019-07-23T08:26:53,false,2,,2,,,LES BARDONS EST,33220,RIOCAUD,,,33354,,,,,,,,,,,,,,,,,,,2019-06-01,F,,,,DEBIT SMITH HOMECARE,88.10A,NAFRev2,N,0.205877,44.769514,0.93,street,Les Bardons Est 33220 Riocaud,33354_b004,G,LES BARDONS EST,
791947492,00033,79194749200033,O,2019-06-01,,,8211ZP,2021-02-23T16:19:22,true,1,,1,,RTE,DES BARDONS,33220,RIOCAUD,,,33354,,,,,,,,,,,,,,,,,,,2019-06-01,A,,,,DEBIT SMITH HOMECARE,82.11Z,NAFRev2,N,0.205595,44.766103,0.83,housenumber,1 Route des Bardons 33220 Riocaud,33354_wp9e1i_00001,G,1 ROUTE DES BARDONS,
793322488,00016,79332248800016,O,2013-04-23,,,,2013-05-31T03:54:46,true,1,SAINTE CROIX DES EGRONS -,,,,,33220,RIOCAUD,,,33354,,,,,,,,,,,,,,,,,,,2013-04-23,A,,,,,68.20B,NAFRev2,N,,,0,,,,,,
793876434,00010,79387643400010,O,2013-07-01,NN,,,2018-11-13T08:43:22,true,2,1 LES BARRIERES,,,,,33220,RIOCAUD,,,33354,,,,,,,,,,,,,,,,,,,2018-08-31,F,,,,,01.21Z,NAFRev2,N,0.214427,44.760015,0.74,housenumber,1 Allee des Barrieres 33220 Riocaud,33354_j4i593_00001,D,1 ALLEE DES BARRIERES,
798296620,00015,79829662000015,O,2011-05-11,,,,2013-11-05T11:21:06,true,1,,,,,MAIRIE,33220,RIOCAUD,,,33354,,,,,,,,,,,,,,,,,,,2011-05-11,A,,,,,94.99Z,NAFRev2,N,3.0709671,50.6304695,0.92,poi.townhall,Hôtel de Ville Lille,https://osm.org/way/40917078,G,,
798726238,00016,79872623800016,O,2013-11-26,,,,2013-11-26T19:48:20,true,1,,3,,,LES HUMEAUX,33220,RIOCAUD,,,33354,,,,,,,,,,,,,,,,,,,2013-11-26,A,,,,,96.09Z,NAFRev2,N,0.2134,44.763482,0.93,housenumber,3 Les Humeaux 33220 Riocaud,33354_2yf5q3_00003,G,3 LES HUMEAUX,
799645072,00015,79964507200015,O,2014-01-10,,,,2014-08-19T08:33:45,true,2,,2,,,LES MAILLETS,33220,RIOCAUD,,,33354,,,,,,,,,,,,,,,,,,,2014-08-01,F,,,,,55.20Z,NAFRev2,N,0.199303,44.77038,0.93,housenumber,2 Les Maillets 33220 Riocaud,33354_juwily_00002,G,2 LES MAILLETS,
802926261,00016,80292626100016,O,2014-06-12,,,,2015-12-16T03:39:17,true,2,,2,,RTE,JOLIVERT SUD,33220,RIOCAUD,,,33354,,,,,,,,,,,,,,,,,,,2015-12-01,F,,,,,96.02A,NAFRev2,N,,,0,,,,,,
803937275,00011,80393727500011,O,2014-08-11,,,,2018-10-19T04:35:29,false,4,,,,,LES QUATRE JAMBES,33220,RIOCAUD,,,33354,,,,,,,,,,,,,,,,,,,2018-06-13,F,,,,,86.90E,NAFRev2,N,0.216827,44.755367,0.93,street,Les Quatre Jambes 33220 Riocaud,33354_b061,G,LES QUATRE JAMBES,
803957323,00022,80395732300022,O,2014-09-01,,,,2017-05-04T10:15:43,false,1,,1,,,MONRAVE,33220,RIOCAUD,,,33354,,,,,,,,,,,,,,,,,,,2014-09-01,A,,,,,46.34Z,NAFRev2,N,0.203511,44.756001,0.93,housenumber,1 Monrave 33220 Riocaud,33354_un9t7i_00001,G,1 MONRAVE,
804007490,00019,80400749000019,O,2014-09-01,,,,2015-01-08T08:27:59,true,2,,5,,,LES RAMBAUDS,33220,RIOCAUD,,,33354,,,,,,,,,,,,,,,,,,,2015-01-01,F,,,,,43.22A,NAFRev2,N,0.204024,44.764017,0.92,housenumber,5 Les Rambauds-ouest 33220 Riocaud,33354_b064_00005,G,5 LES RAMBAUDS OUEST,
818057812,00021,81805781200021,O,2018-01-01,,,,2021-02-23T17:35:55,true,1,,8,,RTE,DE LA CROIX,33220,RIOCAUD,,,33354,,,,,,,,,,,,,,,,,,,2018-01-01,A,,,,,01.45Z,NAFRev2,N,0.211713,44.763748,0.83,housenumber,8 Route de la Croix 33220 Riocaud,33354_m4ssck_00008,G,8 ROUTE DE LA CROIX,
819053794,00015,81905379400015,O,2015-07-01,,,,2020-06-11T03:59:26,true,2,9 ROUTE DE LA CROIX,,,,,33220,RIOCAUD,,,33354,,,,,,,,,,,,,,,,,,,2019-12-31,F,,,,,55.20Z,NAFRev2,N,0.211447,44.763687,0.93,housenumber,9 Route de la Croix 33220 Riocaud,33354_m4ssck_00009,D,9 ROUTE DE LA CROIX,
820599264,00018,82059926400018,O,2016-06-06,,,,2017-01-04T03:53:09,true,2,,1,,LD,LES BARDONS EST,33220,RIOCAUD,,,33354,,,,,,,,,,,,,,,,,,,2016-12-31,F,LA FRENCH BEER,,,LA FRENCH BEER,47.81Z,NAFRev2,N,0.205877,44.769514,0.93,street,Les Bardons Est 33220 Riocaud,33354_b004,G,LES BARDONS EST,
821216116,00029,82121611600029,O,2019-02-01,,,,2019-05-28T11:32:17,false,1,,,,LD,LES MERVEILLAUX,33220,RIOCAUD,,,33354,,,,,,,,,,,,,,,,,,,2019-02-01,A,,,,,35.11Z,NAFRev2,N,0.190858,44.769235,0.93,street,Les Merveillaux 33220 Riocaud,33354_eb60pn,G,LES MERVEILLAUX,