siren,nic,siret,statutDiffusionEtablissement,dateCreationEtablissement,trancheEffectifsEtablissement,anneeEffectifsEtablissement,activitePrincipaleRegistreMetiersEtablissement,dateDernierTraitementEtablissement,etablissementSiege,nombrePeriodesEtablissement,complementAdresseEtablissement,numeroVoieEtablissement,indiceRepetitionEtablissement,typeVoieEtablissement,libelleVoieEtablissement,codePostalEtablissement,libelleCommuneEtablissement,libelleCommuneEtrangerEtablissement,distributionSpecialeEtablissement,codeCommuneEtablissement,codeCedexEtablissement,libelleCedexEtablissement,codePaysEtrangerEtablissement,libellePaysEtrangerEtablissement,complementAdresse2Etablissement,numeroVoie2Etablissement,indiceRepetition2Etablissement,typeVoie2Etablissement,libelleVoie2Etablissement,codePostal2Etablissement,libelleCommune2Etablissement,libelleCommuneEtranger2Etablissement,distributionSpeciale2Etablissement,codeCommune2Etablissement,codeCedex2Etablissement,libelleCedex2Etablissement,codePaysEtranger2Etablissement,libellePaysEtranger2Etablissement,dateDebut,etatAdministratifEtablissement,enseigne1Etablissement,enseigne2Etablissement,enseigne3Etablissement,denominationUsuelleEtablissement,activitePrincipaleEtablissement,nomenclatureActivitePrincipaleEtablissement,caractereEmployeurEtablissement,longitude,latitude,geo_score,geo_type,geo_adresse,geo_id,geo_ligne,geo_l4,geo_l5
025650037,00051,02565003700051,O,2014-06-30,03,2018,,2020-08-25T10:10:31,false,1,,,,,CARRIERES DE LA GAIETE,35430,SAINT-GUINOUX,,,35279,,,,,,,,,,,,,,,,,,,2014-06-30,A,,,,,08.12Z,NAFRev2,O,,,0,,,,,,
200002095,00012,20000209500012,O,2006-02-16,NN,,,2019-11-14T14:00:34,false,5,MAIRIE,2,,RUE,DE LA MAIRIE,35430,SAINT-GUINOUX,,,35279,,,,,,,,,,,,,,,,,,,2015-01-28,F,,,,,84.12Z,NAFRev2,O,-1.884297,48.576859,0.94,housenumber,2 Rue de la Mairie 35430 Saint-Guinoux,35279_0045_00002,G,2 RUE DE LA MAIRIE,
213502792,00012,21350279200012,O,1983-03-01,11,2018,,2020-08-25T10:16:57,true,4,,2,,RUE,DE LA MAIRIE,35430,SAINT-GUINOUX,,,35279,,,,,,,,,,,,,,,,,,,2008-01-01,A,MAIRIE,,,,84.11Z,NAFRev2,O,-1.884297,48.576859,0.94,housenumber,2 Rue de la Mairie 35430 Saint-Guinoux,35279_0045_00002,G,2 RUE DE LA MAIRIE,
213502792,00020,21350279200020,O,1983-12-21,03,2018,,2020-08-25T10:16:57,false,3,,2,,RUE,DES CEDRES,35430,SAINT-GUINOUX,,,35279,,,,,,,,,,,,,,,,,,,2008-01-01,A,ECOLE PRIMAIRE PUBLIQUE LES CEDRES,,,,85.20Z,NAFRev2,N,-1.888184,48.577431,0.94,housenumber,2 Rue des Cedres 35430 Saint-Guinoux,35279_0008_00002,G,2 RUE DES CEDRES,
213502792,00038,21350279200038,O,2002-08-01,NN,,,2019-11-14T14:00:34,false,4,MAIRIE,2,,RUE,DE LA MAIRIE,35430,SAINT-GUINOUX,,,35279,,,,,,,,,,,,,,,,,,,2017-11-02,F,SERVICE D'ASSAINISSEMENT,,,,37.00Z,NAFRev2,N,-1.884297,48.576859,0.94,housenumber,2 Rue de la Mairie 35430 Saint-Guinoux,35279_0045_00002,G,2 RUE DE LA MAIRIE,
213502792,00046,21350279200046,O,2003-12-25,NN,,,2019-11-14T14:00:34,false,2,,,,RUE,DU STADE,35430,SAINT-GUINOUX,,,35279,,,,,,,,,,,,,,,,,,,2008-01-01,A,CAMPING MUNICIPAL,,,,55.30Z,NAFRev2,N,-1.882379,48.575776,0.94,street,Rue du Stade 35430 Saint-Guinoux,35279_0060,G,RUE DU STADE,
253500656,00017,25350065600017,O,1983-03-01,NN,,,2019-11-14T14:00:34,true,5,MAIRIE,2,,RUE,DE LA MAIRIE,35430,SAINT-GUINOUX,,,35279,,,,,,,,,,,,,,,,,,,2010-02-28,F,,,,,84.13Z,NAFRev2,O,-1.884297,48.576859,0.94,housenumber,2 Rue de la Mairie 35430 Saint-Guinoux,35279_0045_00002,G,2 RUE DE LA MAIRIE,
263502676,00012,26350267600012,O,1983-03-01,NN,,,2019-11-14T14:00:34,true,4,MAIRIE,2,,RUE,DE LA MAIRIE,35430,SAINT-GUINOUX,,,35279,,,,,,,,,,,,,,,,,,,2008-01-01,A,,,,,88.99B,NAFRev2,N,-1.884297,48.576859,0.94,housenumber,2 Rue de la Mairie 35430 Saint-Guinoux,35279_0045_00002,G,2 RUE DE LA MAIRIE,
263502676,00020,26350267600020,O,1996-07-08,,,,2019-11-14T14:00:34,false,3,MAIRIE,2,,RUE,DE LA MAIRIE,35430,SAINT-GUINOUX,,,35279,,,,,,,,,,,,,,,,,,,2008-01-01,A,SERVICE AIDE MENAGERE A DOMICILE,,,,88.10A,NAFRev2,N,-1.884297,48.576859,0.94,housenumber,2 Rue de la Mairie 35430 Saint-Guinoux,35279_0045_00002,G,2 RUE DE LA MAIRIE,
263505349,00013,26350534900013,O,1985-03-19,NN,,,2019-11-14T14:00:34,true,1,,2,,RUE,DE LA MAIRIE,35430,SAINT-GUINOUX,,,35279,,,,,,,,,,,,,,,,,,,2001-12-25,F,,,,,85.3K,NAF1993,N,-1.884297,48.576859,0.94,housenumber,2 Rue de la Mairie 35430 Saint-Guinoux,35279_0045_00002,G,2 RUE DE LA MAIRIE,
301579066,00012,30157906600012,O,1964-01-01,NN,,,2019-11-14T14:00:34,true,5,,11,R,,DE LA SALLE VERTE,35430,SAINT-GUINOUX,,,35279,,,,,,,,,,,,,,,,,,,2010-06-30,F,,,,,33.12Z,NAFRev2,N,-1.882065,48.575131,0.93,street,Rue de la Salle Verte 35430 Saint-Guinoux,35279_0055,G,RUE DE LA SALLE VERTE,
301835286,00016,30183528600016,O,1974-01-01,NN,,,2019-11-14T14:00:34,true,1,,,,,BOURG,35430,SAINT-GUINOUX,,,35279,,,,,,,,,,,,,,,,,,,2001-09-30,F,,,,,05.0A,NAF1993,N,-1.229143,44.2011043,0.89,poi.school,École du bourg Mimizan,https://osm.org/way/35215942,G,,
305446759,00055,30544675900055,O,2006-12-01,NN,,,2019-11-14T14:00:34,false,3,Z A DE BEAULIEU,,,,,35430,SAINT-GUINOUX,,,35279,,,,,,,,,,,,,,,,,,,2010-04-30,F,ETABLISSEMENTS KERBOAS MACHINES AGR,,,,33.12Z,NAFRev2,O,,,0,,,,,,
306963810,00016,30696381000016,O,,NN,,,2019-11-14T14:00:34,true,1,,,,LD,LA GAITE,35430,SAINT-GUINOUX,,,35279,,,,,,,,,,,,,,,,,,,1987-12-02,F,,,,,79.03,NAP,N,2.1314504,48.8073501,0.9,poi.pub,La Gaité (Pub) Versailles,https://osm.org/node/2479049313,G,,
307731067,00038,30773106700038,O,1995-08-01,NN,,,2019-11-14T14:00:34,true,5,,,,,LA BAUSSAINE,35430,SAINT-GUINOUX,,,35279,,,,,,,,,,,,,,,,,,,2008-03-31,F,,,,,32.99Z,NAFRev2,N,-1.8985012,48.3150392,0.9,poi.stadium,(Stade) La Baussaine,https://osm.org/way/234939590,G,,
309210201,00013,30921020100013,O,1977-01-01,NN,,,2019-11-14T14:00:34,true,1,,,,,BOURG,35430,SAINT-GUINOUX,,,35279,,,,,,,,,,,,,,,,,,,1998-06-30,F,,,,,55.3A,NAF1993,N,-1.229143,44.2011043,0.89,poi.school,École du bourg Mimizan,https://osm.org/way/35215942,G,,
309414167,00010,30941416700010,O,1977-01-01,NN,,,2019-11-14T14:00:34,true,4,,,,,LES PETITS CLOS,35430,SAINT-GUINOUX,,,35279,,,,,,,,,,,,,,,,,,,2002-12-25,F,,,,,50.2Z,NAF1993,N,9.5556257,42.1988298,0.89,poi.cafe,Les petits delices de clos (Café) Linguizzetta,https://osm.org/node/906661774,G,,
312314693,00010,31231469300010,O,,NN,,,2019-11-14T14:00:34,true,1,,,,,LES LANDES,35430,SAINT-GUINOUX,,,35279,,,,,,,,,,,,,,,,,,,,F,,,,,35.01,NAP,N,-1.900593,48.584992,0.94,street,Les Landes 35430 Saint-Guinoux,35279_baourg,G,LES LANDES,
315671461,00012,31567146100012,O,1979-01-01,NN,,,2019-11-14T14:00:34,true,4,,,,,LES AUMONES,35430,SAINT-GUINOUX,,,35279,,,,,,,,,,,,,,,,,,,2011-01-20,F,,,,,95.21Z,NAFRev2,N,2.136471,49.0467157,0.87,poi.bus_stop,Les Béthunes (Arrêt de bus) Saint-Ouen-l'Aumône,https://osm.org/node/2467798495,G,,
320073026,00025,32007302600025,O,2000-11-06,01,2018,,2020-08-25T10:28:31,true,8,,,,,LES LANDES,35430,SAINT-GUINOUX,,,35279,,,,,,,,,,,,,,,,,,,2013-07-26,A,,,,G.C BOIS DE SAINT MALO,43.91A,NAFRev2,N,-1.900593,48.584992,0.94,street,Les Landes 35430 Saint-Guinoux,35279_baourg,G,LES LANDES,
320457666,00016,32045766600016,O,,NN,,,2019-11-14T14:00:34,true,1,,,,,BOURG,35430,SAINT-GUINOUX,,,35279,,,,,,,,,,,,,,,,,,,1992-10-19,F,,,,,52.2C,NAF1993,N,-1.229143,44.2011043,0.89,poi.school,École du bourg Mimizan,https://osm.org/way/35215942,G,,
321321481,00012,32132148100012,O,,,,,2019-11-14T14:00:34,true,1,,,,,BOURG,35430,SAINT-GUINOUX,,,35279,,,,,,,,,,,,,,,,,,,1984-12-25,F,,,,,62.12,NAP,N,-1.229143,44.2011043,0.89,poi.school,École du bourg Mimizan,https://osm.org/way/35215942,G,,
322018318,00012,32201831800012,O,,NN,,,2019-11-14T14:00:34,true,1,,,,,LE TRELAT,35430,SAINT-GUINOUX,,,35279,,,,,,,,,,,,,,,,,,,1988-07-01,F,,,,,79.06,NAP,N,,,0,,,,,,
325203818,00019,32520381800019,O,,NN,,,2019-11-14T14:00:34,true,1,,,,LD,BEAULIEU,35430,SAINT-GUINOUX,,,35279,,,,,,,,,,,,,,,,,,,,F,,,,,53.02,NAP,N,-1.908279,48.585498,0.91,locality,La Lande Devant Beaulieu 35430 Saint-Guinoux,35279_b215,G,LA LANDE DEVANT BEAULIEU,
325614022,00011,32561402200011,O,1982-10-01,NN,,,2019-11-14T14:00:34,true,4,,,,,LES LANDES,35430,SAINT-GUINOUX,,,35279,,,,,,,,,,,,,,,,,,,2007-11-10,F,,,,,60.2L,NAFRev1,O,-1.900593,48.584992,0.94,street,Les Landes 35430 Saint-Guinoux,35279_baourg,G,LES LANDES,
325915239,00025,32591523900025,O,1985-01-01,NN,,,2019-11-14T14:00:34,false,3,,,,,BEAULIEU,35430,SAINT-GUINOUX,,,35279,,,,,,,,,,,,,,,,,,,1995-12-25,F,,,,,70.2C,NAF1993,N,-1.908279,48.585498,0.91,locality,La Lande Devant Beaulieu 35430 Saint-Guinoux,35279_b215,G,LA LANDE DEVANT BEAULIEU,
327032314,00012,32703231400012,O,1983-04-11,NN,,,2019-11-14T14:00:34,false,4,,,,,BEAULIEU,35430,SAINT-GUINOUX,,,35279,,,,,,,,,,,,,,,,,,,2000-06-30,F,,,,,25.2H,NAF1993,O,-1.908279,48.585498,0.91,locality,La Lande Devant Beaulieu 35430 Saint-Guinoux,35279_b215,G,LA LANDE DEVANT BEAULIEU,
327484101,00016,32748410100016,O,1983-04-01,NN,,,2019-11-14T14:00:34,true,3,,,,,LE CLOS NEUF,35430,SAINT-GUINOUX,,,35279,,,,,,,,,,,,,,,,,,,2008-01-01,A,,,,,68.31Z,NAFRev2,N,-1.889167,48.579892,0.94,locality,Le Clos Neuf 35430 Saint-Guinoux,35279_b100,G,LE CLOS NEUF,
327596813,00045,32759681300045,O,2016-07-26,,,9529ZF,2021-02-23T10:49:07,true,3,,,,,LE TRELAT,35430,SAINT-GUINOUX,,,35279,,,,,,,,,,,,,,,,,,,2018-07-04,A,,,,,68.20A,NAFRev2,N,,,0,,,,,,
329338883,01169,32933888301169,O,2014-01-01,00,2018,,2020-08-25T10:33:46,false,3,,,,,ZA DE BEAULIEU,35430,SAINT-GUINOUX,,,35279,,,,,,,,,,,,,,,,,,,2018-01-01,F,CENTRE COLAS COTE D'EMERAUDE,,,,42.11Z,NAFRev2,O,-1.3872176,47.3042863,0.78,poi.3,Villa de Beaulieu (Patrimoine national) Mauves-sur-Loire,https://osm.org/node/1905310853,G,,
330588401,00019,33058840100019,O,,NN,,,2019-11-14T14:00:34,true,1,,7,,RUE,DES TULIPES,35430,SAINT-GUINOUX,,,35279,,,,,,,,,,,,,,,,,,,1989-06-13,F,,,,,69.11,NAP,N,-1.885889,48.577073,0.94,housenumber,7 Rue des Tulipes 35430 Saint-Guinoux,35279_0062_00007,G,7 RUE DES TULIPES,
330831082,00012,33083108200012,O,1984-09-03,NN,,,2019-11-14T14:00:34,false,4,,,,,LA HAUTE GARDE,35430,SAINT-GUINOUX,,,35279,,,,,,,,,,,,,,,,,,,1995-12-25,F,,,,,45.2J,NAF1993,O,-1.889908,48.59228,0.94,locality,La Haute Garde 35430 Saint-Guinoux,35279_b199,G,LA HAUTE GARDE,
330963661,00013,33096366100013,O,1984-04-01,NN,,,2019-11-14T14:00:34,true,4,,,,,LESSARD,35430,SAINT-GUINOUX,,,35279,,,,,,,,,,,,,,,,,,,2018-09-28,F,,,,,01.11Z,NAFRev2,N,-4.096644,48.0076,0.89,poi.pharmacy,Pharmacie Lessard Quimper,https://osm.org/node/330137985,G,,
332645035,00020,33264503500020,O,1990-07-01,NN,,,2019-11-14T14:00:34,true,3,,,,,BEAULIEU,35430,SAINT-GUINOUX,,,35279,,,,,,,,,,,,,,,,,,,2004-06-07,F,,,,,36.1K,NAFRev1,N,-1.908279,48.585498,0.91,locality,La Lande Devant Beaulieu 35430 Saint-Guinoux,35279_b215,G,LA LANDE DEVANT BEAULIEU,
333765568,00022,33376556800022,O,,NN,,,2019-11-14T14:00:34,true,1,,,,LD,LE PETIT CLOS,35430,SAINT-GUINOUX,,,35279,,,,,,,,,,,,,,,,,,,1987-08-15,F,,,,,05.0A,NAF1993,N,3.3517163,50.4853202,0.9,poi.camp_site,Le Petit Clos (Camping) Rumegies,https://osm.org/way/260614257,G,,
334072329,00017,33407232900017,O,,NN,,,2019-11-14T14:00:34,true,1,,,,PL,DE LA MAIRIE,35430,SAINT-GUINOUX,,,35279,,,,,,,,,,,,,,,,,,,1990-09-30,F,,,,,67.07,NAP,N,-1.883871,48.57699,0.76,street,Rue de la Mairie 35430 Saint-Guinoux,35279_0045,G,RUE DE LA MAIRIE,
334387883,00013,33438788300013,O,,NN,,,2019-11-14T14:00:34,true,1,,,,LD,LE PRAY,35430,SAINT-GUINOUX,,,35279,,,,,,,,,,,,,,,,,,,1993-12-30,F,,,,,18.2C,NAF1993,N,-1.888097,48.577554,0.8,locality,Le Domaine du Pray 35430 Saint-Guinoux,35279_b167,G,LE DOMAINE DU PRAY,
334642154,00010,33464215400010,O,1986-01-01,NN,,,2019-11-14T14:00:34,true,4,,,,,BOURG,35430,SAINT-GUINOUX,,,35279,,,,,,,,,,,,,,,,,,,1991-12-25,F,,,,,01.3Z,NAF1993,N,-1.229143,44.2011043,0.89,poi.school,École du bourg Mimizan,https://osm.org/way/35215942,G,,
337798201,00014,33779820100014,O,1986-05-12,NN,,,2019-11-14T14:00:34,true,3,,,,LD,LA CHENEVIERE LE LANDES,35430,SAINT-GUINOUX,,,35279,,,,,,,,,,,,,,,,,,,2005-12-31,F,,,,,45.3E,NAFRev1,N,,,0,,,,,,
340163195,00019,34016319500019,O,1987-02-01,NN,,,2021-02-23T10:56:15,true,4,,42,,RUE,DE LA SOURCE,35430,SAINT-GUINOUX,,,35279,,,,,,,,,,,,,,,,,,,2008-01-01,A,,,,,01.50Z,NAFRev2,N,-1.886703,48.574841,0.94,housenumber,42 Rue de la Source 35430 Saint-Guinoux,35279_0058_00042,G,42 RUE DE LA SOURCE,
340372051,00011,34037205100011,O,1987-02-26,NN,,,2019-11-14T14:00:34,true,3,,,,,BOURG,35430,SAINT-GUINOUX,,,35279,,,,,,,,,,,,,,,,,,,2008-01-01,A,,,,,01.41Z,NAFRev2,N,-1.229143,44.2011043,0.89,poi.school,École du bourg Mimizan,https://osm.org/way/35215942,G,,
340372309,00013,34037230900013,O,1967-02-11,NN,,,2019-11-14T14:00:34,true,3,,,,,BOURG,35430,SAINT-GUINOUX,,,35279,,,,,,,,,,,,,,,,,,,2008-01-01,A,,,,,01.41Z,NAFRev2,N,-1.229143,44.2011043,0.89,poi.school,École du bourg Mimizan,https://osm.org/way/35215942,G,,
340749431,00037,34074943100037,O,2012-09-18,,,,2021-02-23T10:56:41,true,1,,,,,LA GAIETE,35430,SAINT-GUINOUX,,,35279,,,,,,,,,,,,,,,,,,,2012-09-18,A,,,,,47.99A,NAFRev2,N,1.7746263,50.4729066,0.89,poi.cafe,Café de la Gaieté Neuville-sous-Montreuil,https://osm.org/node/454625292,G,,
340885110,00015,34088511000015,O,,NN,,,2019-11-14T14:00:34,true,1,,,,LD,LA VILLE AUBERT,35430,SAINT-GUINOUX,,,35279,,,,,,,,,,,,,,,,,,,1987-12-31,F,,,,,62.44,NAP,N,-1.900085,48.581592,0.94,locality,La Ville Aubert 35430 Saint-Guinoux,35279_b398,G,LA VILLE AUBERT,
340899780,00027,34089978000027,O,,,,,2019-11-14T14:00:34,true,1,,,,,MOULIN DE BONABAN,35430,SAINT-GUINOUX,,,35279,,,,,,,,,,,,,,,,,,,1989-07-25,F,,,,,57.03,NAP,N,,,0,,,,,,
343488318,00019,34348831800019,O,,NN,,,2019-11-14T14:00:34,true,1,,,,LD,LE COTTIN,35430,SAINT-GUINOUX,,,35279,,,,,,,,,,,,,,,,,,,1989-04-25,F,,,,,00.99,NAP,N,0.1988032,48.0051002,0.88,poi.beauty,Espace beauté Nadine Cottin Le Mans,https://osm.org/node/5178303205,G,,
344232731,00010,34423273100010,O,1988-01-01,NN,,,2019-11-14T14:00:34,true,3,,,,,BOURG,35430,SAINT-GUINOUX,,,35279,,,,,,,,,,,,,,,,,,,2008-01-01,A,,,,,01.41Z,NAFRev2,N,-1.229143,44.2011043,0.89,poi.school,École du bourg Mimizan,https://osm.org/way/35215942,G,,
344744867,00013,34474486700013,O,1988-04-06,NN,,,2019-11-14T14:00:34,true,3,LES SUETS,,,,MOULIN DE BONNABAN,35430,SAINT-GUINOUX,,,35279,,,,,,,,,,,,,,,,,,,2008-01-01,A,,,,,68.20B,NAFRev2,N,,,0,,,,,,
344953351,00014,34495335100014,O,1988-02-01,NN,,,2019-11-14T14:00:34,false,4,,,,,LE TRELAT,35430,SAINT-GUINOUX,,,35279,,,,,,,,,,,,,,,,,,,2000-06-30,F,,,,,45.2L,NAF1993,O,,,0,,,,,,
345393581,00011,34539358100011,O,1988-05-14,NN,,,2019-11-14T14:00:34,true,3,,,,,LA TOUESSE,35430,SAINT-GUINOUX,,,35279,,,,,,,,,,,,,,,,,,,2004-12-31,F,,,,,01.1A,NAFRev1,N,-1.9228303,48.6926027,0.9,poi.beach,Plage de la Touesse Saint-Coulomb,https://osm.org/way/290533002,G,,
349495523,00012,34949552300012,O,1989-01-01,01,2018,3831ZA,2020-08-25T10:44:08,true,4,,9,,RUE,DES CEDRES,35430,SAINT-GUINOUX,,,35279,,,,,,,,,,,,,,,,,,,2008-01-01,A,,,,,38.31Z,NAFRev2,O,-1.885734,48.576742,0.94,housenumber,9 Rue des Cedres 35430 Saint-Guinoux,35279_0008_00009,G,9 RUE DES CEDRES,
379390511,00010,37939051100010,O,1990-10-01,NN,,,2019-11-14T14:00:34,true,3,,,,,LE TRELAT,35430,SAINT-GUINOUX,,,35279,,,,,,,,,,,,,,,,,,,2008-01-01,A,,,,,68.20B,NAFRev2,N,,,0,,,,,,
379898471,00014,37989847100014,O,1990-10-01,NN,,,2019-11-14T14:00:34,true,3,,,,PL,DE LA MAIRIE,35430,SAINT-GUINOUX,,,35279,,,,,,,,,,,,,,,,,,,2005-05-31,F,,,,,55.4A,NAFRev1,N,-1.883871,48.57699,0.76,street,Rue de la Mairie 35430 Saint-Guinoux,35279_0045,G,RUE DE LA MAIRIE,
383184090,00017,38318409000017,O,1991-09-01,NN,,,2019-11-14T14:00:34,true,3,,2,,RUE,DU STADE,35430,SAINT-GUINOUX,,,35279,,,,,,,,,,,,,,,,,,,2008-01-01,A,,,,,01.11Z,NAFRev2,N,-1.881378,48.57624,0.94,housenumber,2 Rue du Stade 35430 Saint-Guinoux,35279_0060_00002,G,2 RUE DU STADE,
384199337,00013,38419933700013,O,1983-01-01,NN,,,2019-11-14T14:00:34,false,4,,,,,LE BIGNON,35430,SAINT-GUINOUX,,,35279,,,,,,,,,,,,,,,,,,,2000-12-31,F,,,,,01.1A,NAF1993,N,-1.884709,48.573106,0.94,street,Le Bignon 35430 Saint-Guinoux,35279_ymda6a,G,LE BIGNON,
384853123,00014,38485312300014,O,1992-01-01,NN,,,2019-11-14T14:00:34,true,1,,,,,LA TOUESSE,35430,SAINT-GUINOUX,,,35279,,,,,,,,,,,,,,,,,,,1998-12-31,F,,,,,01.1A,NAF1993,N,-1.9228303,48.6926027,0.9,poi.beach,Plage de la Touesse Saint-Coulomb,https://osm.org/way/290533002,G,,
385355805,00016,38535580500016,O,1992-04-03,NN,,,2019-11-14T14:00:34,false,4,,,,,BOURG,35430,SAINT-GUINOUX,,,35279,,,,,,,,,,,,,,,,,,,2000-03-29,F,,,,,15.8C,NAF1993,N,-1.229143,44.2011043,0.89,poi.school,École du bourg Mimizan,https://osm.org/way/35215942,G,,
387594666,00043,38759466600043,O,2008-03-01,NN,,4332AA,2019-11-14T14:00:34,true,2,,,,LD,BEAULIEU,35430,SAINT-GUINOUX,,,35279,,,,,,,,,,,,,,,,,,,2015-04-30,F,,,,,43.91A,NAFRev2,N,-1.908279,48.585498,0.91,locality,La Lande Devant Beaulieu 35430 Saint-Guinoux,35279_b215,G,LA LANDE DEVANT BEAULIEU,
387685605,00017,38768560500017,O,1992-05-01,01,2018,,2020-08-25T10:22:49,true,5,,,,,LE PRAY,35430,SAINT-GUINOUX,,,35279,,,,,,,,,,,,,,,,,,,2015-12-31,A,,,,,01.41Z,NAFRev2,O,-1.888097,48.577554,0.8,locality,Le Domaine du Pray 35430 Saint-Guinoux,35279_b167,G,LE DOMAINE DU PRAY,
387817042,00030,38781704200030,O,2017-10-01,,,,2019-11-14T14:00:34,true,3,LA BUTTE,,,HAM,LES FONTAINES,35430,SAINT-GUINOUX,,,35279,,,,,,,,,,,,,,,,,,,2018-12-30,F,,,,,18.13Z,NAFRev2,N,6.4002421,46.8352245,0.8,poi.fountain,(Fontaine) Les Fourgs,https://osm.org/node/866863213,G,,
388997603,00013,38899760300013,O,1992-10-29,NN,,,2019-11-14T14:00:34,false,4,,5,,LOT,DU CLOS BODOU,35430,SAINT-GUINOUX,,,35279,,,,,,,,,,,,,,,,,,,1996-07-01,F,PINOCCHIO,,,,15.8C,NAF1993,N,-1.888058,48.576505,0.71,housenumber,5 Rue du Clos Bodou 35430 Saint-Guinoux,35279_0012_00005,G,5 RUE DU CLOS BODOU,
391441516,00039,39144151600039,O,2002-10-28,NN,,,2019-11-14T14:00:34,false,3,,14,,RUE,DE LA MAIRIE,35430,SAINT-GUINOUX,,,35279,,,,,,,,,,,,,,,,,,,2002-12-25,F,,,,,74.4A,NAF1993,N,-1.883287,48.575896,0.94,housenumber,14 Rue de la Mairie 35430 Saint-Guinoux,35279_0045_00014,G,14 RUE DE LA MAIRIE,
394954929,00045,39495492900045,O,2010-11-15,,,,2021-02-23T11:20:44,true,1,,8,,RUE,DU CLOS BODOU,35430,SAINT-GUINOUX,,,35279,,,,,,,,,,,,,,,,,,,2010-11-15,A,,,,,90.03A,NAFRev2,N,-1.888665,48.576259,0.94,housenumber,8 Rue du Clos Bodou 35430 Saint-Guinoux,35279_0012_00008,G,8 RUE DU CLOS BODOU,
399506815,00014,39950681500014,O,1995-01-23,,,,2019-11-14T14:00:34,false,3,,,,,LA BASSE GARDE,35430,SAINT-GUINOUX,,,35279,,,,,,,,,,,,,,,,,,,1999-02-01,F,,,,,52.6D,NAF1993,N,-1.891894,48.590413,0.94,locality,La Basse Garde 35430 Saint-Guinoux,35279_b005,G,LA BASSE GARDE,
399506815,00022,39950681500022,O,1999-02-01,,,,2019-11-14T14:00:34,false,3,,5,,LOT,DES SAFRAIS,35430,SAINT-GUINOUX,,,35279,,,,,,,,,,,,,,,,,,,2000-11-01,F,,,,,52.6D,NAF1993,N,,,0,,,,,,
399506815,00030,39950681500030,O,2000-11-01,01,2018,,2020-08-25T10:32:02,true,4,,,,,LA HAUTE GARDE,35430,SAINT-GUINOUX,,,35279,,,,,,,,,,,,,,,,,,,2011-07-07,A,,,,,47.81Z,NAFRev2,O,-1.889908,48.59228,0.94,locality,La Haute Garde 35430 Saint-Guinoux,35279_b199,G,LA HAUTE GARDE,
400348298,00011,40034829800011,O,,NN,,,2019-11-14T14:00:34,true,1,,,,,LA BASSE GARDE,35430,SAINT-GUINOUX,,,35279,,,,,,,,,,,,,,,,,,,1995-12-31,F,,,,,93.0D,NAF1993,N,-1.891894,48.590413,0.94,locality,La Basse Garde 35430 Saint-Guinoux,35279_b005,G,LA BASSE GARDE,
402086672,00019,40208667200019,O,1982-01-01,NN,,,2019-11-14T14:00:34,true,1,,,,,BOURG,35430,SAINT-GUINOUX,,,35279,,,,,,,,,,,,,,,,,,,1998-12-31,F,,,,,01.3Z,NAF1993,N,-1.229143,44.2011043,0.89,poi.school,École du bourg Mimizan,https://osm.org/way/35215942,G,,
404048316,00016,40404831600016,O,1996-01-01,NN,,,2019-11-14T14:00:34,true,1,,,,,LA TOUESSE,35430,SAINT-GUINOUX,,,35279,,,,,,,,,,,,,,,,,,,1999-03-22,F,,,,,01.3Z,NAF1993,N,-1.9228303,48.6926027,0.9,poi.beach,Plage de la Touesse Saint-Coulomb,https://osm.org/way/290533002,G,,
404049249,00018,40404924900018,O,1996-02-09,NN,,,2019-11-14T14:00:34,true,3,,,,,LE BOURG,35430,SAINT-GUINOUX,,,35279,,,,,,,,,,,,,,,,,,,2008-01-01,A,,,,,68.20B,NAFRev2,N,2.212915,47.9910304,0.9,poi.bar,Le Bourg (Bar) Ingrannes,https://osm.org/node/1718543174,G,,
407764448,00012,40776444800012,O,1996-05-20,NN,,,2019-11-14T14:00:34,true,3,,,,,LES LANDES PONTS,35430,SAINT-GUINOUX,,,35279,,,,,,,,,,,,,,,,,,,1996-12-25,F,,,,,52.6E,NAF1993,N,-1.161672,45.7389947,0.78,poi,Passe des Landes (Pont) Les Mathes,https://osm.org/way/83923650,G,,
407826320,00019,40782632000019,O,1982-12-31,NN,,,2019-11-14T14:00:34,true,1,,,,,MAUPERTUIS,35430,SAINT-GUINOUX,,,35279,,,,,,,,,,,,,,,,,,,2002-12-31,F,,,,,01.1A,NAF1993,N,5.7464357,45.1055172,0.89,poi.shelter,Maupertuis (Abri) Jarrie,https://osm.org/way/78577646,G,,
407826338,00011,40782633800011,O,1982-12-31,NN,,,2019-11-14T14:00:34,true,1,,,,,VEAU DORE,35430,SAINT-GUINOUX,,,35279,,,,,,,,,,,,,,,,,,,1998-12-31,F,,,,,01.1A,NAF1993,N,,,0,,,,,,
407826346,00014,40782634600014,O,1990-10-01,NN,,,2019-11-14T14:00:34,true,3,,,,,LA RENAUDAIS,35430,SAINT-GUINOUX,,,35279,,,,,,,,,,,,,,,,,,,2008-01-01,A,,,,,01.11Z,NAFRev2,N,-1.0513572,48.5957915,0.75,poi.river,L'Argonce (Rivière) Grandparigny,https://osm.org/relation/4116827,G,,
410504799,00017,41050479900017,O,1997-02-01,00,2018,,2020-08-25T10:38:53,true,5,,,,,LA RENAUDAIS,35430,SAINT-GUINOUX,,,35279,,,,,,,,,,,,,,,,,,,2018-10-31,A,,,,,47.81Z,NAFRev2,N,-1.0513572,48.5957915,0.75,poi.river,L'Argonce (Rivière) Grandparigny,https://osm.org/relation/4116827,G,,
410592117,00031,41059211700031,O,2007-09-05,,,,2019-11-14T14:00:34,true,3,LES SUETS,,,,,35430,SAINT-GUINOUX,,,35279,,,,,,,,,,,,,,,,,,,2015-12-31,F,,,,,68.20B,NAFRev2,N,,,0,,,,,,
410860449,00017,41086044900017,O,,NN,,,2019-11-14T14:00:34,true,1,,,,,COTTIN,35430,SAINT-GUINOUX,,,35279,,,,,,,,,,,,,,,,,,,1997-01-31,F,,,,,01.3Z,NAF1993,N,-1.886564,48.57425,0.92,street,Rue du Cottin 35430 Saint-Guinoux,35279_0015,G,RUE DU COTTIN,
414001164,00014,41400116400014,O,1997-02-01,NN,,,2019-11-14T14:00:34,true,1,,,,,COTTIN,35430,SAINT-GUINOUX,,,35279,,,,,,,,,,,,,,,,,,,2002-12-31,F,,,,,01.2A,NAF1993,N,-1.886564,48.57425,0.92,street,Rue du Cottin 35430 Saint-Guinoux,35279_0015,G,RUE DU COTTIN,
419843560,00014,41984356000014,O,1998-07-02,NN,,,2019-11-14T14:00:34,true,6,,4,,PL,DE L'EGLISE,35430,SAINT-GUINOUX,,,35279,,,,,,,,,,,,,,,,,,,2012-05-01,A,,,,,56.10A,NAFRev2,O,-1.882568,48.575718,0.83,housenumber,4 Place de l'Eglise 35430 Saint-Guinoux,35279_0038_00004,G,4 PLACE DE L EGLISE,
420817868,00037,42081786800037,O,2014-07-15,,,1085ZZ,2020-11-11T04:16:13,false,2,,1,,,LE CLOS PRINCE,35430,SAINT-GUINOUX,,,35279,,,,,,,,,,,,,,,,,,,2020-03-12,F,,,,M.G KERPIZZA,56.10C,NAFRev2,N,-1.890924,48.577108,0.73,housenumber,1 Allee du Clos Prince 35430 Saint-Guinoux,35279_0011_00001,G,1 ALLEE DU CLOS PRINCE,
421776352,00013,42177635200013,O,1999-01-01,NN,,,2019-11-14T14:00:34,true,4,LE BOURG,,,,BOURG,35430,SAINT-GUINOUX,,,35279,,,,,,,,,,,,,,,,,,,2008-02-01,A,,,,,68.20B,NAFRev2,N,-1.229143,44.2011043,0.89,poi.school,École du bourg Mimizan,https://osm.org/way/35215942,G,,
422132258,00019,42213225800019,O,1999-01-01,NN,,,2019-11-14T14:00:34,true,3,,,,,LE VEAU DORE,35430,SAINT-GUINOUX,,,35279,,,,,,,,,,,,,,,,,,,2006-02-28,F,,,,,01.1C,NAFRev1,N,,,0,,,,,,
422591461,00013,42259146100013,O,1999-01-01,NN,,,2019-11-14T14:00:34,true,1,,,,,LA TOUESSE,35430,SAINT-GUINOUX,,,35279,,,,,,,,,,,,,,,,,,,2001-12-31,F,,,,,01.1A,NAF1993,N,-1.9228303,48.6926027,0.9,poi.beach,Plage de la Touesse Saint-Coulomb,https://osm.org/way/290533002,G,,
424034221,00012,42403422100012,O,1999-09-01,NN,,,2019-11-14T14:00:34,true,4,,7,,RUE,DES TULIPES,35430,SAINT-GUINOUX,,,35279,,,,,,,,,,,,,,,,,,,2002-09-03,F,,,,,45.1A,NAF1993,N,-1.885889,48.577073,0.94,housenumber,7 Rue des Tulipes 35430 Saint-Guinoux,35279_0062_00007,G,7 RUE DES TULIPES,
424198604,00029,42419860400029,O,2000-04-17,NN,,,2019-11-14T14:00:34,false,3,,17,,,MAIRIE,35430,SAINT-GUINOUX,,,35279,,,,,,,,,,,,,,,,,,,2003-12-25,F,,,,,85.1G,NAFRev1,N,-1.883396,48.576431,0.83,housenumber,17 Rue de la Mairie 35430 Saint-Guinoux,35279_0045_00017,G,17 RUE DE LA MAIRIE,