siren,nic,siret,statutDiffusionEtablissement,dateCreationEtablissement,trancheEffectifsEtablissement,anneeEffectifsEtablissement,activitePrincipaleRegistreMetiersEtablissement,dateDernierTraitementEtablissement,etablissementSiege,nombrePeriodesEtablissement,complementAdresseEtablissement,numeroVoieEtablissement,indiceRepetitionEtablissement,typeVoieEtablissement,libelleVoieEtablissement,codePostalEtablissement,libelleCommuneEtablissement,libelleCommuneEtrangerEtablissement,distributionSpecialeEtablissement,codeCommuneEtablissement,codeCedexEtablissement,libelleCedexEtablissement,codePaysEtrangerEtablissement,libellePaysEtrangerEtablissement,complementAdresse2Etablissement,numeroVoie2Etablissement,indiceRepetition2Etablissement,typeVoie2Etablissement,libelleVoie2Etablissement,codePostal2Etablissement,libelleCommune2Etablissement,libelleCommuneEtranger2Etablissement,distributionSpeciale2Etablissement,codeCommune2Etablissement,codeCedex2Etablissement,libelleCedex2Etablissement,codePaysEtranger2Etablissement,libellePaysEtranger2Etablissement,dateDebut,etatAdministratifEtablissement,enseigne1Etablissement,enseigne2Etablissement,enseigne3Etablissement,denominationUsuelleEtablissement,activitePrincipaleEtablissement,nomenclatureActivitePrincipaleEtablissement,caractereEmployeurEtablissement,longitude,latitude,geo_score,geo_type,geo_adresse,geo_id,geo_ligne,geo_l4,geo_l5
200012680,00019,20001268000019,O,2007-12-04,,,,2019-11-14T14:00:36,true,1,MAIRIE,1,,PL,ST ROCH,39200,AVIGNON-LES-SAINT-CLAUDE,,,39032,,,,,,,,,,,,,,,,,,,2007-12-04,A,,,,,42.99Z,NAFRev2,N,3.8756502,43.6083675,0.73,poi.artwork,Place St Roch (Œuvre d'art) Montpellier,https://osm.org/way/265386555,G,,
213900327,00015,21390032700015,O,1983-03-01,02,2018,,2020-08-25T10:17:07,true,4,,1,,PL,SAINT ROCH,39200,AVIGNON-LES-SAINT-CLAUDE,,,39032,,,,,,,,,,,,,,,,,,,2008-01-01,A,MAIRIE,,,,84.11Z,NAFRev2,O,5.845571,46.389952,0.82,housenumber,1 Place Saint Roch 39200 Avignon-lès-Saint-Claude,39032_0055_00001,G,1 PLACE SAINT ROCH,
213900327,00023,21390032700023,O,1983-12-21,NN,,,2019-11-14T14:00:36,false,3,,,,,,39200,AVIGNON-LES-SAINT-CLAUDE,,,39032,,,,,,,,,,,,,,,,,,,2008-01-01,A,ECOLE PRIMAIRE PUBLIQUE,,,,85.20Z,NAFRev2,N,,,0,,,,,,
213900327,00031,21390032700031,O,1996-12-25,NN,,,2019-11-14T14:00:36,false,2,MAIRIE,,,,,39200,AVIGNON-LES-SAINT-CLAUDE,,,39032,,,,,,,,,,,,,,,,,,,2008-01-01,A,SERVICE EAU ET ASSAINISSEMENT,,,,36.00Z,NAFRev2,N,,,0,,,,,,
263900326,00012,26390032600012,O,1983-03-01,NN,,,2019-11-14T14:00:36,true,4,,,,,MAIRIE,39200,AVIGNON-LES-SAINT-CLAUDE,,,39032,,,,,,,,,,,,,,,,,,,2016-01-01,F,CCAS,,,,88.99B,NAFRev2,N,3.0709671,50.6304695,0.92,poi.townhall,Hôtel de Ville Lille,https://osm.org/way/40917078,G,,
263905127,00019,26390512700019,O,1986-01-01,NN,,,2019-11-14T14:00:36,true,4,MAIRIE,,,,,39200,AVIGNON-LES-SAINT-CLAUDE,,,39032,,,,,,,,,,,,,,,,,,,2011-12-31,F,CDE,,,,88.99B,NAFRev2,N,,,0,,,,,,
273900563,00019,27390056300019,O,,,,,2019-11-14T14:00:36,true,1,,,,,MAIRIE,39200,AVIGNON-LES-SAINT-CLAUDE,,,39032,,,,,,,,,,,,,,,,,,,1995-12-25,F,,,,,41.0Z,NAF1993,N,3.0709671,50.6304695,0.92,poi.townhall,Hôtel de Ville Lille,https://osm.org/way/40917078,G,,
300648821,00019,30064882100019,O,,NN,,,2019-11-14T14:00:36,true,1,,,,,,39200,AVIGNON-LES-SAINT-CLAUDE,,,39032,,,,,,,,,,,,,,,,,,,1988-12-31,F,,,,,55.40,NAP,N,,,0,,,,,,
304608029,00027,30460802900027,O,1900-01-01,,,,2019-11-14T14:00:36,false,4,,,,,,39200,AVIGNON-LES-SAINT-CLAUDE,,,39032,,,,,,,,,,,,,,,,,,,1988-12-25,F,,,,,54.04,NAP,N,,,0,,,,,,
306674219,00028,30667421900028,O,,NN,,,2019-11-14T14:00:36,true,1,,,,,,39200,AVIGNON-LES-SAINT-CLAUDE,,,39032,,,,,,,,,,,,,,,,,,,1995-11-30,F,,,,,36.6E,NAF1993,N,,,0,,,,,,
310703251,00010,31070325100010,O,,,,,2019-11-14T14:00:36,true,1,,,,,AU VERGER,39200,AVIGNON-LES-SAINT-CLAUDE,,,39032,,,,,,,,,,,,,,,,,,,1995-12-25,F,,,,,70.2C,NAF1993,N,-0.0974071,49.2857562,0.88,poi.convenience,Au Verger Normand (Épicerie) Dives-sur-Mer,https://osm.org/way/99695782,G,,
318387875,00038,31838787500038,O,2010-10-18,,,,2021-02-23T10:43:01,true,1,,16,,,LES 3 MAISONS,39200,AVIGNON-LES-SAINT-CLAUDE,,,39032,,,,,,,,,,,,,,,,,,,2010-10-18,A,,,,,86.90E,NAFRev2,N,5.84941,46.38681,0.93,housenumber,16 Les 3 Maisons 39200 Avignon-lès-Saint-Claude,39032_b047_00016,G,16 LES 3 MAISONS,
321574014,00015,32157401400015,O,,NN,,,2019-11-14T14:00:36,true,1,,,,,,39200,AVIGNON-LES-SAINT-CLAUDE,,,39032,,,,,,,,,,,,,,,,,,,1988-12-31,F,,,,,02.20,NAP,N,,,0,,,,,,
323103606,00014,32310360600014,O,,NN,,,2019-11-14T14:00:36,true,1,,,,,LES PINS,39200,AVIGNON-LES-SAINT-CLAUDE,,,39032,,,,,,,,,,,,,,,,,,,1989-12-30,F,,,,,54.04,NAP,N,5.84482,46.392365,0.9,street,Impasse des Pins 39200 Avignon-lès-Saint-Claude,39032_0045,G,IMPASSE DES PINS,
326676939,00019,32667693900019,O,1983-02-23,NN,,,2019-11-14T14:00:36,true,3,,,,LOT,LES 3 MAISONS,39200,AVIGNON-LES-SAINT-CLAUDE,,,39032,,,,,,,,,,,,,,,,,,,2008-01-01,A,,,,,41.10D,NAFRev2,N,5.854022,46.390672,0.75,street,Les 3 Maisons 39200 Avignon-lès-Saint-Claude,39032_b047,G,LES 3 MAISONS,
328361936,00037,32836193600037,O,2018-06-01,,,,2021-02-23T10:49:35,true,1,,23,,,LES TROIS MAISONS,39200,AVIGNON-LES-SAINT-CLAUDE,,,39032,,,,,,,,,,,,,,,,,,,2018-06-01,A,,,,,01.49Z,NAFRev2,N,3.7357249,48.4343079,0.9,poi.townhall,(Hôtel de ville) Ossey-les-Trois-Maisons,https://osm.org/way/228596042,G,,
340096593,00017,34009659300017,O,1900-01-01,NN,,,2019-11-14T14:00:36,true,5,,4,,,LES TROIS MAISONS,39200,AVIGNON-LES-SAINT-CLAUDE,,,39032,,,,,,,,,,,,,,,,,,,2019-09-24,A,,,,,63.12Z,NAFRev2,N,3.7357249,48.4343079,0.9,poi.townhall,(Hôtel de ville) Ossey-les-Trois-Maisons,https://osm.org/way/228596042,G,,
343900106,00018,34390010600018,O,1988-01-01,NN,,,2019-11-14T14:00:36,true,5,,,,,,39200,AVIGNON-LES-SAINT-CLAUDE,,,39032,,,,,,,,,,,,,,,,,,,2014-12-31,A,,,,,46.18Z,NAFRev2,N,,,0,,,,,,
349385724,00019,34938572400019,O,1989-01-01,NN,,,2019-11-14T14:00:36,true,6,,,,,AU VERGER,39200,AVIGNON-LES-SAINT-CLAUDE,,,39032,,,,,,,,,,,,,,,,,,,2007-02-05,F,,,,,28.5D,NAFRev1,O,-0.0974071,49.2857562,0.88,poi.convenience,Au Verger Normand (Épicerie) Dives-sur-Mer,https://osm.org/way/99695782,G,,
379776065,00011,37977606500011,O,1990-09-29,NN,,,2019-11-14T14:00:36,true,3,,,,,,39200,AVIGNON-LES-SAINT-CLAUDE,,,39032,,,,,,,,,,,,,,,,,,,2008-01-01,A,,,,,68.20A,NAFRev2,N,,,0,,,,,,
381213495,00025,38121349500025,O,1992-07-03,NN,,,2019-11-14T14:00:36,false,3,,,,,,39200,AVIGNON-LES-SAINT-CLAUDE,,,39032,,,,,,,,,,,,,,,,,,,1992-12-25,F,,,,,85.1G,NAF1993,N,,,0,,,,,,
398231027,00010,39823102700010,O,1994-01-01,03,2018,1629ZA,2020-08-25T10:30:43,true,4,,,,,LES TROIS MAISONS,39200,AVIGNON-LES-SAINT-CLAUDE,,,39032,,,,,,,,,,,,,,,,,,,2008-01-01,A,,,,,16.29Z,NAFRev2,O,3.7357249,48.4343079,0.9,poi.townhall,(Hôtel de ville) Ossey-les-Trois-Maisons,https://osm.org/way/228596042,G,,
402517965,00024,40251796500024,O,2010-09-28,,,,2019-11-14T14:00:36,true,2,,11,,,LES TROIS MAISONS,39200,AVIGNON-LES-SAINT-CLAUDE,,,39032,,,,,,,,,,,,,,,,,,,2011-12-01,F,,,,,85.52Z,NAFRev2,N,3.7357249,48.4343079,0.9,poi.townhall,(Hôtel de ville) Ossey-les-Trois-Maisons,https://osm.org/way/228596042,G,,
403651649,00028,40365164900028,O,1999-02-01,,,,2019-11-14T14:00:36,true,4,,3,,RTE,DE ST-CLAUDE,39200,AVIGNON-LES-SAINT-CLAUDE,,,39032,,,,,,,,,,,,,,,,,,,2004-03-31,F,,,,,45.3F,NAFRev1,N,5.846035,46.389797,0.73,housenumber,3 Route de Saint-claude 39200 Avignon-lès-Saint-Claude,39032_0050_00003,G,3 ROUTE DE SAINT CLAUDE,
408637320,00016,40863732000016,O,1996-08-01,NN,,,2019-11-14T14:00:36,false,4,,,,LOT,LES PINS,39200,AVIGNON-LES-SAINT-CLAUDE,,,39032,,,,,,,,,,,,,,,,,,,1999-12-31,F,,,,,67.2Z,NAF1993,N,,,0,,,,,,
411351315,00030,41135131500030,O,2016-02-18,,,,2021-02-23T11:33:36,true,1,L'ESSARD,4,,RUE,DE LA FAUCILLE,39200,AVIGNON-LES-SAINT-CLAUDE,,,39032,,,,,,,,,,,,,,,,,,,2016-02-18,A,,,,,82.19Z,NAFRev2,N,,,0,,,,,,
414035634,00016,41403563400016,O,1997-09-27,NN,,,2019-11-14T14:00:36,true,3,,,,,LES TROIS MAISONS,39200,AVIGNON-LES-SAINT-CLAUDE,,,39032,,,,,,,,,,,,,,,,,,,2008-01-01,A,,,,,68.20B,NAFRev2,N,3.7357249,48.4343079,0.9,poi.townhall,(Hôtel de ville) Ossey-les-Trois-Maisons,https://osm.org/way/228596042,G,,
419425152,00040,41942515200040,O,2009-02-01,,,,2019-11-14T14:00:36,false,2,,21,,,LES TROIS MAISONS,39200,AVIGNON-LES-SAINT-CLAUDE,,,39032,,,,,,,,,,,,,,,,,,,2018-10-08,F,,,,,64.20Z,NAFRev2,N,3.7357249,48.4343079,0.9,poi.townhall,(Hôtel de ville) Ossey-les-Trois-Maisons,https://osm.org/way/228596042,G,,
421058314,00012,42105831400012,O,1998-11-04,NN,,,2019-11-14T14:00:36,true,3,LOTISSEMENT DES PINS,,,IMP,DES GENEVRIERS,39200,AVIGNON-LES-SAINT-CLAUDE,,,39032,,,,,,,,,,,,,,,,,,,2008-01-01,A,,,,,68.20B,NAFRev2,N,5.844313,46.393729,0.84,street,Impasse des Genévriers 39200 Avignon-lès-Saint-Claude,39032_0040,G,IMPASSE DES GENEVRIERS,
424486348,00016,42448634800016,O,1989-04-01,NN,,,2019-11-14T14:00:36,true,3,,,,,,39200,AVIGNON-LES-SAINT-CLAUDE,,,39032,,,,,,,,,,,,,,,,,,,2008-01-01,A,,,,,47.89Z,NAFRev2,N,,,0,,,,,,
430614768,00017,43061476800017,O,1998-01-01,NN,,,2019-11-14T14:00:36,true,3,,,,,AU VILLAGE,39200,AVIGNON-LES-SAINT-CLAUDE,,,39032,,,,,,,,,,,,,,,,,,,2008-01-01,A,,,,,02.20Z,NAFRev2,N,-1.6854522,47.8876296,0.9,poi.cafe,Au Village (Café) Poligné,https://osm.org/node/4456269839,G,,
431319730,00013,43131973000013,O,2000-04-26,NN,,,2019-11-14T14:00:36,true,3,M. CURTIL BERNARD,,,,LES TROIS MAISONS,39200,AVIGNON-LES-SAINT-CLAUDE,,,39032,,,,,,,,,,,,,,,,,,,2008-01-01,A,,,,,68.20B,NAFRev2,N,3.7357249,48.4343079,0.9,poi.townhall,(Hôtel de ville) Ossey-les-Trois-Maisons,https://osm.org/way/228596042,G,,
441215183,00019,44121518300019,O,2002-02-07,NN,,,2019-11-14T14:00:36,true,3,,1,,CHE,DE LA BATAILLE,39200,AVIGNON-LES-SAINT-CLAUDE,,,39032,,,,,,,,,,,,,,,,,,,2007-01-04,F,,,,,45.3E,NAFRev1,O,5.845643,46.389711,0.85,housenumber,1 Chemin de la Bataille 39200 Avignon-lès-Saint-Claude,39032_0005_00001,G,1 CHEMIN DE LA BATAILLE,
442489167,00019,44248916700019,O,2002-06-20,NN,,,2020-10-08T03:56:48,true,3,,2,,RUE,DES TROIS MAISONS,39200,AVIGNON-LES-SAINT-CLAUDE,,,39032,,,,,,,,,,,,,,,,,,,2008-01-01,A,,,,,68.20B,NAFRev2,N,,,0,,,,,,
453534380,00010,45353438000010,O,2004-04-01,NN,,,2019-11-14T14:00:36,true,4,,,,,LES TROIS MAISONS,39200,AVIGNON-LES-SAINT-CLAUDE,,,39032,,,,,,,,,,,,,,,,,,,2008-12-31,F,,,,,70.22Z,NAFRev2,N,3.7357249,48.4343079,0.9,poi.townhall,(Hôtel de ville) Ossey-les-Trois-Maisons,https://osm.org/way/228596042,G,,
489631804,00015,48963180400015,O,2006-03-17,,,,2019-11-14T14:00:36,true,2,,4,,RUE,DU CHAMP BELLAND,39200,AVIGNON-LES-SAINT-CLAUDE,,,39032,,,,,,,,,,,,,,,,,,,2008-01-01,A,,,,,68.20B,NAFRev2,N,5.847788,46.389455,0.93,housenumber,4 Rue du Champ Belland 39200 Avignon-lès-Saint-Claude,39032_0015_00004,G,4 RUE DU CHAMP BELLAND,
494927031,00018,49492703100018,O,2007-03-14,,,,2019-11-14T14:00:36,true,2,,15,,RUE,LA BOUSSIERE,39200,AVIGNON-LES-SAINT-CLAUDE,,,39032,,,,,,,,,,,,,,,,,,,2008-01-01,A,,,,,68.20B,NAFRev2,N,5.84468,46.39348,0.93,housenumber,15 Rue de la Boussière 39200 Avignon-lès-Saint-Claude,39032_0010_00015,G,15 RUE DE LA BOUSSIERE,
495404436,00018,49540443600018,O,2007-05-01,,,,2019-11-14T14:00:36,false,5,,4,,RUE,DU CHAMP BELLAND,39200,AVIGNON-LES-SAINT-CLAUDE,,,39032,,,,,,,,,,,,,,,,,,,2010-05-03,F,,,,,71.12B,NAFRev2,N,5.847788,46.389455,0.93,housenumber,4 Rue du Champ Belland 39200 Avignon-lès-Saint-Claude,39032_0015_00004,G,4 RUE DU CHAMP BELLAND,
497926790,00013,49792679000013,O,2006-01-01,,,,2019-11-14T14:00:36,true,2,,8,,RTE,DE SAINT CLAUDE,39200,AVIGNON-LES-SAINT-CLAUDE,,,39032,,,,,,,,,,,,,,,,,,,2008-01-01,A,,,,,02.20Z,NAFRev2,N,5.847549,46.390463,0.85,housenumber,8 Route de Saint-claude 39200 Avignon-lès-Saint-Claude,39032_0050_00008,G,8 ROUTE DE SAINT CLAUDE,
513699355,00014,51369935500014,O,2009-04-06,,,,2019-11-14T14:00:36,true,1,,,,LD,LE VILLAGE,39200,AVIGNON-LES-SAINT-CLAUDE,,,39032,,,,,,,,,,,,,,,,,,,2009-04-06,F,,,,,02.10Z,NAFRev2,N,2.2950702,48.9311749,0.9,poi.bar,bar le village Gennevilliers,https://osm.org/node/3287755128,G,,
514974351,00033,51497435100033,O,2010-09-01,NN,,,2019-11-14T14:00:36,true,2,LIEU DIT SOUS LES PUITS,12,,RTE,DE SAINT CLAUDE,39200,AVIGNON-LES-SAINT-CLAUDE,,,39032,,,,,,,,,,,,,,,,,,,2011-03-31,F,,,,UNICHARPENTE,43.91A,NAFRev2,O,5.848074,46.391235,0.85,housenumber,12 Route de Saint-claude 39200 Avignon-lès-Saint-Claude,39032_0050_00012,G,12 ROUTE DE SAINT CLAUDE,
515402592,00015,51540259200015,O,2009-09-04,,,,2019-11-14T14:00:36,true,1,,7,,RUE,DES VERGERS,39200,AVIGNON-LES-SAINT-CLAUDE,,,39032,,,,,,,,,,,,,,,,,,,2009-09-04,A,,,,,68.20B,NAFRev2,N,5.847327,46.391829,0.93,housenumber,7 Rue des Vergers 39200 Avignon-lès-Saint-Claude,39032_0060_00007,G,7 RUE DES VERGERS,
518757125,00019,51875712500019,O,2009-11-01,,,,2019-11-14T14:00:36,true,1,,,,,LES ADRAITS /VAUCLUSE,39200,AVIGNON-LES-SAINT-CLAUDE,,,39032,,,,,,,,,,,,,,,,,,,2009-11-01,A,,,,,71.11Z,NAFRev2,N,,,0,,,,,,
521330266,00011,52133026600011,O,2010-03-20,,,,2019-11-14T14:00:36,true,2,,10,,RUE,DES VERGERS,39200,AVIGNON-LES-SAINT-CLAUDE,,,39032,,,,,,,,,,,,,,,,,,,2014-01-21,F,,,,,43.32A,NAFRev2,N,5.846465,46.391176,0.93,housenumber,10 Rue des Vergers 39200 Avignon-lès-Saint-Claude,39032_0060_00010,G,10 RUE DES VERGERS,
522312891,00032,52231289100032,O,2014-02-10,,,,2019-11-14T14:00:36,false,3,,1,,,CHEMIN DU CROZET,39200,AVIGNON-LES-SAINT-CLAUDE,,,39032,,,,,,,,,,,,,,,,,,,2018-01-31,F,,,,,62.01Z,NAFRev2,N,5.842276,46.393782,0.93,housenumber,1 Chemin du Crozet 39200 Avignon-lès-Saint-Claude,39032_0030_00001,G,1 CHEMIN DU CROZET,
528599731,00015,52859973100015,O,2010-11-18,,,,2019-11-14T14:00:36,true,1,,28,,RUE,DE LA BOUSSIERE,39200,AVIGNON-LES-SAINT-CLAUDE,,,39032,,,,,,,,,,,,,,,,,,,2010-11-18,A,,,,,64.20Z,NAFRev2,N,5.842861,46.39323,0.93,housenumber,28 Rue de la Boussière 39200 Avignon-lès-Saint-Claude,39032_0010_00028,G,28 RUE DE LA BOUSSIERE,
646741512,00016,64674151200016,O,,NN,,,2019-11-14T14:00:36,true,1,,,,,,39200,AVIGNON-LES-SAINT-CLAUDE,,,39032,,,,,,,,,,,,,,,,,,,1987-12-31,F,,,,,60.09,NAP,N,,,0,,,,,,
750115974,00016,75011597400016,O,2012-03-05,,,,2019-11-14T14:00:36,true,2,,16,,CHE,DU CHAZAL,39200,AVIGNON-LES-SAINT-CLAUDE,,,39032,,,,,,,,,,,,,,,,,,,2013-12-01,F,,,,,46.19B,NAFRev2,N,5.84619,46.389475,0.82,housenumber,16 Chemin du Chazal 39200 Avignon-lès-Saint-Claude,39032_0025_00016,G,16 CHEMIN DU CHAZAL,
750794141,00010,75079414100010,O,2012-04-02,,,,2019-11-14T14:00:36,true,2,,1,,,SUR LA COTE,39200,AVIGNON-LES-SAINT-CLAUDE,,,39032,,,,,,,,,,,,,,,,,,,2012-08-20,F,,,,,74.30Z,NAFRev2,N,5.5597168,48.6218759,0.9,poi.forest,Sur la Côte (Forêt) Villeroy-sur-Méholle,https://osm.org/way/395503519,G,,
751027970,00019,75102797000019,O,2012-05-02,,,,2019-11-14T14:00:36,true,1,,,,,20 RUE DU TRUC,39200,AVIGNON-LES-SAINT-CLAUDE,,,39032,,,,,,,,,,,,,,,,,,,2012-05-02,A,,,,,18.13Z,NAFRev2,N,,,0,,,,,,
778362350,00010,77836235000010,O,,NN,,,2019-11-14T14:00:36,true,1,,,,,,39200,AVIGNON-LES-SAINT-CLAUDE,,,39032,,,,,,,,,,,,,,,,,,,1987-06-30,F,,,,,65.06,NAP,N,,,0,,,,,,
778362368,00012,77836236800012,O,,,,,2019-11-14T14:00:36,true,1,,,,,,39200,AVIGNON-LES-SAINT-CLAUDE,,,39032,,,,,,,,,,,,,,,,,,,1985-12-25,F,,,,,55.73,NAP,N,,,0,,,,,,
778362376,00023,77836237600023,O,1994-01-01,NN,,,2019-11-14T14:00:36,true,3,,,,,LES 3 MAISONS,39200,AVIGNON-LES-SAINT-CLAUDE,,,39032,,,,,,,,,,,,,,,,,,,2001-03-31,F,,,,,70.2C,NAF1993,N,5.854022,46.390672,0.93,street,Les 3 Maisons 39200 Avignon-lès-Saint-Claude,39032_b047,G,LES 3 MAISONS,
778362384,00019,77836238400019,O,,NN,,,2019-11-14T14:00:36,true,1,,,,,,39200,AVIGNON-LES-SAINT-CLAUDE,,,39032,,,,,,,,,,,,,,,,,,,1987-09-30,F,,,,,67.05,NAP,N,,,0,,,,,,
778362418,00015,77836241800015,O,1900-01-01,,,,2019-11-14T14:00:36,true,3,,,,,,39200,AVIGNON-LES-SAINT-CLAUDE,,,39032,,,,,,,,,,,,,,,,,,,2003-05-13,F,,,,,66.0G,NAFRev1,N,,,0,,,,,,
778419408,00027,77841940800027,O,1977-08-01,NN,,,2019-11-14T14:00:36,true,4,,,,LOT,LES GENEVRIERS,39200,AVIGNON-LES-SAINT-CLAUDE,,,39032,,,,,,,,,,,,,,,,,,,2003-03-31,F,,,,,45.4M,NAFRev1,N,5.844313,46.393729,0.72,street,Impasse des Genévriers 39200 Avignon-lès-Saint-Claude,39032_0040,G,IMPASSE DES GENEVRIERS,
778419903,00035,77841990300035,O,2003-01-01,NN,,,2019-11-14T14:00:36,true,4,,,,,SUR LES CHAVANNES,39200,AVIGNON-LES-SAINT-CLAUDE,,,39032,,,,,,,,,,,,,,,,,,,2008-01-01,F,,,,,02.20Z,NAFRev2,N,4.9810481,46.4439046,0.83,poi.camp_site,Les Rippettes (Camping) Chavannes-sur-Reyssouze,https://osm.org/way/222054016,G,,
778422063,00025,77842206300025,O,,NN,,,2019-11-14T14:00:36,true,1,,,,,,39200,AVIGNON-LES-SAINT-CLAUDE,,,39032,,,,,,,,,,,,,,,,,,,,F,,,,,84.10,NAP,N,,,0,,,,,,
798331807,00015,79833180700015,O,1988-03-27,,,,2020-01-28T09:31:16,false,2,CHEZ MADAME JACQUELINE VUITTON,3,,IMP,DES GENEVRIERS,39200,AVIGNON-LES-SAINT-CLAUDE,,,39032,,,,,,,,,,,,,,,,,,,2016-12-27,F,,,,,94.99Z,NAFRev2,N,5.844461,46.394215,0.85,housenumber,3 Impasse des Genévriers 39200 Avignon-lès-Saint-Claude,39032_0040_00003,G,3 IMPASSE DES GENEVRIERS,
818884587,00036,81888458700036,O,2019-05-01,,,4332AA,2021-02-23T17:37:05,true,1,,8,,IMP,DES ORCHIDEES,39200,AVIGNON-LES-SAINT-CLAUDE,,,39032,,,,,,,,,,,,,,,,,,,2019-05-01,A,,,,LC'MENUISERIE,43.32A,NAFRev2,N,5.846443,46.393309,0.84,housenumber,8 Impasse des Orchidées 39200 Avignon-lès-Saint-Claude,39032_0042_00008,G,8 IMPASSE DES ORCHIDEES,
824305940,00010,82430594000010,O,2016-10-06,,,,2019-11-14T14:00:36,true,1,,3,,RTE,DE SAINT CLAUDE,39200,AVIGNON-LES-SAINT-CLAUDE,,,39032,,,,,,,,,,,,,,,,,,,2016-10-06,A,,,,,47.99A,NAFRev2,N,5.846035,46.389797,0.85,housenumber,3 Route de Saint-claude 39200 Avignon-lès-Saint-Claude,39032_0050_00003,G,3 ROUTE DE SAINT CLAUDE,
834066995,00012,83406699500012,O,2017-12-05,,,,2019-11-14T14:00:36,false,2,4 IMPASSE DES ORCHIDEES,,,,,39200,AVIGNON-LES-SAINT-CLAUDE,,,39032,,,,,,,,,,,,,,,,,,,2019-04-01,F,,,,,68.20B,NAFRev2,N,5.846509,46.393009,0.93,housenumber,4 Impasse des Orchidées 39200 Avignon-lès-Saint-Claude,39032_0042_00004,D,4 IMPASSE DES ORCHIDEES,
834246522,00017,83424652200017,O,2017-12-25,,,,2019-11-14T14:00:36,true,1,,15,,RUE,DE LA BOUSSIERE,39200,AVIGNON-LES-SAINT-CLAUDE,,,39032,,,,,,,,,,,,,,,,,,,2017-12-25,A,,,,,70.22Z,NAFRev2,N,5.84468,46.39348,0.93,housenumber,15 Rue de la Boussière 39200 Avignon-lès-Saint-Claude,39032_0010_00015,G,15 RUE DE LA BOUSSIERE,
839058369,00027,83905836900027,O,2019-12-16,,,,2021-02-23T17:58:12,true,1,,1,,PL,SAINT ROCH,39200,AVIGNON-LES-SAINT-CLAUDE,,,39032,,,,,,,,,,,,,,,,,,,2019-12-16,A,,,,,35.11Z,NAFRev2,N,5.845571,46.389952,0.82,housenumber,1 Place Saint Roch 39200 Avignon-lès-Saint-Claude,39032_0055_00001,G,1 PLACE SAINT ROCH,
842235434,00029,84223543400029,O,2018-10-24,,,,2019-11-14T14:00:36,true,1,6 LOTISSEMENT LES ORCHIDEES,,,LD,LA BOUSSIERE,39200,AVIGNON-LES-SAINT-CLAUDE,,,39032,,,,,,,,,,,,,,,,,,,2018-10-24,A,,,,,96.09Z,NAFRev2,N,5.846704,46.392868,0.93,street,À la Boussière 39200 Avignon-lès-Saint-Claude,39032_xfx4ay,G,A LA BOUSSIERE,
847561974,00019,84756197400019,O,2018-12-13,,,,2019-11-14T14:00:36,true,1,,10,B,RUE,DE LA BOUSSIERE,39200,AVIGNON-LES-SAINT-CLAUDE,,,39032,,,,,,,,,,,,,,,,,,,2018-12-13,A,,,,,47.99A,NAFRev2,N,5.84582,46.393844,0.82,housenumber,10 bis Rue de la Boussière 39200 Avignon-lès-Saint-Claude,39032_0010_00010_bis,G,10 BIS RUE DE LA BOUSSIERE,
850597170,00016,85059717000016,O,2019-05-06,,,9529ZF,2019-11-14T14:00:36,true,1,,8,,IMP,DES PINS,39200,AVIGNON-LES-SAINT-CLAUDE,,,39032,,,,,,,,,,,,,,,,,,,2019-05-06,A,,,,,95.29Z,NAFRev2,N,5.844212,46.39175,0.81,housenumber,8 Impasse des Pins 39200 Avignon-lès-Saint-Claude,39032_0045_00008,G,8 IMPASSE DES PINS,
877505412,00016,87750541200016,O,2019-09-25,,,8211ZP,2019-11-14T14:00:36,true,1,AVIGNON LES SAINT CLAUDE,1,,,LES TROIS MAISONS,39200,AVIGNON-LES-SAINT-CLAUDE,,,39032,,,,,,,,,,,,,,,,,,,2019-09-25,A,,,,,82.19Z,NAFRev2,N,3.7357249,48.4343079,0.9,poi.townhall,(Hôtel de ville) Ossey-les-Trois-Maisons,https://osm.org/way/228596042,G,,
884941733,00013,88494173300013,O,2020-01-14,,,,2020-07-08T03:40:48,true,1,,10,B,RUE,DE LA BOUSSIERE,39200,AVIGNON-LES-SAINT-CLAUDE,,,39032,,,,,,,,,,,,,,,,,,,2020-01-14,A,,,,,47.99A,NAFRev2,N,5.84582,46.393844,0.82,housenumber,10 bis Rue de la Boussière 39200 Avignon-lès-Saint-Claude,39032_0010_00010_bis,G,10 BIS RUE DE LA BOUSSIERE,
888266863,00016,88826686300016,O,2020-08-17,,,5610CQ,2020-08-25T03:57:23,true,1,,8,,,LES TROIS MAISONS,39200,AVIGNON-LES-SAINT-CLAUDE,,,39032,,,,,,,,,,,,,,,,,,,2020-08-17,A,,,,TRADITRUCK,56.10C,NAFRev2,N,3.7357249,48.4343079,0.9,poi.townhall,(Hôtel de ville) Ossey-les-Trois-Maisons,https://osm.org/way/228596042,G,,
890098700,00010,89009870000010,O,2020-10-19,,,4334ZC,2021-02-10T09:06:05,true,2,,8,,RUE,DE LA BOUSSIERE,39200,AVIGNON-LES-SAINT-CLAUDE,,,39032,,,,,,,,,,,,,,,,,,,2020-11-01,A,,,,,43.34Z,NAFRev2,O,5.845794,46.392084,0.93,housenumber,8 Rue de la Boussière 39200 Avignon-lès-Saint-Claude,39032_0010_00008,G,8 RUE DE LA BOUSSIERE,
890113293,00017,89011329300017,O,2020-10-07,,,,2020-10-20T07:06:48,true,1,,16,,RUE,DES VERGERS,39200,AVIGNON-LES-SAINT-CLAUDE,,,39032,,,,,,,,,,,,,,,,,,,2020-10-07,A,,,,,70.10Z,NAFRev2,N,5.848018,46.391968,0.93,housenumber,16 Rue des Vergers 39200 Avignon-lès-Saint-Claude,39032_0060_00016,G,16 RUE DES VERGERS,
892594813,00016,89259481300016,O,2020-12-24,,,,2021-01-27T03:54:30,true,1,,7,,IMP,DES PINS,39200,AVIGNON-LES-SAINT-CLAUDE,,,39032,,,,,,,,,,,,,,,,,,,2020-12-24,A,,,,HYVERNAT NATHAN,47.91A,NAFRev2,N,5.843841,46.39138,0.81,housenumber,7 Impasse des Pins 39200 Avignon-lès-Saint-Claude,39032_0045_00007,G,7 IMPASSE DES PINS,
