siren,nic,siret,statutDiffusionEtablissement,dateCreationEtablissement,trancheEffectifsEtablissement,anneeEffectifsEtablissement,activitePrincipaleRegistreMetiersEtablissement,dateDernierTraitementEtablissement,etablissementSiege,nombrePeriodesEtablissement,complementAdresseEtablissement,numeroVoieEtablissement,indiceRepetitionEtablissement,typeVoieEtablissement,libelleVoieEtablissement,codePostalEtablissement,libelleCommuneEtablissement,libelleCommuneEtrangerEtablissement,distributionSpecialeEtablissement,codeCommuneEtablissement,codeCedexEtablissement,libelleCedexEtablissement,codePaysEtrangerEtablissement,libellePaysEtrangerEtablissement,complementAdresse2Etablissement,numeroVoie2Etablissement,indiceRepetition2Etablissement,typeVoie2Etablissement,libelleVoie2Etablissement,codePostal2Etablissement,libelleCommune2Etablissement,libelleCommuneEtranger2Etablissement,distributionSpeciale2Etablissement,codeCommune2Etablissement,codeCedex2Etablissement,libelleCedex2Etablissement,codePaysEtranger2Etablissement,libellePaysEtranger2Etablissement,dateDebut,etatAdministratifEtablissement,enseigne1Etablissement,enseigne2Etablissement,enseigne3Etablissement,denominationUsuelleEtablissement,activitePrincipaleEtablissement,nomenclatureActivitePrincipaleEtablissement,caractereEmployeurEtablissement,longitude,latitude,geo_score,geo_type,geo_adresse,geo_id,geo_ligne,geo_l4,geo_l5
215104605,00013,21510460500013,O,1983-03-01,01,2018,,2020-08-25T10:17:37,true,3,,,,,,51340,SAINT-LUMIER-LA-POPULEUSE,,,51497,,,,,,,,,,,,,,,,,,,2008-01-01,A,MAIRIE,,,,84.11Z,NAFRev2,N,,,0,,,,,,
265104216,00014,26510421600014,O,1983-03-01,NN,,,2019-11-14T14:00:42,true,3,,,,,,51340,SAINT-LUMIER-LA-POPULEUSE,,,51497,,,,,,,,,,,,,,,,,,,2008-01-01,A,CCAS,,,,88.99B,NAFRev2,N,,,0,,,,,,
335331146,00019,33533114600019,O,,NN,,,2019-11-14T14:00:42,true,1,,,,,,51340,SAINT-LUMIER-LA-POPULEUSE,,,51497,,,,,,,,,,,,,,,,,,,1989-10-31,F,,,,,01.1A,NAF1993,N,,,0,,,,,,
343936464,00019,34393646400019,O,1988-01-01,NN,,,2019-11-14T14:00:42,true,4,,,,,,51340,SAINT-LUMIER-LA-POPULEUSE,,,51497,,,,,,,,,,,,,,,,,,,2014-11-30,F,,,,,01.11Z,NAFRev2,N,,,0,,,,,,
350782868,00011,35078286800011,O,,,,,2019-11-14T14:00:42,true,1,,,,,,51340,SAINT-LUMIER-LA-POPULEUSE,,,51497,,,,,,,,,,,,,,,,,,,1992-12-31,F,,,,,28.3C,NAF1993,N,,,0,,,,,,
352599013,00013,35259901300013,O,1989-11-01,NN,,,2019-11-14T14:00:42,true,4,,,,,,51340,SAINT-LUMIER-LA-POPULEUSE,,,51497,,,,,,,,,,,,,,,,,,,2005-12-31,F,,,,,01.1A,NAFRev1,N,,,0,,,,,,
393104542,00013,39310454200013,O,1992-01-01,NN,,,2019-11-14T14:00:42,true,4,,,,,,51340,SAINT-LUMIER-LA-POPULEUSE,,,51497,,,,,,,,,,,,,,,,,,,2003-10-01,F,,,,,01.1A,NAFRev1,N,,,0,,,,,,
418503322,00012,41850332200012,O,1997-01-01,NN,,,2019-11-14T14:00:42,true,3,,,,,,51340,SAINT-LUMIER-LA-POPULEUSE,,,51497,,,,,,,,,,,,,,,,,,,2001-01-31,F,,,,,01.1A,NAF1993,N,,,0,,,,,,
442220141,00018,44222014100018,O,2001-07-14,NN,,,2019-11-14T14:00:42,true,4,,9,,RUE,DE PRAGAD,51340,SAINT-LUMIER-LA-POPULEUSE,,,51497,,,,,,,,,,,,,,,,,,,2010-01-01,F,,,,,01.11Z,NAFRev2,N,4.795414,48.725192,0.75,housenumber,9 Rue de Pragua 51340 Saint-Lumier-la-Populeuse,51497_0070_00009,G,9 RUE DE PRAGUA,
489070391,00011,48907039100011,O,2006-04-03,,,,2019-11-14T14:00:42,true,2,,3,,RUE,MAURUPT,51340,SAINT-LUMIER-LA-POPULEUSE,,,51497,,,,,,,,,,,,,,,,,,,2007-01-31,F,ARO-PROD,,,,74.8F,NAFRev1,N,4.792179,48.725714,0.92,housenumber,3 Rue de Maurupt 51340 Saint-Lumier-la-Populeuse,51497_0050_00003,G,3 RUE DE MAURUPT,
533382636,00025,53338263600025,O,2011-12-15,02,2018,,2021-02-23T15:54:08,true,2,LE CHATEAU DE BUSSEMONT,,,LD,LE CHATEAU DE BUSMONT,51340,SAINT-LUMIER-LA-POPULEUSE,,,51497,,,,,,,,,,,,,,,,,,,2013-04-28,A,,,,,68.20B,NAFRev2,O,4.786697,48.728222,0.71,street,Château de Bussemont 51340 Saint-Lumier-la-Populeuse,51497_b003,G,CHATEAU DE BUSSEMONT,
785842287,00027,78584228700027,O,,,,,2019-11-14T14:00:42,true,1,,,,,,51340,SAINT-LUMIER-LA-POPULEUSE,,,51497,,,,,,,,,,,,,,,,,,,1989-04-22,F,,,,,24.08,NAP,N,,,0,,,,,,
804090819,00017,80409081900017,O,2014-07-25,,,,2019-11-14T14:00:42,true,1,,12,,RUE,DE PRAGUA,51340,SAINT-LUMIER-LA-POPULEUSE,,,51497,,,,,,,,,,,,,,,,,,,2014-07-25,A,,,,,68.20B,NAFRev2,N,4.796552,48.724862,0.93,housenumber,12 Rue de Pragua 51340 Saint-Lumier-la-Populeuse,51497_0070_00012,G,12 RUE DE PRAGUA,
838198984,00018,83819898400018,O,1989-06-29,,,,2019-11-14T14:00:42,true,1,,1,,RUE,DE PRAGA,51340,SAINT-LUMIER-LA-POPULEUSE,,,51497,,,,,,,,,,,,,,,,,,,1989-06-29,A,,,,,68.20B,NAFRev2,N,4.792703,48.72536,0.81,housenumber,1 Rue de Pragua 51340 Saint-Lumier-la-Populeuse,51497_0070_00001,G,1 RUE DE PRAGUA,
950606798,00011,95060679800011,O,1989-09-29,NN,,,2019-12-12T04:18:26,true,4,,,,,,51340,SAINT-LUMIER-LA-POPULEUSE,,,51497,,,,,,,,,,,,,,,,,,,2019-09-04,F,,,,,68.20B,NAFRev2,N,,,0,,,,,,
