siren,nic,siret,statutDiffusionEtablissement,dateCreationEtablissement,trancheEffectifsEtablissement,anneeEffectifsEtablissement,activitePrincipaleRegistreMetiersEtablissement,dateDernierTraitementEtablissement,etablissementSiege,nombrePeriodesEtablissement,complementAdresseEtablissement,numeroVoieEtablissement,indiceRepetitionEtablissement,typeVoieEtablissement,libelleVoieEtablissement,codePostalEtablissement,libelleCommuneEtablissement,libelleCommuneEtrangerEtablissement,distributionSpecialeEtablissement,codeCommuneEtablissement,codeCedexEtablissement,libelleCedexEtablissement,codePaysEtrangerEtablissement,libellePaysEtrangerEtablissement,complementAdresse2Etablissement,numeroVoie2Etablissement,indiceRepetition2Etablissement,typeVoie2Etablissement,libelleVoie2Etablissement,codePostal2Etablissement,libelleCommune2Etablissement,libelleCommuneEtranger2Etablissement,distributionSpeciale2Etablissement,codeCommune2Etablissement,codeCedex2Etablissement,libelleCedex2Etablissement,codePaysEtranger2Etablissement,libellePaysEtranger2Etablissement,dateDebut,etatAdministratifEtablissement,enseigne1Etablissement,enseigne2Etablissement,enseigne3Etablissement,denominationUsuelleEtablissement,activitePrincipaleEtablissement,nomenclatureActivitePrincipaleEtablissement,caractereEmployeurEtablissement,longitude,latitude,geo_score,geo_type,geo_adresse,geo_id,geo_ligne,geo_l4,geo_l5
130008394,00194,13000839400194,O,2009-12-21,02,2018,,2021-01-11T14:45:20,false,3,,1,,PL,EUGENE TRONVILLE,55600,MONTMEDY,,,55351,,,,,,,,,,,,,,,,,,,2021-01-01,A,SERVICE DE GESTION COMPTABLE DE MONTMEDY,,,,84.11Z,NAFRev2,N,5.368591,49.521268,0.86,housenumber,1 Place Eugène Tronville 55600 Montmédy,55351_0063_00001,G,1 PLACE EUGENE TRONVILLE,
175402312,00136,17540231200136,O,1988-02-18,,,,2008-01-04T18:15:34,false,3,QUARTIER PRONER,,,RUE,COMMANDANT MENARD,55600,MONTMEDY,,,55351,,,,,,,,,,,,,,,,,,,2008-01-01,A,BRIGADE DE SURVEILLANCE,,,,84.11Z,NAFRev2,N,5.370688,49.523867,0.9,street,Rue du Commandant Ménard 55600 Montmédy,55351_0035,G,RUE DU COMMANDANT MENARD,
175402312,00326,17540231200326,O,1993-01-01,,,,2008-01-04T18:15:34,false,3,,,,PL,RAYMOND POINCARE,55600,MONTMEDY,,,55351,,,,,,,,,,,,,,,,,,,2008-01-01,A,RECETTE LOCALE,,,,84.11Z,NAFRev2,N,5.366689,49.519477,0.85,street,Place Raymond Poincaré 55600 Montmédy,55351_0168,G,PLACE RAYMOND POINCARE,
175502111,00115,17550211100115,O,1983-03-16,,,,2013-04-29T22:36:24,false,4,,1,,PL,EUGENE TRONVILLE,55600,MONTMEDY,,,55351,,,,,,,,,,,,,,,,,,,2009-12-21,F,TRESORERIE DE MONTMEDY,,,,84.11Z,NAFRev2,N,5.368591,49.521268,0.86,housenumber,1 Place Eugène Tronville 55600 Montmédy,55351_0063_00001,G,1 PLACE EUGENE TRONVILLE,
175502210,00172,17550221000172,O,1981-06-23,,,,,false,3,,,,PL,RAYMOND POINCARE,55600,MONTMEDY,,BP34,55351,,,,,,,,,,,,,,,,,,,1993-02-01,F,RECETTE LOCALE C E MONTMEDY,,,,75.1A,NAF1993,N,5.366689,49.519477,0.85,street,Place Raymond Poincaré 55600 Montmédy,55351_0168,G,PLACE RAYMOND POINCARE,
175506617,00141,17550661700141,O,1981-06-23,NN,,,2010-09-16T15:27:29,false,4,,,,AV,DE LA GARE,55600,MONTMEDY,,,55351,,,,,,,,,,,,,,,,,,,2009-12-31,F,SUBDIVISION DE MONTMEDY,,,,84.13Z,NAFRev2,N,5.37088,49.522698,0.81,street,Avenue de la Gare 55600 Montmédy,55351_0075,G,AVENUE DE LA GARE,
176701209,00270,17670120900270,O,1988-09-12,31,2018,,2020-12-21T16:36:39,false,4,,18,,RUE,DU COMMANDANT MENARD,55600,MONTMEDY,,BP 19,55351,,,,,,,,,,,,,,,,,,,2020-12-25,A,CD MONTMEDY,,,,84.23Z,NAFRev2,N,5.371531,49.524055,0.94,housenumber,18 Rue du Commandant Ménard 55600 Montmédy,55351_0035_00018,G,18 RUE DU COMMANDANT MENARD,
195500160,00013,19550016000013,O,1983-03-01,NN,,,,false,4,,1,,RUE,SYLVAIN BAILLEUX,55600,MONTMEDY,,BP 24,55351,,,,,,,,,,,,,,,,,,,1999-11-19,F,,,,,80.2A,NAF1993,N,5.367737,49.522479,0.94,housenumber,1 Rue Sylvain Bailleux 55600 Montmédy,55351_0190_00001,G,1 RUE SYLVAIN BAILLEUX,
195500160,00021,19550016000021,O,1999-11-19,12,2018,,2020-08-25T10:14:14,true,3,,14,,RTE,DE VILLECLOYE,55600,MONTMEDY,,,55351,,,,,,,,,,,,,,,,,,,2008-01-01,A,,,,,85.31Z,NAFRev2,N,5.378552,49.515619,0.86,housenumber,14 Route de Villécloye 55600 Montmédy,55351_0220_00014,G,14 ROUTE DE VILLECLOYE,
200022184,00085,20002218400085,O,2010-01-01,01,2018,,2020-08-25T10:14:42,false,2,SITE DE MONTMEDY ET THIERVILLE,14,,RUE,MARYSE BASTIE,55600,MONTMEDY,,,55351,,,,,,,,,,,,,,,,,,,2010-01-25,A,SESSAD MONTMEDY,,,,88.91B,NAFRev2,N,5.374006,49.524741,0.94,housenumber,14 Rue Maryse-bastié 55600 Montmédy,55351_0125_00014,G,14 RUE MARYSE BASTIE,
200022184,00135,20002218400135,O,2010-01-01,12,2018,,2020-08-25T10:14:42,false,2,,14,,RUE,MARYSE BASTIE,55600,MONTMEDY,,,55351,,,,,,,,,,,,,,,,,,,2010-01-25,A,ITEP MONTMEDY,,,,87.10B,NAFRev2,N,5.374006,49.524741,0.94,housenumber,14 Rue Maryse-bastié 55600 Montmédy,55351_0125_00014,G,14 RUE MARYSE BASTIE,
200039782,00111,20003978200111,O,2016-12-25,03,2018,,2020-08-25T10:14:50,false,1,,20,,RUE,DE LA 2EME DB USA,55600,MONTMEDY,,,55351,,,,,,,,,,,,,,,,,,,2016-12-25,A,CMP ADULTES ET HDJ MONTMEDY,,,,86.10Z,NAFRev2,N,,,0,,,,,,
200084382,00411,20008438200411,O,2019-01-01,,,,2019-02-06T08:38:09,false,1,,14,,RUE,MARYSE BASTIE,55600,MONTMEDY,,,55351,,,,,,,,,,,,,,,,,,,2019-01-01,A,ITEP MONTMEDY,,,,87.10B,NAFRev2,O,5.374006,49.524741,0.94,housenumber,14 Rue Maryse-bastié 55600 Montmédy,55351_0125_00014,G,14 RUE MARYSE BASTIE,
215503517,00017,21550351700017,O,1983-03-01,11,2018,,2020-08-25T10:17:48,true,4,,,,PL,RAYMOND POINCARE,55600,MONTMEDY,,,55351,,,,,,,,,,,,,,,,,,,2008-01-01,A,MAIRIE,,,,84.11Z,NAFRev2,O,5.366689,49.519477,0.85,street,Place Raymond Poincaré 55600 Montmédy,55351_0168,G,PLACE RAYMOND POINCARE,
215503517,00041,21550351700041,O,1983-12-21,11,2018,,2020-08-25T10:17:48,false,3,,14,,RUE,SYLVAIN BAILLEUX,55600,MONTMEDY,,,55351,,,,,,,,,,,,,,,,,,,2008-01-01,A,ECOLE PRIMAIRE PUBLIQUE GEORGES BRASSENS,,,,85.20Z,NAFRev2,N,5.36663,49.521454,0.94,housenumber,14 Rue Sylvain Bailleux 55600 Montmédy,55351_0190_00014,G,14 RUE SYLVAIN BAILLEUX,
215503517,00058,21550351700058,O,1983-12-21,03,2018,,2020-08-25T10:17:48,false,3,,22,,RUE,PIECE MADAME VILLE BASSE,55600,MONTMEDY,,,55351,,,,,,,,,,,,,,,,,,,2008-01-01,A,ECOLE MATERNELLE PUBLIQUE,,,,85.10Z,NAFRev2,N,,,0,,,,,,
215503517,00066,21550351700066,O,1995-12-25,NN,,,2012-05-05T00:28:48,false,2,,1,,PL,RAYMOND POINCARE,55600,MONTMEDY,,,55351,,,,,,,,,,,,,,,,,,,2008-01-01,A,SERVICE D'EAU,,,,36.00Z,NAFRev2,N,5.366689,49.519477,0.86,housenumber,1 Place Raymond Poincaré 55600 Montmédy,55351_0168_00001,G,1 PLACE RAYMOND POINCARE,
215503517,00074,21550351700074,O,2003-06-23,NN,,,2008-01-04T18:36:27,false,3,MAIRIE,1,,RUE,RAYMOND POINCARE,55600,MONTMEDY,,,55351,,,,,,,,,,,,,,,,,,,2008-01-01,A,LOTISSEMENT SOUS LES VIGNES III,,,,42.99Z,NAFRev2,N,5.366689,49.519477,0.78,housenumber,1 Place Raymond Poincaré 55600 Montmédy,55351_0168_00001,G,1 PLACE RAYMOND POINCARE,
215503517,00082,21550351700082,O,2003-05-01,NN,,,2008-01-04T18:36:27,false,3,,,,,LE TIVOLI,55600,MONTMEDY,,,55351,,,,,,,,,,,,,,,,,,,2008-01-01,A,CAMPING MUNICIPAL LA CITADELLE,,,,55.30Z,NAFRev2,N,-1.6760454,48.1118861,0.9,poi.bar,Le Tivoli (Bar) Rennes,https://osm.org/node/3606658040,G,,
215503517,00090,21550351700090,O,2004-03-29,NN,,,2012-05-05T00:28:48,false,3,MAIRIE,,,PL,RAYMOND POINCARE,55600,MONTMEDY,,,55351,,,,,,,,,,,,,,,,,,,2008-01-01,A,SERVICE D'ASSAINISSEMENT,,,,37.00Z,NAFRev2,N,5.366689,49.519477,0.85,street,Place Raymond Poincaré 55600 Montmédy,55351_0168,G,PLACE RAYMOND POINCARE,
245500772,00018,24550077200018,O,1983-03-01,NN,,,,true,1,,1,,PL,RAYMOND POINCARE,55600,MONTMEDY,,,55351,,,,,,,,,,,,,,,,,,,1999-01-01,F,,,,,75.1A,NAF1993,O,5.366689,49.519477,0.86,housenumber,1 Place Raymond Poincaré 55600 Montmédy,55351_0168_00001,G,1 PLACE RAYMOND POINCARE,
245501051,00016,24550105100016,O,1983-03-01,NN,,,,true,1,,,,PL,RAYMOND POINCARE,55600,MONTMEDY,,,55351,,,,,,,,,,,,,,,,,,,1999-01-01,F,,,,,75.1A,NAF1993,N,5.366689,49.519477,0.85,street,Place Raymond Poincaré 55600 Montmédy,55351_0168,G,PLACE RAYMOND POINCARE,
245501259,00015,24550125900015,O,1999-01-01,,,,2013-04-29T22:47:22,false,4,HOTEL DE VILLE,1,,PL,RAYMOND POINCARE,55600,MONTMEDY,,,55351,,,,,,,,,,,,,,,,,,,2010-11-02,F,,,,,84.11Z,NAFRev2,O,5.366689,49.519477,0.86,housenumber,1 Place Raymond Poincaré 55600 Montmédy,55351_0168_00001,G,1 PLACE RAYMOND POINCARE,
245501259,00023,24550125900023,O,2010-02-10,01,2018,,2021-02-11T08:34:29,false,2,CITADELLE-VILLE HAUTE,2,,RUE,DE L'HOTEL DE VILLE,55600,MONTMEDY,,,55351,,,,,,,,,,,,,,,,,,,2021-01-01,A,OFFICE DE TOURISME  PAYS MONTMEDY,,,,79.90Z,NAFRev2,O,5.361029,49.517434,0.94,housenumber,2 Rue de l'Hotel de Ville 55600 Montmédy,55351_0270_00002,G,2 RUE DE L HOTEL DE VILLE,
245501259,00064,24550125900064,O,2010-11-02,12,2018,,2020-08-25T10:20:05,true,1,,20,,AV,DE LA GARE,55600,MONTMEDY,,,55351,,,,,,,,,,,,,,,,,,,2010-11-02,A,,,,,84.11Z,NAFRev2,O,5.371699,49.522698,0.83,housenumber,20 Avenue de la Gare 55600 Montmédy,55351_0075_00020,G,20 AVENUE DE LA GARE,
255501140,00024,25550114000024,O,2012-03-12,NN,,,2021-02-23T10:34:46,true,1,CC DU PAYS DE MONTMEDY,20,,AV,DE LA GARE,55600,MONTMEDY,,,55351,,,,,,,,,,,,,,,,,,,2012-03-12,A,,,,,42.99Z,NAFRev2,O,5.371699,49.522698,0.83,housenumber,20 Avenue de la Gare 55600 Montmédy,55351_0075_00020,G,20 AVENUE DE LA GARE,
265500207,00161,26550020700161,O,2001-07-31,NN,,,2014-03-12T09:34:14,false,4,,20,,RUE,2EME DIVISION BLINDEE,55600,MONTMEDY,,,55351,,,,,,,,,,,,,,,,,,,2014-01-01,F,HOPITAL DE JOUR CTRE MEDICO PSYCHO ADULT,,,,86.10Z,NAFRev2,N,5.365674,49.520244,0.72,housenumber,20 Avenue de la 2e Division Blindee 55600 Montmédy,55351_0050_00020,G,20 AVENUE DE LA 2E DIV BLINDEE,
265500207,00229,26550020700229,O,1991-03-01,,,,2014-03-12T09:34:14,false,2,,20,,RUE,DE LA 2EME DB,55600,MONTMEDY,,,55351,,,,,,,,,,,,,,,,,,,2014-01-01,F,CMP ADULTE,,,,86.10Z,NAFRev2,N,0.1766459,48.2832021,0.73,poi,Rue de la 2e Db (Pont) Chérancé,https://osm.org/way/320969680,G,,
265500215,00024,26550021500024,O,2017-10-11,,,,2017-12-07T10:14:14,false,1,,4,,RUE,DE MONTRICHARD,55600,MONTMEDY,,,55351,,,,,,,,,,,,,,,,,,,2017-10-11,A,RESIDENCE AUTONOMIE DE MONTMEDY,,,,87.30A,NAFRev2,O,5.375182,49.514195,0.94,housenumber,4 Rue de Montrichard 55600 Montmédy,55351_0129_00004,G,4 RUE DE MONTRICHARD,
265500249,00015,26550024900015,O,1983-03-01,NN,,,2021-02-03T08:40:23,true,3,MAIRIE,,,PL,RAYMOND POINCARE,55600,MONTMEDY,,,55351,,,,,,,,,,,,,,,,,,,2008-01-01,A,CCAS,,,,88.99B,NAFRev2,N,5.366689,49.519477,0.85,street,Place Raymond Poincaré 55600 Montmédy,55351_0168,G,PLACE RAYMOND POINCARE,
265500975,00015,26550097500015,O,1990-01-01,NN,,,2011-04-23T04:21:43,true,5,,14,,RUE,MARYSE BASTIE,55600,MONTMEDY,,,55351,,,,,,,,,,,,,,,,,,,2010-01-01,F,,,,,87.10B,NAFRev2,O,5.374006,49.524741,0.94,housenumber,14 Rue Maryse-bastié 55600 Montmédy,55351_0125_00014,G,14 RUE MARYSE BASTIE,
275500676,00018,27550067600018,O,,,,,,true,1,,,,PL,RAYMOND POINCARE,55600,MONTMEDY,,,55351,,,,,,,,,,,,,,,,,,,1995-12-25,F,,,,,41.0Z,NAF1993,N,5.366689,49.519477,0.85,street,Place Raymond Poincaré 55600 Montmédy,55351_0168,G,PLACE RAYMOND POINCARE,
275500684,00012,27550068400012,O,,,,,,true,1,,,,PL,RAYMOND POINCARE,55600,MONTMEDY,,,55351,,,,,,,,,,,,,,,,,,,1995-12-25,F,,,,,90.0A,NAF1993,N,5.366689,49.519477,0.85,street,Place Raymond Poincaré 55600 Montmédy,55351_0168,G,PLACE RAYMOND POINCARE,
295502447,00010,29550244700010,O,1983-08-10,NN,,,2008-02-11T14:36:11,true,3,,1,,PL,RAYMOND POINCARE,55600,MONTMEDY,,,55351,,,,,,,,,,,,,,,,,,,2004-12-25,F,,,,,70.1C,NAFRev1,N,5.366689,49.519477,0.86,housenumber,1 Place Raymond Poincaré 55600 Montmédy,55351_0168_00001,G,1 PLACE RAYMOND POINCARE,
300455581,00011,30045558100011,O,,,,,,true,1,,23,,RUE,DU LUXEMBOURG,55600,MONTMEDY,,,55351,,,,,,,,,,,,,,,,,,,1984-12-25,F,,,,,84.10,NAP,N,5.36799,49.520894,0.94,housenumber,23 Rue du Luxembourg 55600 Montmédy,55351_0115_00023,G,23 RUE DU LUXEMBOURG,
300463841,00043,30046384100043,O,1997-01-01,NN,,,2009-11-25T14:26:09,false,4,,8,,RUE,NOBLE,55600,MONTMEDY,,,55351,,,,,,,,,,,,,,,,,,,2009-09-01,F,,,,,46.34Z,NAFRev2,N,5.366237,49.518759,0.94,housenumber,8 Rue Noble 55600 Montmédy,55351_0140_00008,G,8 RUE NOBLE,
301648341,00024,30164834100024,O,,,,,,true,1,,9,,RUE,DE VERDUN,55600,MONTMEDY,,,55351,,,,,,,,,,,,,,,,,,,1985-12-25,F,,,,,65.02,NAP,N,5.374466,49.513095,0.77,housenumber,9 Avenue de Verdun 55600 Montmédy,55351_0210_00009,G,9 AVENUE DE VERDUN,
303371173,00061,30337117300061,O,1999-04-01,NN,,,2012-07-28T09:13:54,false,4,,30,,RUE,MABILLE,55600,MONTMEDY,,,55351,,,,,,,,,,,,,,,,,,,2011-12-25,F,,,,,68.32A,NAFRev2,N,5.367406,49.517953,0.92,housenumber,30 Rue Ernest Mabille 55600 Montmédy,55351_0062_00030,G,30 RUE ERNEST MABILLE,
303371504,00018,30337150400018,O,,,,,,true,1,,18,,AV,DE LA GARE,55600,MONTMEDY,,,55351,,,,,,,,,,,,,,,,,,,,F,,,,,67.08,NAP,N,5.371404,49.522689,0.83,housenumber,18 Avenue de la Gare 55600 Montmédy,55351_0075_00018,G,18 AVENUE DE LA GARE,
303409486,00014,30340948600014,O,1900-01-01,NN,,,2008-01-04T19:25:02,true,5,,,,,MAIRIE,55600,MONTMEDY,,,55351,,,,,,,,,,,,,,,,,,,2008-01-01,A,,,,,79.11Z,NAFRev2,N,3.0709671,50.6304695,0.92,poi.townhall,Hôtel de Ville Lille,https://osm.org/way/40917078,G,,
303885164,00010,30388516400010,O,,NN,,,,true,1,,5,,AV,BOURGUIGNON,55600,MONTMEDY,,,55351,,,,,,,,,,,,,,,,,,,,F,,,,,56.02,NAP,N,5.363613,49.513331,0.72,housenumber,5 Rue du Lieutenant Bourguignon 55600 Montmédy,55351_0100_00005,G,5 RUE DU LIEUTENANT BOURGUIGNON,
304195464,00017,30419546400017,O,,,,,,true,1,,18,,RUE,MABILLE,55600,MONTMEDY,,,55351,,,,,,,,,,,,,,,,,,,1985-12-25,F,,,,,64.25,NAP,N,5.367425,49.518285,0.92,housenumber,18 Rue Ernest Mabille 55600 Montmédy,55351_0062_00018,G,18 RUE ERNEST MABILLE,
305269102,00029,30526910200029,O,,NN,,,,true,1,,1,,RUE,PASTEUR,55600,MONTMEDY,,,55351,,,,,,,,,,,,,,,,,,,1989-09-30,F,,,,,64.24,NAP,N,5.366164,49.519145,0.94,housenumber,1 Rue Pasteur 55600 Montmédy,55351_0145_00001,G,1 RUE PASTEUR,
305515215,00013,30551521500013,O,1900-01-01,NN,,,2014-02-27T10:38:23,false,4,,23,,RUE,LUXEMBOURG,55600,MONTMEDY,,,55351,,,,,,,,,,,,,,,,,,,2013-03-31,F,,,,,86.21Z,NAFRev2,N,5.36799,49.520894,0.89,housenumber,23 Rue du Luxembourg 55600 Montmédy,55351_0115_00023,G,23 RUE DU LUXEMBOURG,
305515215,00021,30551521500021,O,2013-03-31,,,,2016-08-23T08:29:46,true,2,IRE LES PRES,14,,RUE,DU CHU HAUT,55600,MONTMEDY,,,55351,,,,,,,,,,,,,,,,,,,2014-12-31,F,,,,,86.21Z,NAFRev2,N,5.37735,49.506989,0.94,housenumber,14 Rue du Chu-haut 55600 Montmédy,55351_0047_00014,G,14 RUE DU CHU HAUT,
306117508,00037,30611750800037,O,1991-07-08,NN,,,2015-11-06T03:36:44,false,4,,,,RUE,DE L HOTEL DE VILLE,55600,MONTMEDY,,,55351,,,,,,,,,,,,,,,,,,,2015-10-01,F,LA BOMBARDE,,,,56.10A,NAFRev2,N,5.361074,49.517523,0.94,street,Rue de l'Hotel de Ville 55600 Montmédy,55351_0270,G,RUE DE L HOTEL DE VILLE,
307235028,00015,30723502800015,O,,NN,,,,true,1,,20,,RUE,DE LA 2EME DB,55600,MONTMEDY,,,55351,,,,,,,,,,,,,,,,,,,,F,,,,,00.10,NAP,N,0.1766459,48.2832021,0.73,poi,Rue de la 2e Db (Pont) Chérancé,https://osm.org/way/320969680,G,,
308073840,00016,30807384000016,O,1900-01-01,NN,,,2011-04-28T00:12:38,false,3,,1,,RUE,DU GENERAL LECLERC,55600,MONTMEDY,,,55351,,,,,,,,,,,,,,,,,,,1992-09-30,F,,,,,92.1J,NAF1993,N,5.363636,49.519553,0.94,housenumber,1 Rue du General Leclerc 55600 Montmédy,55351_0085_00001,G,1 RUE DU GENERAL LECLERC,
309304905,00081,30930490500081,O,1990-05-11,NN,,,2006-11-25T09:24:28,false,4,,,,AV,DE GAULLE,55600,MONTMEDY,,,55351,,,,,,,,,,,,,,,,,,,2006-06-30,F,,,,,74.1C,NAFRev1,N,5.368802,49.521651,0.72,street,Rue Géneral de Gaulle 55600 Montmédy,55351_0080,G,RUE GENERAL DE GAULLE,
309451557,00024,30945155700024,O,1983-11-24,NN,,,2010-12-14T08:44:25,false,4,,,,RTE,DE VILLECLOYE,55600,MONTMEDY,,,55351,,,,,,,,,,,,,,,,,,,2010-01-01,F,,,,,86.90D,NAFRev2,N,5.376296,49.515876,0.84,street,Route de Villécloye 55600 Montmédy,55351_0220,G,ROUTE DE VILLECLOYE,
309451557,00032,30945155700032,O,2010-01-01,,,,2019-04-12T08:33:48,true,2,,11,,RUE,DU LUXEMBOURG,55600,MONTMEDY,,,55351,,,,,,,,,,,,,,,,,,,2019-03-31,F,,,,,86.90D,NAFRev2,N,5.367406,49.520534,0.94,housenumber,11 Rue du Luxembourg 55600 Montmédy,55351_0115_00011,G,11 RUE DU LUXEMBOURG,
309473866,00015,30947386600015,O,,NN,,,,true,1,,,,RUE,PIECE MADAME,55600,MONTMEDY,,,55351,,,,,,,,,,,,,,,,,,,,F,,,,,81.11,NAP,N,5.363985,49.52069,0.88,street,Rue de la Piece Madame 55600 Montmédy,55351_0155,G,RUE DE LA PIECE MADAME,
309605681,00019,30960568100019,O,1900-01-01,NN,,,2008-12-06T04:04:22,true,6,,4,,RUE,MABILLE,55600,MONTMEDY,,,55351,,,,,,,,,,,,,,,,,,,2008-10-31,F,,,,,10.71D,NAFRev2,N,5.367481,49.518926,0.92,housenumber,4 Rue Ernest Mabille 55600 Montmédy,55351_0062_00004,G,4 RUE ERNEST MABILLE,
310166822,00018,31016682200018,O,1963-01-01,NN,,9602AA,2015-03-18T00:59:28,true,6,,9,,RUE,DU LUXEMBOURG,55600,MONTMEDY,,,55351,,,,,,,,,,,,,,,,,,,2013-12-31,F,,,,,96.02A,NAFRev2,N,5.36738,49.520514,0.94,housenumber,9 Rue du Luxembourg 55600 Montmédy,55351_0115_00009,G,9 RUE DU LUXEMBOURG,
310864137,00016,31086413700016,O,1900-01-01,NN,,,2008-01-04T20:03:17,true,3,,,,PL,DE L'HOTEL DE VILLE,55600,MONTMEDY,,,55351,,,,,,,,,,,,,,,,,,,2008-01-01,A,,,,,55.20Z,NAFRev2,N,5.360816,49.517396,0.89,street,Place de l'Hotel de Ville 55600 Montmédy,55351_0089,G,PLACE DE L HOTEL DE VILLE,
310865217,00015,31086521700015,O,,,,,,true,1,,16,,RUE,DR POULAIN,55600,MONTMEDY,,,55351,,,,,,,,,,,,,,,,,,,1988-09-30,F,,,,,55.71,NAP,N,5.370118,49.515986,0.83,housenumber,16 Rue du Docteur Poulain 55600 Montmédy,55351_0055_00016,G,16 RUE DU DOCTEUR POULAIN,
311109318,00015,31110931800015,O,1900-01-01,NN,,,2007-10-27T08:37:32,false,4,MAIRIE,,,PL,RAYMOND POINCARE,55600,MONTMEDY,,,55351,,,,,,,,,,,,,,,,,,,2006-10-15,F,,,,,85.3J,NAFRev1,O,5.366689,49.519477,0.85,street,Place Raymond Poincaré 55600 Montmédy,55351_0168,G,PLACE RAYMOND POINCARE,
311109318,00023,31110931800023,O,2006-10-15,NN,,,2011-04-23T04:41:43,false,3,,1,,RUE,DU LIEUTENANT BOURGUIGNON,55600,MONTMEDY,,,55351,,,,,,,,,,,,,,,,,,,2009-08-29,F,,,,,88.10A,NAFRev2,O,5.366705,49.515343,0.94,housenumber,1 Rue du Lieutenant Bourguignon 55600 Montmédy,55351_0100_00001,G,1 RUE DU LIEUTENANT BOURGUIGNON,
311109318,00031,31110931800031,O,2009-08-29,NN,,,2019-06-24T13:17:23,false,2,,19,,AV,DU LUXEMBOURG,55600,MONTMEDY,,,55351,,,,,,,,,,,,,,,,,,,2017-06-16,F,,,,,88.10A,NAFRev2,O,5.367683,49.520733,0.76,housenumber,19 Rue du Luxembourg 55600 Montmédy,55351_0115_00019,G,19 RUE DU LUXEMBOURG,
311109318,00049,31110931800049,O,2017-06-16,12,2018,,2021-02-23T10:39:00,true,1,,1,,RUE,DU LUXEMBOURG,55600,MONTMEDY,,,55351,,,,,,,,,,,,,,,,,,,2017-06-16,A,,,,,88.10A,NAFRev2,O,5.367189,49.520353,0.94,housenumber,1 Rue du Luxembourg 55600 Montmédy,55351_0115_00001,G,1 RUE DU LUXEMBOURG,
311612915,00026,31161291500026,O,1984-01-30,NN,,,2008-01-04T20:08:51,true,3,,3,,PL,POINCARE,55600,MONTMEDY,,,55351,,,,,,,,,,,,,,,,,,,2008-01-01,A,,,,,68.20B,NAFRev2,N,5.367154,49.51983,0.8,housenumber,3 Place Raymond Poincaré 55600 Montmédy,55351_0168_00003,G,3 PLACE RAYMOND POINCARE,
311612915,00034,31161291500034,O,1990-02-10,NN,,,,false,3,,3,,PL,POINCARE,55600,MONTMEDY,,,55351,,,,,,,,,,,,,,,,,,,1996-01-01,F,SAGA VIDEO,,,,71.4B,NAF1993,N,5.367154,49.51983,0.8,housenumber,3 Place Raymond Poincaré 55600 Montmédy,55351_0168_00003,G,3 PLACE RAYMOND POINCARE,
311612915,00042,31161291500042,O,1990-03-03,NN,,,,false,4,,3,,PL,POINCARE,55600,MONTMEDY,,,55351,,,,,,,,,,,,,,,,,,,1997-01-31,F,BLEU MARINE,,,,52.4C,NAF1993,O,5.367154,49.51983,0.8,housenumber,3 Place Raymond Poincaré 55600 Montmédy,55351_0168_00003,G,3 PLACE RAYMOND POINCARE,
312325194,00016,31232519400016,O,,,,,,true,1,,39,,RUE,MABILLE,55600,MONTMEDY,,,55351,,,,,,,,,,,,,,,,,,,1985-12-25,F,,,,,64.14,NAP,N,5.367524,49.517715,0.92,housenumber,39 Rue Ernest Mabille 55600 Montmédy,55351_0062_00039,G,39 RUE ERNEST MABILLE,
312627003,00014,31262700300014,O,1964-01-01,NN,,,2008-11-07T00:27:46,true,4,,10,,RUE,DU LUXEMBOURG,55600,MONTMEDY,,,55351,,,,,,,,,,,,,,,,,,,2006-03-31,F,,,,,52.2C,NAFRev1,O,5.367712,49.520637,0.94,housenumber,10 Rue du Luxembourg 55600 Montmédy,55351_0115_00010,G,10 RUE DU LUXEMBOURG,
312797707,00014,31279770700014,O,,,,,,true,1,,6,,RUE,DU LUXEMBOURG,55600,MONTMEDY,,,55351,,,,,,,,,,,,,,,,,,,1990-07-13,F,,,,,45.4M,NAF1993,N,5.367523,49.520501,0.94,housenumber,6 Rue du Luxembourg 55600 Montmédy,55351_0115_00006,G,6 RUE DU LUXEMBOURG,
312839954,00012,31283995400012,O,,NN,,,,true,1,,33,,RUE,DE CHINY,55600,MONTMEDY,,,55351,,,,,,,,,,,,,,,,,,,,F,,,,,81.11,NAP,N,5.363794,49.519276,0.94,housenumber,33 Rue de Chiny 55600 Montmédy,55351_0045_00033,G,33 RUE DE CHINY,
313722456,00016,31372245600016,O,1970-01-01,NN,,,,true,1,,4,,PL,EUGENE TRONVILLE,55600,MONTMEDY,,,55351,,,,,,,,,,,,,,,,,,,1998-10-31,F,,,,,52.4L,NAF1993,O,5.368553,49.520956,0.86,housenumber,4 Place Eugène Tronville 55600 Montmédy,55351_0063_00004,G,4 PLACE EUGENE TRONVILLE,
313766016,00015,31376601600015,O,,,,,,true,1,,22,,AV,DE VERDUN,55600,MONTMEDY,,,55351,,,,,,,,,,,,,,,,,,,1984-12-25,F,,,,,57.02,NAP,N,5.374026,49.513314,0.82,housenumber,22 Avenue de Verdun 55600 Montmédy,55351_0210_00022,G,22 AVENUE DE VERDUN,
314821356,00016,31482135600016,O,1979-01-01,NN,,,2009-06-05T20:15:08,true,4,,22,,AV,DE VERDUN,55600,MONTMEDY,,,55351,,,,,,,,,,,,,,,,,,,2009-03-30,F,,,,,68.20B,NAFRev2,N,5.374026,49.513314,0.82,housenumber,22 Avenue de Verdun 55600 Montmédy,55351_0210_00022,G,22 AVENUE DE VERDUN,
315079269,00017,31507926900017,O,1979-01-01,NN,,,,true,1,,15,,RUE,DU GENERAL DE GAULLE,55600,MONTMEDY,,,55351,,,,,,,,,,,,,,,,,,,1998-09-30,F,,,,,55.1A,NAF1993,N,5.369022,49.522423,0.83,housenumber,15 Rue Géneral de Gaulle 55600 Montmédy,55351_0080_00015,G,15 RUE GENERAL DE GAULLE,
315225375,00015,31522537500015,O,1979-01-01,NN,,,2008-01-04T20:37:01,true,3,,40,,RUE,MABILLE,55600,MONTMEDY,,,55351,,,,,,,,,,,,,,,,,,,2008-01-01,A,,,,,56.30Z,NAFRev2,N,5.367458,49.517255,0.92,housenumber,40 Rue Ernest Mabille 55600 Montmédy,55351_0062_00040,G,40 RUE ERNEST MABILLE,
315490144,00021,31549014400021,O,,NN,,,,true,1,,,,LD,FRESNOIS,55600,MONTMEDY,,,55351,,,,,,,,,,,,,,,,,,,,F,,,,,22.02,NAP,N,6.4025869,49.0685117,0.88,poi.farmyard,Fresnois (Corps de ferme) Bazoncourt,https://osm.org/way/108595250,G,,
316669183,00022,31666918300022,O,,NN,,,,true,1,,,,,LA VILLE HAUTE,55600,MONTMEDY,,,55351,,,,,,,,,,,,,,,,,,,1989-09-08,F,,,,,67.04,NAP,N,2.4287652,43.0455458,0.9,poi.ruins,La Ville Haute (Ruines) Clermont-sur-Lauquet,https://osm.org/node/2448033691,G,,
316811389,00014,31681138900014,O,,NN,,,,true,1,,7,,PL,RAYMOND POINCARE,55600,MONTMEDY,,,55351,,,,,,,,,,,,,,,,,,,1987-09-22,F,,,,,89.02,NAP,N,5.366623,49.518953,0.86,housenumber,7 Place Raymond Poincaré 55600 Montmédy,55351_0168_00007,G,7 PLACE RAYMOND POINCARE,
317018380,00012,31701838000012,O,,NN,,,,true,1,,14,,RUE,DU LUXEMBOURG,55600,MONTMEDY,,,55351,,,,,,,,,,,,,,,,,,,1997-08-19,F,,,,,52.4E,NAF1993,O,5.367865,49.520738,0.94,housenumber,14 Rue du Luxembourg 55600 Montmédy,55351_0115_00014,G,14 RUE DU LUXEMBOURG,
317267235,00016,31726723500016,O,,NN,,,,true,1,,8,,RUE,DU GENERAL DE GAULLE,55600,MONTMEDY,,,55351,,,,,,,,,,,,,,,,,,,1987-06-01,F,,,,,84.14,NAP,N,5.369002,49.521905,0.82,housenumber,8 Rue Géneral de Gaulle 55600 Montmédy,55351_0080_00008,G,8 RUE GENERAL DE GAULLE,
317267243,00010,31726724300010,O,1979-01-01,NN,,,2010-09-24T08:18:15,true,4,,2,,RUE,DU GENERAL DE GAULLE,55600,MONTMEDY,,,55351,,,,,,,,,,,,,,,,,,,2010-06-30,F,,,,,75.00Z,NAFRev2,N,5.368896,49.521556,0.82,housenumber,2 Rue Géneral de Gaulle 55600 Montmédy,55351_0080_00002,G,2 RUE GENERAL DE GAULLE,
317397164,00011,31739716400011,O,,NN,,,,true,1,,7,,RUE,DE L INDUSTRIE,55600,MONTMEDY,,,55351,,,,,,,,,,,,,,,,,,,1991-03-01,F,,,,,35.01,NAP,N,5.369162,49.519605,0.94,housenumber,7 Rue de l'Industrie 55600 Montmédy,55351_0090_00007,G,7 RUE DE L INDUSTRIE,
317450518,00012,31745051800012,O,,NN,,,,true,1,,5,,RUE,DU LUXEMBOURG,55600,MONTMEDY,,,55351,,,,,,,,,,,,,,,,,,,,F,,,,,00.10,NAP,N,5.367316,49.520465,0.94,housenumber,5 Rue du Luxembourg 55600 Montmédy,55351_0115_00005,G,5 RUE DU LUXEMBOURG,