siren,nic,siret,statutDiffusionEtablissement,dateCreationEtablissement,trancheEffectifsEtablissement,anneeEffectifsEtablissement,activitePrincipaleRegistreMetiersEtablissement,dateDernierTraitementEtablissement,etablissementSiege,nombrePeriodesEtablissement,complementAdresseEtablissement,numeroVoieEtablissement,indiceRepetitionEtablissement,typeVoieEtablissement,libelleVoieEtablissement,codePostalEtablissement,libelleCommuneEtablissement,libelleCommuneEtrangerEtablissement,distributionSpecialeEtablissement,codeCommuneEtablissement,codeCedexEtablissement,libelleCedexEtablissement,codePaysEtrangerEtablissement,libellePaysEtrangerEtablissement,complementAdresse2Etablissement,numeroVoie2Etablissement,indiceRepetition2Etablissement,typeVoie2Etablissement,libelleVoie2Etablissement,codePostal2Etablissement,libelleCommune2Etablissement,libelleCommuneEtranger2Etablissement,distributionSpeciale2Etablissement,codeCommune2Etablissement,codeCedex2Etablissement,libelleCedex2Etablissement,codePaysEtranger2Etablissement,libellePaysEtranger2Etablissement,dateDebut,etatAdministratifEtablissement,enseigne1Etablissement,enseigne2Etablissement,enseigne3Etablissement,denominationUsuelleEtablissement,activitePrincipaleEtablissement,nomenclatureActivitePrincipaleEtablissement,caractereEmployeurEtablissement,longitude,latitude,geo_score,geo_type,geo_adresse,geo_id,geo_ligne,geo_l4,geo_l5
215903428,00013,21590342800013,O,1983-03-01,03,2018,,2020-08-25T10:18:03,true,4,,,,RUE,DE L EGLISE,59740,LEZ-FONTAINE,,,59342,,,,,,,,,,,,,,,,,,,2008-01-01,A,MAIRIE,,,,84.11Z,NAFRev2,N,4.061907,50.177545,0.93,street,Rue de l'Eglise 59740 Lez-Fontaine,59342_0050,G,RUE DE L EGLISE,
215903428,00021,21590342800021,O,1983-12-21,01,2018,,2020-08-25T10:18:03,false,4,,,,RUE,DU GENERAL DE GAULLE,59740,LEZ-FONTAINE,,,59342,,,,,,,,,,,,,,,,,,,2009-06-19,A,ECOLE MATERNELLE,,,,85.10Z,NAFRev2,N,4.06407,50.180666,0.93,street,Rue du Général de Gaulle 59740 Lez-Fontaine,59342_0051,G,RUE DU GENERAL DE GAULLE,
265903427,00010,26590342700010,O,1983-03-01,NN,,,2019-11-14T14:00:47,true,3,MAIRIE,,,RUE,DE L EGLISE,59740,LEZ-FONTAINE,,,59342,,,,,,,,,,,,,,,,,,,2008-01-01,A,CCAS,,,,88.99B,NAFRev2,N,4.061907,50.177545,0.93,street,Rue de l'Eglise 59740 Lez-Fontaine,59342_0050,G,RUE DE L EGLISE,
307636217,00019,30763621700019,O,,,,,2019-11-14T14:00:47,true,1,,,,,LA PLACE,59740,LEZ-FONTAINE,,,59342,,,,,,,,,,,,,,,,,,,1984-12-25,F,,,,,02.20,NAP,N,4.06016,50.17503,0.93,street,La Place 59740 Lez-Fontaine,59342_cs6h85,G,LA PLACE,
316739796,00019,31673979600019,O,,NN,,,2019-11-14T14:00:47,true,1,,,,CHE,DES JONCS,59740,LEZ-FONTAINE,,,59342,,,,,,,,,,,,,,,,,,,,F,,,,,84.10,NAP,N,4.065419,50.175177,0.73,street,Rue des Joncs 59740 Lez-Fontaine,59342_0055,G,RUE DES JONCS,
327305587,00013,32730558700013,O,1983-03-19,NN,,,2019-11-14T14:00:47,true,4,FERME DU TRIANON,2,,RTE,D AVESNES,59740,LEZ-FONTAINE,,,59342,,,,,,,,,,,,,,,,,,,2005-12-31,F,,,,,70.2B,NAFRev1,N,4.070235,50.171261,0.82,housenumber,2 Route d'Avesnes 59740 Lez-Fontaine,59342_0004_00002,G,2 ROUTE D AVESNES,
330024522,00014,33002452200014,O,,,,,2019-11-14T14:00:47,true,1,,,,,LE TRIANON,59740,LEZ-FONTAINE,,,59342,,,,,,,,,,,,,,,,,,,1993-12-14,F,,,,,45.2V,NAF1993,N,4.065466,50.17363,0.74,street,Rue du Trianon 59740 Lez-Fontaine,59342_0045,G,RUE DU TRIANON,
334743432,00018,33474343200018,O,,,,,2019-11-14T14:00:47,true,1,,,,RTE,DE MAUBEUGE,59740,LEZ-FONTAINE,,,59342,,,,,,,,,,,,,,,,,,,1990-12-25,F,,,,,01.3Z,NAF1993,N,4.073148,50.176303,0.76,street,Rue de Maubeuge 59740 Lez-Fontaine,59342_0057,G,RUE DE MAUBEUGE,
338293970,00012,33829397000012,O,1986-07-01,NN,,,2019-11-14T14:00:47,true,5,,12,,RTE,DE MAUBEUGE,59740,LEZ-FONTAINE,,,59342,,,,,,,,,,,,,,,,,,,2018-01-31,F,,,,,01.41Z,NAFRev2,O,4.057421,50.18394,0.79,housenumber,12 Rue de Maubeuge 59740 Lez-Fontaine,59342_0057_00012,G,12 RUE DE MAUBEUGE,
340505155,00028,34050515500028,O,,NN,,,2019-11-14T14:00:47,true,1,,,,,ZI FONTAINE NOTRE DAME,59740,LEZ-FONTAINE,,,59342,,,,,,,,,,,,,,,,,,,1990-12-31,F,,,,,58.04,NAP,N,,,0,,,,,,
342583721,00028,34258372100028,O,2016-02-12,,,,2021-02-23T10:58:03,true,1,,24,,RUE,DU GENERAL DE GAULLE,59740,LEZ-FONTAINE,,,59342,,,,,,,,,,,,,,,,,,,2016-02-12,A,,,,,64.30Z,NAFRev2,N,4.059268,50.17366,0.93,housenumber,24 Rue du Général de Gaulle 59740 Lez-Fontaine,59342_0051_00024,G,24 RUE DU GENERAL DE GAULLE,
377944830,00019,37794483000019,O,1980-01-01,NN,,,2019-11-14T14:00:47,true,1,,,,RUE,DE MAUBEUGE,59740,LEZ-FONTAINE,,,59342,,,,,,,,,,,,,,,,,,,2002-09-30,F,,,,,01.1A,NAF1993,N,4.073148,50.176303,0.93,street,Rue de Maubeuge 59740 Lez-Fontaine,59342_0057,G,RUE DE MAUBEUGE,
379026230,00019,37902623000019,O,,NN,,,2019-11-14T14:00:47,true,1,,,,PL,DE LEZ FONTAINE,59740,LEZ-FONTAINE,,,59342,,,,,,,,,,,,,,,,,,,1993-02-28,F,,,,,01.3Z,NAF1993,N,4.06407,50.180666,0.82,street,Rue du Général de Gaulle 59740 Lez-Fontaine,59342_0051,G,RUE DU GENERAL DE GAULLE,
382021061,00017,38202106100017,O,,NN,,,2019-11-14T14:00:47,true,1,,,,RUE,DU GENERAL DE GAULLE,59740,LEZ-FONTAINE,,,59342,,,,,,,,,,,,,,,,,,,1994-07-01,F,,,,,01.3Z,NAF1993,N,4.06407,50.180666,0.93,street,Rue du Général de Gaulle 59740 Lez-Fontaine,59342_0051,G,RUE DU GENERAL DE GAULLE,
382205029,00012,38220502900012,O,1991-06-01,01,2018,,2020-08-25T10:19:11,true,3,,,,,FERME DU TRIANON,59740,LEZ-FONTAINE,,,59342,,,,,,,,,,,,,,,,,,,2008-01-01,A,,,,,01.41Z,NAFRev2,N,,,0,,,,,,
390453033,00016,39045303300016,O,1993-03-01,NN,,,2019-11-14T14:00:47,false,3,,5,,,LA PLACE,59740,LEZ-FONTAINE,,,59342,,,,,,,,,,,,,,,,,,,2007-01-01,F,,,,,01.2A,NAFRev1,N,4.060805,50.174938,0.93,housenumber,5 La Place 59740 Lez-Fontaine,59342_cs6h85_00005,G,5 LA PLACE,
390453033,00024,39045303300024,O,2007-01-01,,,,2021-02-23T11:16:22,true,2,,1,,RUE,HAUTE,59740,LEZ-FONTAINE,,,59342,,,,,,,,,,,,,,,,,,,2008-01-01,A,,,,,01.11Z,NAFRev2,N,4.062144,50.179597,0.93,housenumber,1 Rue Haute 59740 Lez-Fontaine,59342_b018_00001,G,1 RUE HAUTE,
391084969,00016,39108496900016,O,,NN,,,2019-11-14T14:00:47,true,1,,2,,RUE,LEON PERON,59740,LEZ-FONTAINE,,,59342,,,,,,,,,,,,,,,,,,,1993-09-30,F,,,,,01.3Z,NAF1993,N,4.8812917,46.7712979,0.77,poi,Rue Léon Pernot (Pont) Saint-Marcel,https://osm.org/way/247842555,G,,
392733572,00011,39273357200011,O,1993-10-01,NN,,,2019-11-14T14:00:47,true,3,,2,,RUE,LEON PERON,59740,LEZ-FONTAINE,,,59342,,,,,,,,,,,,,,,,,,,2005-06-01,F,,,,,01.3Z,NAFRev1,N,4.8812917,46.7712979,0.77,poi,Rue Léon Pernot (Pont) Saint-Marcel,https://osm.org/way/247842555,G,,
402916258,00013,40291625800013,O,,NN,,,2019-11-14T14:00:47,true,1,,,,RUE,HAUTE,59740,LEZ-FONTAINE,,,59342,,,,,,,,,,,,,,,,,,,1997-06-30,F,,,,,01.3Z,NAF1993,N,4.062144,50.179597,0.93,street,Rue Haute 59740 Lez-Fontaine,59342_b018,G,RUE HAUTE,
407584283,00011,40758428300011,O,,NN,,,2019-11-14T14:00:47,true,1,,1,,RUE,DES JONCS,59740,LEZ-FONTAINE,,,59342,,,,,,,,,,,,,,,,,,,1997-04-16,F,,,,,01.3Z,NAF1993,N,4.065419,50.175177,0.93,housenumber,1 Rue des Joncs 59740 Lez-Fontaine,59342_0055_00001,G,1 RUE DES JONCS,
407584291,00014,40758429100014,O,1981-01-01,NN,,,2019-11-14T14:00:47,true,4,,,,RTE,DE MAUBEUGE,59740,LEZ-FONTAINE,,,59342,,,,,,,,,,,,,,,,,,,2008-01-01,F,,,,,01.11Z,NAFRev2,N,4.073148,50.176303,0.76,street,Rue de Maubeuge 59740 Lez-Fontaine,59342_0057,G,RUE DE MAUBEUGE,
413770942,00014,41377094200014,O,1997-09-18,NN,,,2019-11-14T14:00:47,true,3,,,,RUE,DU GENERAL DE GAULLE,59740,LEZ-FONTAINE,,,59342,,,,,,,,,,,,,,,,,,,2008-01-01,A,,,,,68.20B,NAFRev2,N,4.06407,50.180666,0.93,street,Rue du Général de Gaulle 59740 Lez-Fontaine,59342_0051,G,RUE DU GENERAL DE GAULLE,
417749652,00018,41774965200018,O,1998-02-15,NN,,,2019-11-14T14:00:47,true,4,,8,,RUE,DE LA CROIX,59740,LEZ-FONTAINE,,,59342,,,,,,,,,,,,,,,,,,,2008-05-17,F,,,,,01.61Z,NAFRev2,N,4.065382,50.174417,0.93,housenumber,8 Rue de la Croix 59740 Lez-Fontaine,59342_0049_00008,G,8 RUE DE LA CROIX,
418696340,00011,41869634000011,O,1998-01-01,NN,,,2019-11-14T14:00:47,true,3,HAM DE LIMONT,,,RUE,DE TRIE,59740,LEZ-FONTAINE,,,59342,,,,,,,,,,,,,,,,,,,2008-01-01,A,,,,,01.45Z,NAFRev2,N,1.8322641,49.2913114,0.81,poi.track,Rue de Labosse (Chemin) Trie-la-Ville,https://osm.org/way/48451969,G,,
424293363,00018,42429336300018,O,1999-09-01,NN,,,2019-11-14T14:00:47,true,3,,3,,RTE,AVESNES,59740,LEZ-FONTAINE,,,59342,,,,,,,,,,,,,,,,,,,2008-01-01,A,,,,,68.20B,NAFRev2,N,4.068352,50.170911,0.74,housenumber,3 Route d'Avesnes 59740 Lez-Fontaine,59342_0004_00003,G,3 ROUTE D AVESNES,
428321780,00010,42832178000010,O,1970-01-01,NN,,,2019-11-14T14:00:47,true,4,,,,,,59740,LEZ-FONTAINE,,,59342,,,,,,,,,,,,,,,,,,,2003-06-09,F,,,,,01.3Z,NAFRev1,N,,,0,,,,,,
441321965,00010,44132196500010,O,2001-07-22,NN,,,2019-11-14T14:00:47,true,3,,1,,CHE,DES COURTILS,59740,LEZ-FONTAINE,,,59342,,,,,,,,,,,,,,,,,,,2008-01-01,A,,,,,94.99Z,NAFRev2,N,0.0197392,47.8907447,0.88,poi.track,Rue des Courtils (Chemin) La Suze-sur-Sarthe,https://osm.org/way/208712693,G,,
443566005,00015,44356600500015,O,2002-09-23,NN,,,2019-11-14T14:00:47,true,1,,1,,RUE,DU GAL DE GAULLE,59740,LEZ-FONTAINE,,,59342,,,,,,,,,,,,,,,,,,,2002-09-30,F,,,,,01.3Z,NAF1993,N,4.06407,50.180666,0.88,housenumber,1 Rue du Général de Gaulle 59740 Lez-Fontaine,59342_0051_00001,G,1 RUE DU GENERAL DE GAULLE,
444257935,00015,44425793500015,O,2002-10-01,,,,2019-11-14T14:00:47,false,5,,1,,RUE,DU GENERAL DE GAULLE,59740,LEZ-FONTAINE,,,59342,,,,,,,,,,,,,,,,,,,2015-09-01,F,,,,,01.50Z,NAFRev2,O,4.06407,50.180666,0.93,housenumber,1 Rue du Général de Gaulle 59740 Lez-Fontaine,59342_0051_00001,G,1 RUE DU GENERAL DE GAULLE,
444257935,00023,44425793500023,O,2015-09-01,02,2018,,2021-02-23T13:26:54,true,1,,3,,RUE,DE LA CROIX,59740,LEZ-FONTAINE,,,59342,,,,,,,,,,,,,,,,,,,2015-09-01,A,,,,,01.50Z,NAFRev2,N,4.062259,50.174342,0.93,housenumber,3 Rue de la Croix 59740 Lez-Fontaine,59342_0049_00003,G,3 RUE DE LA CROIX,
445914203,00010,44591420300010,O,,NN,,,2019-11-14T14:00:47,true,1,,,,RUE,DU GENERAL DE GAULLE,59740,LEZ-FONTAINE,,,59342,,,,,,,,,,,,,,,,,,,1989-06-30,F,,,,,67.04,NAP,N,4.06407,50.180666,0.93,street,Rue du Général de Gaulle 59740 Lez-Fontaine,59342_0051,G,RUE DU GENERAL DE GAULLE,
446310534,00016,44631053400016,O,,NN,,,2019-11-14T14:00:47,true,1,,,,RUE,HAUTE,59740,LEZ-FONTAINE,,,59342,,,,,,,,,,,,,,,,,,,1992-12-31,F,,,,,01.3Z,NAF1993,N,4.062144,50.179597,0.93,street,Rue Haute 59740 Lez-Fontaine,59342_b018,G,RUE HAUTE,
447767161,00014,44776716100014,O,2003-04-01,02,2018,4322AZ,2020-11-01T20:06:54,true,5,,3,,RTE,D'AVESNES,59740,LEZ-FONTAINE,,,59342,,,,,,,,,,,,,,,,,,,2010-03-01,A,ENTREPRISE DEMANEZ,,,,43.22B,NAFRev2,O,4.068352,50.170911,0.82,housenumber,3 Route d'Avesnes 59740 Lez-Fontaine,59342_0004_00003,G,3 ROUTE D AVESNES,
450730262,00018,45073026200018,O,1997-04-30,NN,,,2019-11-14T14:00:47,true,3,,6,,RTE,DE MAUBEUGE,59740,LEZ-FONTAINE,,,59342,,,,,,,,,,,,,,,,,,,2003-06-09,F,,,,,01.3Z,NAFRev1,N,4.067898,50.178942,0.78,housenumber,6 Rue de Maubeuge 59740 Lez-Fontaine,59342_0057_00006,G,6 RUE DE MAUBEUGE,
482770617,00025,48277061700025,O,2011-12-20,,,,2019-11-14T14:00:47,false,2,,24,,RUE,DU GENERAL DE GAULLE,59740,LEZ-FONTAINE,,,59342,,,,,,,,,,,,,,,,,,,2019-01-31,F,,,,,41.10D,NAFRev2,N,4.059268,50.17366,0.93,housenumber,24 Rue du Général de Gaulle 59740 Lez-Fontaine,59342_0051_00024,G,24 RUE DU GENERAL DE GAULLE,
483152526,00016,48315252600016,O,2005-06-01,,,,2019-11-14T14:00:47,true,2,,2,,RUE,LEON PERON,59740,LEZ-FONTAINE,,,59342,,,,,,,,,,,,,,,,,,,2008-01-01,A,,,,,01.50Z,NAFRev2,N,4.8812917,46.7712979,0.77,poi,Rue Léon Pernot (Pont) Saint-Marcel,https://osm.org/way/247842555,G,,
484029178,00023,48402917800023,O,2016-07-01,01,2018,4321AB,2021-02-23T13:49:05,true,1,,1,,RUE,DU CALVAIRE,59740,LEZ-FONTAINE,,,59342,,,,,,,,,,,,,,,,,,,2016-07-01,A,,,,ETS DENIMAL XAVIER,43.21A,NAFRev2,O,4.059974,50.179542,0.93,housenumber,1 Rue du Calvaire 59740 Lez-Fontaine,59342_0015_00001,G,1 RUE DU CALVAIRE,
490192002,00015,49019200200015,O,2006-06-01,NN,,,2019-11-14T14:00:47,true,3,,3,,RTE,D'AVESNES,59740,LEZ-FONTAINE,,,59342,,,,,,,,,,,,,,,,,,,2010-03-01,A,,,,,68.20B,NAFRev2,N,4.068352,50.170911,0.82,housenumber,3 Route d'Avesnes 59740 Lez-Fontaine,59342_0004_00003,G,3 ROUTE D AVESNES,
491680468,00031,49168046800031,O,2010-12-07,,,,2019-11-14T14:00:47,true,2,,1,,RUE,DES JONCS,59740,LEZ-FONTAINE,,,59342,,,,,,,,,,,,,,,,,,,2016-10-31,F,,,,,47.52A,NAFRev2,N,4.065419,50.175177,0.93,housenumber,1 Rue des Joncs 59740 Lez-Fontaine,59342_0055_00001,G,1 RUE DES JONCS,
508515038,00018,50851503800018,O,2008-09-01,,,,2019-11-14T14:00:47,true,2,,1,,CHE,VERT,59740,LEZ-FONTAINE,,,59342,,,,,,,,,,,,,,,,,,,2010-04-19,F,,,,,95.11Z,NAFRev2,N,4.066364,50.17469,0.76,housenumber,1 Chemin Vert 59740 Lez-Fontaine,59342_0062_00001,G,1 CHEMIN VERT,
509540340,00015,50954034000015,O,2009-01-02,,,4321AB,2019-11-14T14:00:47,true,1,,3,,RUE,DU GENERAL DE GAULLE,59740,LEZ-FONTAINE,,,59342,,,,,,,,,,,,,,,,,,,2009-01-02,A,,,,,43.21A,NAFRev2,N,4.063119,50.180003,0.93,housenumber,3 Rue du Général de Gaulle 59740 Lez-Fontaine,59342_0051_00003,G,3 RUE DU GENERAL DE GAULLE,
509577367,00014,50957736700014,O,2009-01-01,NN,,,2019-11-14T14:00:47,false,3,,1,,CHE,VERT,59740,LEZ-FONTAINE,,,59342,,,,,,,,,,,,,,,,,,,2017-01-01,F,HAM-MEDIA,,,,63.12Z,NAFRev2,O,4.066364,50.17469,0.76,housenumber,1 Chemin Vert 59740 Lez-Fontaine,59342_0062_00001,G,1 CHEMIN VERT,
510606510,00012,51060651000012,O,2009-02-18,,,,2019-11-14T14:00:47,true,3,,1,,RTE,DE MAUBEUGE,59740,LEZ-FONTAINE,,,59342,,,,,,,,,,,,,,,,,,,2010-06-03,A,,,,,47.59A,NAFRev2,N,4.073148,50.176303,0.78,housenumber,1 Rue de Maubeuge 59740 Lez-Fontaine,59342_0057_00001,G,1 RUE DE MAUBEUGE,
511483471,00013,51148347100013,O,2009-04-01,,,,2019-11-14T14:00:47,false,2,,3,B,RUE,DU CALVAIRE,59740,LEZ-FONTAINE,,,59342,,,,,,,,,,,,,,,,,,,2012-02-04,F,,,,,47.99B,NAFRev2,N,4.059956,50.181663,0.8,housenumber,3 bis Rue du Calvaire 59740 Lez-Fontaine,59342_0015_00003_bis,G,3 BIS RUE DU CALVAIRE,
521505370,00010,52150537000010,O,2010-04-01,,,,2019-11-14T14:00:47,false,2,,10,,RUE,DE LA CROIX,59740,LEZ-FONTAINE,,,59342,,,,,,,,,,,,,,,,,,,2011-11-03,F,,,,,45.11Z,NAFRev2,N,4.065299,50.174188,0.93,housenumber,10 Rue de la Croix 59740 Lez-Fontaine,59342_0049_00010,G,10 RUE DE LA CROIX,
530436047,00019,53043604700019,O,2010-08-01,,,,2019-11-14T14:00:47,false,2,,1,,CHE,VERT,59740,LEZ-FONTAINE,,,59342,,,,,,,,,,,,,,,,,,,2014-12-01,F,,,,,32.13Z,NAFRev2,N,4.066364,50.17469,0.76,housenumber,1 Chemin Vert 59740 Lez-Fontaine,59342_0062_00001,G,1 CHEMIN VERT,
534746730,00017,53474673000017,O,2011-09-15,,,,2019-11-14T14:00:47,true,1,,1,,,LA PLACE,59740,LEZ-FONTAINE,,,59342,,,,,,,,,,,,,,,,,,,2011-09-15,A,,,,,68.20B,NAFRev2,N,4.06016,50.17503,0.93,housenumber,1 La Place 59740 Lez-Fontaine,59342_cs6h85_00001,G,1 LA PLACE,
783667231,00014,78366723100014,O,1973-01-01,NN,,,2019-11-14T14:00:47,false,4,,,,,LIEUDIT LE TRIANON,59740,LEZ-FONTAINE,,,59342,,,,,,,,,,,,,,,,,,,2006-05-31,F,,,,,45.3F,NAFRev1,O,4.065466,50.17363,0.74,street,Rue du Trianon 59740 Lez-Fontaine,59342_0045,G,RUE DU TRIANON,
783667231,00030,78366723100030,O,2015-10-01,,,,2019-11-14T14:00:47,true,2,,3,,RTE,D'AVESNES,59740,LEZ-FONTAINE,,,59342,,,,,,,,,,,,,,,,,,,2018-12-31,F,,,,,71.12B,NAFRev2,N,4.068352,50.170911,0.82,housenumber,3 Route d'Avesnes 59740 Lez-Fontaine,59342_0004_00003,G,3 ROUTE D AVESNES,
783667249,00016,78366724900016,O,,NN,,,2019-11-14T14:00:47,true,1,,,,LD,LA PLACE,59740,LEZ-FONTAINE,,,59342,,,,,,,,,,,,,,,,,,,,F,,,,,60.01,NAP,N,4.06016,50.17503,0.93,street,La Place 59740 Lez-Fontaine,59342_cs6h85,G,LA PLACE,
789028685,00012,78902868500012,O,2012-11-01,,,,2019-11-14T14:00:47,true,1,,8,,RUE,JEANNETTE,59740,LEZ-FONTAINE,,,59342,,,,,,,,,,,,,,,,,,,2012-11-01,A,,,,,86.90F,NAFRev2,N,4.057669,50.17511,0.93,housenumber,8 Rue Jeannette 59740 Lez-Fontaine,59342_0054_00008,G,8 RUE JEANNETTE,
794880674,00021,79488067400021,O,2013-11-06,,,,2019-11-14T14:00:47,true,2,,24,,RUE,DU GENERAL DE GAULLE,59740,LEZ-FONTAINE,,,59342,,,,,,,,,,,,,,,,,,,2019-05-31,F,,,,,74.30Z,NAFRev2,N,4.059268,50.17366,0.93,housenumber,24 Rue du Général de Gaulle 59740 Lez-Fontaine,59342_0051_00024,G,24 RUE DU GENERAL DE GAULLE,
798503124,00017,79850312400017,O,2013-10-15,,,,2019-11-14T14:00:47,true,2,,2,,RTE,ROUTE DE MAUBEUGE,59740,LEZ-FONTAINE,,,59342,,,,,,,,,,,,,,,,,,,2016-12-31,A,,,,,85.59B,NAFRev2,N,3.9694548,50.2974813,0.77,poi.proposed,Contournement Nord de Maubeuge (Projet de route) Maubeuge,https://osm.org/way/476147100,G,,
801999376,00016,80199937600016,O,2014-04-28,01,2018,,2020-08-25T11:11:56,true,2,,24,,RUE,DU GENERAL DE GAULLE,59740,LEZ-FONTAINE,,,59342,,,,,,,,,,,,,,,,,,,2016-12-18,A,,,,,81.30Z,NAFRev2,O,4.059268,50.17366,0.93,housenumber,24 Rue du Général de Gaulle 59740 Lez-Fontaine,59342_0051_00024,G,24 RUE DU GENERAL DE GAULLE,
802085977,00014,80208597700014,O,2002-11-07,,,,2019-11-14T14:00:47,true,1,,1,,RUE,DE TRIEU,59740,LEZ-FONTAINE,,,59342,,,,,,,,,,,,,,,,,,,2002-11-07,A,,,,,94.99Z,NAFRev2,N,4.059589,50.17497,0.75,housenumber,1 Rue du Trieu 59740 Lez-Fontaine,59342_0052_00001,G,1 RUE DU TRIEU,
802762120,00011,80276212000011,O,2014-06-10,,,5610CR,2019-11-14T14:00:47,true,1,,1,B,RUE,LES CUEES,59740,LEZ-FONTAINE,,,59342,,,,,,,,,,,,,,,,,,,2014-06-10,A,,,,TABBERT FRITERIE,56.10C,NAFRev2,N,,,0,,,,,,
802999763,00013,80299976300013,O,2014-05-01,,,,2019-11-14T14:00:47,true,2,,3,,RUE,DE LA CROIX,59740,LEZ-FONTAINE,,,59342,,,,,,,,,,,,,,,,,,,2014-12-31,F,,,,,47.99A,NAFRev2,N,4.062259,50.174342,0.93,housenumber,3 Rue de la Croix 59740 Lez-Fontaine,59342_0049_00003,G,3 RUE DE LA CROIX,
809447287,00016,80944728700016,O,2015-03-01,,,,2019-11-14T14:00:47,true,2,,1,,RTE,MAUBEUGE,59740,LEZ-FONTAINE,,,59342,,,,,,,,,,,,,,,,,,,2015-04-30,F,,,,,86.90F,NAFRev2,N,4.073148,50.176303,0.75,housenumber,1 Rue de Maubeuge 59740 Lez-Fontaine,59342_0057_00001,G,1 RUE DE MAUBEUGE,
810057497,00010,81005749700010,O,2015-03-03,,,,2019-11-14T14:00:47,true,2,,2,,RUE,LEON PERON,59740,LEZ-FONTAINE,,,59342,,,,,,,,,,,,,,,,,,,2017-05-29,F,,,,,82.11Z,NAFRev2,N,4.8812917,46.7712979,0.77,poi,Rue Léon Pernot (Pont) Saint-Marcel,https://osm.org/way/247842555,G,,
815124763,00013,81512476300013,O,2015-12-01,,,,2019-11-14T14:00:47,true,1,,5,,RUE,JEANNETTE,59740,LEZ-FONTAINE,,,59342,,,,,,,,,,,,,,,,,,,2015-12-01,A,,,,,64.30Z,NAFRev2,N,4.058265,50.175759,0.93,housenumber,5 Rue Jeannette 59740 Lez-Fontaine,59342_0054_00005,G,5 RUE JEANNETTE,
819184326,00018,81918432600018,O,2016-03-15,01,2018,,2020-08-25T11:26:05,true,1,,12,,RUE,DE MAUBEUGE,59740,LEZ-FONTAINE,,,59342,,,,,,,,,,,,,,,,,,,2016-03-15,A,,,,,01.42Z,NAFRev2,N,4.057421,50.18394,0.93,housenumber,12 Rue de Maubeuge 59740 Lez-Fontaine,59342_0057_00012,G,12 RUE DE MAUBEUGE,
821701992,00017,82170199200017,O,2015-07-27,,,,2019-11-14T14:00:47,true,1,,1,B,LD,LES CUEES,59740,LEZ-FONTAINE,,,59342,,,,,,,,,,,,,,,,,,,2015-07-27,A,,,,,68.20A,NAFRev2,N,4.059563,50.162314,0.72,housenumber,1 bis Les Cuees 59740 Lez-Fontaine,59342_4rs222_00001_bis,G,1 BIS LES CUEES,
827680257,00017,82768025700017,O,2016-10-11,,,,2019-11-14T14:00:47,true,1,,8,,RUE,DES JONCS,59740,LEZ-FONTAINE,,,59342,,,,,,,,,,,,,,,,,,,2016-10-11,A,,,,,94.99Z,NAFRev2,N,4.066451,50.176599,0.93,housenumber,8 Rue des Joncs 59740 Lez-Fontaine,59342_0055_00008,G,8 RUE DES JONCS,
831003553,00011,83100355300011,O,2017-06-21,,,,2019-11-14T14:00:47,true,1,,8,,,RUE DES JONCS,59740,LEZ-FONTAINE,,,59342,,,,,,,,,,,,,,,,,,,2017-06-21,A,,,,,85.51Z,NAFRev2,N,4.066451,50.176599,0.93,housenumber,8 Rue des Joncs 59740 Lez-Fontaine,59342_0055_00008,G,8 RUE DES JONCS,
833811979,00016,83381197900016,O,2017-12-07,,,4520AC,2019-11-14T14:00:47,true,1,,1,,RUE,DU TRIANON,59740,LEZ-FONTAINE,,,59342,,,,,,,,,,,,,,,,,,,2017-12-07,A,,,,PAINT PERFORMANCE,45.20A,NAFRev2,N,4.065466,50.17363,0.93,housenumber,1 Rue du Trianon 59740 Lez-Fontaine,59342_0045_00001,G,1 RUE DU TRIANON,
840765077,00010,84076507700010,O,2018-07-02,,,9602BA,2019-11-14T14:00:47,true,1,,13,,RUE,DU GENERAL DE GAULLE,59740,LEZ-FONTAINE,,,59342,,,,,,,,,,,,,,,,,,,2018-07-02,A,,,,LES FONTAINES DE DOUCEUR,96.02B,NAFRev2,N,4.062447,50.177378,0.93,housenumber,13 Rue du Général de Gaulle 59740 Lez-Fontaine,59342_0051_00013,G,13 RUE DU GENERAL DE GAULLE,
848929774,00018,84892977400018,O,2019-03-07,,,,2019-11-14T14:00:47,true,1,,8,,RUE,DES JONCS,59740,LEZ-FONTAINE,,,59342,,,,,,,,,,,,,,,,,,,2019-03-07,A,,,,,85.59B,NAFRev2,N,4.066451,50.176599,0.93,housenumber,8 Rue des Joncs 59740 Lez-Fontaine,59342_0055_00008,G,8 RUE DES JONCS,
888021912,00017,88802191200017,O,2020-07-27,,,,2020-08-12T11:41:32,true,1,FERME DU TRIANON,2,,RTE,D'AVESNES,59740,LEZ-FONTAINE,,,59342,,,,,,,,,,,,,,,,,,,2020-07-27,A,,,,GFA DU TRIANON,60.20B,NAFRev2,N,4.070235,50.171261,0.82,housenumber,2 Route d'Avesnes 59740 Lez-Fontaine,59342_0004_00002,G,2 ROUTE D AVESNES,
891556193,00011,89155619300011,O,2020-12-01,,,,2020-12-02T03:57:51,true,1,,24,,RUE,DU GENERAL DE GAULLE,59740,LEZ-FONTAINE,,,59342,,,,,,,,,,,,,,,,,,,2020-12-01,A,,,,,68.20B,NAFRev2,N,4.059268,50.17366,0.93,housenumber,24 Rue du Général de Gaulle 59740 Lez-Fontaine,59342_0051_00024,G,24 RUE DU GENERAL DE GAULLE,
