siren,nic,siret,statutDiffusionEtablissement,dateCreationEtablissement,trancheEffectifsEtablissement,anneeEffectifsEtablissement,activitePrincipaleRegistreMetiersEtablissement,dateDernierTraitementEtablissement,etablissementSiege,nombrePeriodesEtablissement,complementAdresseEtablissement,numeroVoieEtablissement,indiceRepetitionEtablissement,typeVoieEtablissement,libelleVoieEtablissement,codePostalEtablissement,libelleCommuneEtablissement,libelleCommuneEtrangerEtablissement,distributionSpecialeEtablissement,codeCommuneEtablissement,codeCedexEtablissement,libelleCedexEtablissement,codePaysEtrangerEtablissement,libellePaysEtrangerEtablissement,complementAdresse2Etablissement,numeroVoie2Etablissement,indiceRepetition2Etablissement,typeVoie2Etablissement,libelleVoie2Etablissement,codePostal2Etablissement,libelleCommune2Etablissement,libelleCommuneEtranger2Etablissement,distributionSpeciale2Etablissement,codeCommune2Etablissement,codeCedex2Etablissement,libelleCedex2Etablissement,codePaysEtranger2Etablissement,libellePaysEtranger2Etablissement,dateDebut,etatAdministratifEtablissement,enseigne1Etablissement,enseigne2Etablissement,enseigne3Etablissement,denominationUsuelleEtablissement,activitePrincipaleEtablissement,nomenclatureActivitePrincipaleEtablissement,caractereEmployeurEtablissement,longitude,latitude,geo_score,geo_type,geo_adresse,geo_id,geo_ligne,geo_l4,geo_l5
045971777,00011,04597177700011,O,,NN,,,,true,1,,,,,,64260,BUZY,,,64157,,,,,,,,,,,,,,,,,,,1990-10-09,F,,,,,67.04,NAP,N,,,0,,,,,,
046071635,00018,04607163500018,O,,,,,,true,1,,,,,,64260,BUZY,,,64157,,,,,,,,,,,,,,,,,,,1984-12-25,F,,,,,81.21,NAP,N,,,0,,,,,,
046270096,00012,04627009600012,O,1962-01-01,NN,,,,true,3,,,,RTE,D'OLORON STE MARIE,64260,BUZY,,,64157,,,,,,,,,,,,,,,,,,,2001-04-14,F,,,,,70.2C,NAF1993,N,-0.466342,43.13828,0.78,street,Route d'Oloron Sainte-marie 64260 Buzy,64157_0710,G,ROUTE D OLORON SAINTE MARIE,
046271284,00013,04627128400013,O,,,,,,true,1,,,,,,64260,BUZY,,,64157,,,,,,,,,,,,,,,,,,,1989-08-08,F,,,,,81.21,NAP,N,,,0,,,,,,
046470027,00015,04647002700015,O,,NN,,,,true,1,,,,CHE,DE REBENACQ,64260,BUZY,,,64157,,,,,,,,,,,,,,,,,,,1993-09-27,F,,,,,51.1A,NAF1993,N,-0.414086,43.160332,0.82,street,Chemin de Rebenacq 64260 Buzy,64157_0840,G,CHEMIN DE REBENACQ,
046470878,00011,04647087800011,O,,,,,2010-02-28T05:32:06,true,1,,,,,,64260,BUZY,,,64157,,,,,,,,,,,,,,,,,,,1984-12-25,F,,,,,00.97,NAP,N,,,0,,,,,,
046770384,00017,04677038400017,O,,,,,,true,1,,,,,,64260,BUZY,,,64157,,,,,,,,,,,,,,,,,,,1984-12-25,F,,,,,69.11,NAP,N,,,0,,,,,,
047170717,00046,04717071700046,O,1994-04-05,NN,,,2008-11-07T00:16:10,true,3,,,,,,64260,BUZY,,,64157,,,,,,,,,,,,,,,,,,,2007-09-28,F,,,,,45.3A,NAFRev1,N,,,0,,,,,,
047170725,00015,04717072500015,O,,NN,,,,true,1,,,,,,64260,BUZY,,,64157,,,,,,,,,,,,,,,,,,,1990-12-31,F,,,,,65.02,NAP,N,,,0,,,,,,
097380737,01282,09738073701282,O,1900-01-01,,,,,false,4,,,,,,64260,BUZY,,,64157,,,,,,,,,,,,,,,,,,,1992-06-30,F,,,,,52.1D,NAF1993,N,,,0,,,,,,
216401570,00017,21640157000017,O,1983-03-01,11,2018,,2020-08-25T10:18:27,true,4,,,,,,64260,BUZY,,,64157,,,,,,,,,,,,,,,,,,,2008-01-01,A,MAIRIE,,,,84.11Z,NAFRev2,O,,,0,,,,,,
216401570,00025,21640157000025,O,1983-12-21,02,2018,,2020-08-25T10:18:27,false,4,,18,,RUE,DE L EGLISE,64260,BUZY,,,64157,,,,,,,,,,,,,,,,,,,2008-03-17,A,ECOLE PRIMAIRE PUBLIQUE,,,,85.20Z,NAFRev2,N,-0.461,43.133853,0.94,housenumber,18 Rue de l'Eglise 64260 Buzy,64157_0500_00018,G,18 RUE DE L EGLISE,
216401570,00033,21640157000033,O,1996-12-25,NN,,,2008-01-04T18:39:07,false,2,MAIRIE,,,,,64260,BUZY,,,64157,,,,,,,,,,,,,,,,,,,2008-01-01,A,SERVICE ASSAINISSEMENT,,,,37.00Z,NAFRev2,N,-0.458168,43.134312,0.91,street,Place de la Mairie 64260 Buzy,64157_0690,D,PLACE DE LA MAIRIE,
216401570,00041,21640157000041,O,2001-09-01,NN,,,2008-04-29T10:48:03,false,4,,,,,HOTEL DE VILLE,64260,BUZY,,,64157,,,,,,,,,,,,,,,,,,,2008-01-01,F,LOTISSEMENT,,,,42.99Z,NAFRev2,N,-0.461503,43.135437,0.37,street,Rue Villefranque 64260 Buzy,64157_0910,G,RUE VILLEFRANQUE,
256400714,00034,25640071400034,O,2001-12-19,,,,2008-01-04T18:53:21,true,3,,,,,HOTEL DE VILLE,64260,BUZY,,,64157,,,,,,,,,,,,,,,,,,,2008-01-01,A,,,,,84.13Z,NAFRev2,N,-0.461503,43.135437,0.37,street,Rue Villefranque 64260 Buzy,64157_0910,G,RUE VILLEFRANQUE,
256402975,00013,25640297500013,O,1990-09-01,02,2018,,2020-08-25T10:20:33,true,5,,,,,MAIRIE,64260,BUZY,,,64157,,,,,,,,,,,,,,,,,,,2008-01-01,A,,,,,84.12Z,NAFRev2,N,-0.458168,43.134312,0.91,street,Place de la Mairie 64260 Buzy,64157_0690,G,PLACE DE LA MAIRIE,
256403072,00018,25640307200018,O,,,,,,true,1,,,,,MAIRIE,64260,BUZY,,,64157,,,,,,,,,,,,,,,,,,,1993-03-29,F,,,,,75.1C,NAF1993,N,-0.458168,43.134312,0.91,street,Place de la Mairie 64260 Buzy,64157_0690,G,PLACE DE LA MAIRIE,
266401504,00011,26640150400011,O,1983-03-01,NN,,,2009-10-24T03:32:50,true,3,MAIRIE,,,,,64260,BUZY,,,64157,,,,,,,,,,,,,,,,,,,2008-01-01,A,CCAS,,,,88.99B,NAFRev2,N,-0.458168,43.134312,0.91,street,Place de la Mairie 64260 Buzy,64157_0690,D,PLACE DE LA MAIRIE,
266401504,00029,26640150400029,O,2008-01-01,NN,,,2010-04-18T03:18:39,false,3,,1,,PL,DE LA MAIRIE,64260,BUZY,,,64157,,,,,,,,,,,,,,,,,,,2009-06-25,F,SERVICE D AIDE A DOMICILE,,,,88.10A,NAFRev2,O,-0.458168,43.134312,0.84,housenumber,1 Place de la Mairie 64260 Buzy,64157_0690_00001,G,1 PLACE DE LA MAIRIE,
266406040,00011,26640604000011,O,1995-12-25,,,,,true,2,,,,,MAIRIE,64260,BUZY,,,64157,,,,,,,,,,,,,,,,,,,2003-03-03,F,CDE,,,,85.3K,NAFRev1,N,-0.458168,43.134312,0.91,street,Place de la Mairie 64260 Buzy,64157_0690,G,PLACE DE LA MAIRIE,
300124120,00043,30012412000043,O,1996-02-26,NN,,,2008-11-07T00:16:33,true,4,,,,RTE,DE BELAIR,64260,BUZY,,,64157,,,,,,,,,,,,,,,,,,,2008-02-01,F,,,,,43.99C,NAFRev2,N,-0.424158,43.161854,0.81,street,Route de Belair 64260 Buzy,64157_0320,G,ROUTE DE BELAIR,
300563566,00029,30056356600029,O,1900-01-01,NN,,,2011-12-14T14:04:02,true,4,,,,,,64260,BUZY,,,64157,,,,,,,,,,,,,,,,,,,2010-03-04,F,,,,,68.20B,NAFRev2,N,,,0,,,,,,
300682408,00020,30068240800020,O,,,,,,true,1,,,,,QUARTIER DE LA GARE,64260,BUZY,,,64157,,,,,,,,,,,,,,,,,,,1984-12-25,F,,,,,62.46,NAP,N,3.1663515,50.6973306,0.89,poi.post_office,Bureau de Poste du quartier de la Gare Roubaix,https://osm.org/way/80366447,G,,
301373197,00013,30137319700013,O,,,,,,true,1,,,,,,64260,BUZY,,,64157,,,,,,,,,,,,,,,,,,,1984-12-25,F,,,,,,,N,,,0,,,,,,
305432650,00011,30543265000011,O,,NN,,,,true,1,,,,,,64260,BUZY,,,64157,,,,,,,,,,,,,,,,,,,,F,,,,,67.07,NAP,N,,,0,,,,,,
308956127,00010,30895612700010,O,,,,,,true,1,,,,,,64260,BUZY,,,64157,,,,,,,,,,,,,,,,,,,1990-12-31,F,,,,,55.71,NAP,N,,,0,,,,,,
309546984,00019,30954698400019,O,,,,,,true,1,,,,,,64260,BUZY,,,64157,,,,,,,,,,,,,,,,,,,1984-12-25,F,,,,,00.10,NAP,N,,,0,,,,,,
309901239,00017,30990123900017,O,,NN,,,,true,1,,,,,MAISON PARIS,64260,BUZY,,,64157,,,,,,,,,,,,,,,,,,,1994-02-03,F,,,,,45.4C,NAF1993,N,2.318513,48.8830526,0.9,poi.pub,La Maison (Pub) Paris,https://osm.org/node/5138118324,G,,
310209572,00018,31020957200018,O,,NN,,,,true,1,,,,,CROIX DE BUZY,64260,BUZY,,,64157,,,,,,,,,,,,,,,,,,,,F,,,,,59.13,NAP,N,,,0,,,,,,
312473184,00017,31247318400017,O,1978-01-01,,,,2008-11-07T00:27:38,true,4,,,,LOT,PALISSES,64260,BUZY,,,64157,,,,,,,,,,,,,,,,,,,2005-03-17,F,,,,,45.2V,NAFRev1,N,-0.462009,43.135333,0.71,street,Lotissement Palisse 64260 Buzy,64157_a100,G,LOTISSEMENT PALISSE,
317289569,00012,31728956900012,O,1900-01-01,NN,,,,true,4,,,,QUAI,D OUNTE,64260,BUZY,,,64157,,,,,,,,,,,,,,,,,,,1995-12-25,F,,,,,20.1A,NAF1993,O,,,0,,,,,,
318384211,00039,31838421100039,O,1984-10-05,NN,,,2014-07-08T00:22:06,true,4,,,,,,64260,BUZY,,,64157,,,,,,,,,,,,,,,,,,,2009-08-31,F,,,,,43.22A,NAFRev2,N,,,0,,,,,,
319071122,00034,31907112200034,O,1997-08-04,,,,,true,1,,,,HAM,DE BUZY,64260,BUZY,,,64157,,,,,,,,,,,,,,,,,,,1998-05-31,F,,,,,52.6E,NAF1993,N,-0.459494,43.134276,0.91,street,Rue de l'Eglise 64260 Buzy,64157_0500,G,RUE DE L EGLISE,
319506259,00013,31950625900013,O,,,,,,true,1,,,,,QUARTIER LAMINE,64260,BUZY,,,64157,,,,,,,,,,,,,,,,,,,1989-12-01,F,,,,,49.01,NAP,N,0.0723471,43.2275411,0.73,poi.3,Quartier Larrey (Patrimoine national) Tarbes,https://osm.org/way/35894668,G,,
319744090,00014,31974409000014,O,,,,,,true,1,,,,,QUARTIER LAMAINE,64260,BUZY,,,64157,,,,,,,,,,,,,,,,,,,1992-05-25,F,,,,,45.2L,NAF1993,N,,,0,,,,,,
322310632,00029,32231063200029,O,,,,,,true,1,,,,,QU PRAT,64260,BUZY,,,64157,,,,,,,,,,,,,,,,,,,1985-12-25,F,,,,,49.01,NAP,N,,,0,,,,,,
322495599,00027,32249559900027,O,1990-07-02,NN,,,2015-11-04T05:20:53,true,5,,32,,RTE,BELAIR,64260,BUZY,,,64157,,,,,,,,,,,,,,,,,,,2008-01-01,F,,,,,85.51Z,NAFRev2,N,-0.419741,43.160835,0.8,housenumber,32 Route de Belair 64260 Buzy,64157_0320_00032,G,32 ROUTE DE BELAIR,
323154658,00013,32315465800013,O,,NN,,,,true,1,,,,,,64260,BUZY,,,64157,,,,,,,,,,,,,,,,,,,,F,,,,,35.01,NAP,N,,,0,,,,,,
323671206,00031,32367120600031,O,2019-01-01,,,8129BP,2021-02-23T10:47:00,true,1,LOTISSEMENT LES CHENES,10,,RUE,DU LURIEN,64260,BUZY,,,64157,,,,,,,,,,,,,,,,,,,2019-01-01,A,,,,,81.29B,NAFRev2,N,-0.464214,43.125385,0.74,housenumber,10 Rue Lurien 64260 Buzy,64157_0685_00010,G,10 RUE LURIEN,
328884879,00011,32888487900011,O,1984-01-01,02,2018,,2020-08-25T10:33:29,true,5,HAMEAU DE BUZY,,,,,64260,BUZY,,,64157,,,,,,,,,,,,,,,,,,,2013-12-31,A,,,,,33.20D,NAFRev2,O,,,0,,,,,,
330499187,00012,33049918700012,O,,,,,,true,1,,,,,,64260,BUZY,,,64157,,,,,,,,,,,,,,,,,,,1997-09-29,F,,,,,93.0D,NAF1993,N,,,0,,,,,,
331728394,00015,33172839400015,O,1985-02-01,NN,,,,true,1,,,,,,64260,BUZY,,,64157,,,,,,,,,,,,,,,,,,,2002-03-23,F,,,,,01.2A,NAF1993,N,,,0,,,,,,
334947660,00018,33494766000018,O,1985-12-01,NN,,,2015-05-14T06:53:49,true,4,,,,,,64260,BUZY,,,64157,,,,,,,,,,,,,,,,,,,2013-12-31,F,,,,,01.42Z,NAFRev2,N,,,0,,,,,,
337509335,00036,33750933500036,O,1993-07-01,,,,,false,3,,,,,MAISON LASSALLE,64260,BUZY,,,64157,,,,,,,,,,,,,,,,,,,1997-11-01,F,,,,,92.6C,NAF1993,N,,,0,,,,,,
338072440,00013,33807244000013,O,,NN,,,,true,1,,,,,LA TOURBIERE,64260,BUZY,,,64157,,,,,,,,,,,,,,,,,,,1988-10-01,F,,,,,55.10,NAP,N,6.8975953,48.1324763,0.89,poi.track,Chemin de la Tourbière Arrentès-de-Corcieux,https://osm.org/way/145464181,G,,
339070997,00012,33907099700012,O,1986-10-13,NN,,,2016-04-26T03:29:19,true,6,,,,,,64260,BUZY,,,64157,,,,,,,,,,,,,,,,,,,2013-12-31,A,,,,,55.20Z,NAFRev2,N,,,0,,,,,,
339581530,00021,33958153000021,O,1990-10-01,NN,,3103ZZ,2018-01-04T04:01:02,true,4,,,,QUA,LARRIBAU,64260,BUZY,,,64157,,,,,,,,,,,,,,,,,,,2017-12-31,F,,,,,31.03Z,NAFRev2,N,,,0,,,,,,
339583312,00014,33958331200014,O,1986-12-01,NN,,,,true,1,,,,RTE,D'OLORON STE MARIE,64260,BUZY,,,64157,,,,,,,,,,,,,,,,,,,1998-06-30,F,,,,,52.6D,NAF1993,N,-0.466342,43.13828,0.78,street,Route d'Oloron Sainte-marie 64260 Buzy,64157_0710,G,ROUTE D OLORON SAINTE MARIE,
341396331,00017,34139633100017,O,1900-01-01,NN,,,2011-05-04T00:12:59,true,4,,1,,CHE,D'ILLOS,64260,BUZY,,,64157,,,,,,,,,,,,,,,,,,,2010-01-01,A,,,,,01.42Z,NAFRev2,N,-0.408565,43.166094,0.81,housenumber,1 Chemin d'Illos 64260 Buzy,64157_0535_00001,G,1 CHEMIN D ILLOS,
341751931,00021,34175193100021,O,1988-07-01,NN,,,2008-01-04T21:55:54,false,3,,,,,,64260,BUZY,,,64157,,,,,,,,,,,,,,,,,,,2008-01-01,A,,,,,85.51Z,NAFRev2,N,,,0,,,,,,
342364460,00010,34236446000010,O,1987-09-15,NN,,,2019-11-19T14:34:51,true,5,,,,,,64260,BUZY,,,64157,,,,,,,,,,,,,,,,,,,2019-10-31,A,,,,,68.20B,NAFRev2,N,,,0,,,,,,
345281794,00015,34528179400015,O,1988-05-31,NN,,,2016-03-08T10:16:36,true,4,,,,,,64260,BUZY,,,64157,,,,,,,,,,,,,,,,,,,2016-03-01,A,,,,,68.20B,NAFRev2,N,,,0,,,,,,
347384141,00011,34738414100011,O,1988-07-11,NN,,,2009-04-29T20:14:30,true,6,,,,LOT,LES CHENES,64260,BUZY,,,64157,,,,,,,,,,,,,,,,,,,2009-04-30,F,,,,,47.81Z,NAFRev2,N,,,0,,,,,,
348736547,00012,34873654700012,O,1988-06-01,NN,,,2020-03-30T14:30:48,true,4,,,,,,64260,BUZY,,,64157,,,,,,,,,,,,,,,,,,,2008-01-01,A,,,,,68.20B,NAFRev2,N,,,0,,,,,,
348736547,00020,34873654700020,O,2009-01-01,,,,2020-03-30T14:31:27,false,2,,2,,CHE,DE DEPART,64260,BUZY,,,64157,,,,,,,,,,,,,,,,,,,2020-03-15,F,,,,,01.49Z,NAFRev2,N,-0.444812,43.151686,0.87,housenumber,2 Chemin de Depart 64260 Buzy,64157_0470_00002,G,2 CHEMIN DE DEPART,
349802587,00015,34980258700015,O,1989-01-01,NN,,,2008-01-04T23:08:53,true,3,,,,,,64260,BUZY,,,64157,,,,,,,,,,,,,,,,,,,2008-01-01,A,,,,,01.42Z,NAFRev2,N,,,0,,,,,,
349810143,00017,34981014300017,O,1989-02-15,NN,,,2006-08-01T07:55:48,true,3,,,,,,64260,BUZY,,,64157,,,,,,,,,,,,,,,,,,,2003-03-31,F,,,,,55.4B,NAFRev1,N,,,0,,,,,,
349968313,00016,34996831300016,O,1989-02-01,NN,,,2007-01-18T09:27:04,true,3,,,,,,64260,BUZY,,,64157,,,,,,,,,,,,,,,,,,,1998-12-25,F,,,,,01.2A,NAF1993,N,,,0,,,,,,
351157664,00043,35115766400043,O,2017-09-01,03,2018,,2020-09-24T12:09:42,true,1,,14,,RUE,DU DOLMEN,64260,BUZY,,,64157,,,,,,,,,,,,,,,,,,,2017-09-01,A,,,,,49.41B,NAFRev2,N,-0.447135,43.130112,0.78,housenumber,14 Route du Dolmen 64260 Buzy,64157_0480_00014,G,14 ROUTE DU DOLMEN,
353127384,00017,35312738400017,O,1989-12-01,NN,,,2008-01-04T23:50:49,true,3,,,,,,64260,BUZY,,,64157,,,,,,,,,,,,,,,,,,,2008-01-01,A,,,,,01.42Z,NAFRev2,N,,,0,,,,,,
353805005,00058,35380500500058,O,2001-06-25,NN,,,,false,4,,5,,LOT,DE LA GARE,64260,BUZY,,,64157,,,,,,,,,,,,,,,,,,,2002-01-07,F,,,,,92.6C,NAF1993,N,0.1677821,44.503243,0.71,poi.restaurant,Buffet de la Gare (Restaurant) Marmande,https://osm.org/node/3741375272,G,,
356000000,27313,35600000027313,O,2012-01-01,,,,2019-01-08T03:56:34,false,3,,15,,RUE,DU CHATEAU LASSALLE,64260,BUZY,,,64157,,,,,,,,,,,,,,,,,,,2017-12-31,F,LA POSTE,,,,53.10Z,NAFRev2,N,-0.456231,43.133019,0.76,housenumber,15 Rue Chateau de Lassalle 64260 Buzy,64157_0460_00015,G,15 RUE CHATEAU DE LASSALLE,
356000729,00190,35600072900190,O,1991-01-01,NN,,,2009-10-17T13:05:03,false,4,,15,,RUE,DU CHATEAU DE LASSALLE,64260,BUZY,,,64157,,,,,,,,,,,,,,,,,,,2009-03-18,F,BUREAU DE POSTE,,,,53.10Z,NAFRev2,O,-0.456231,43.133019,0.83,housenumber,15 Rue Chateau de Lassalle 64260 Buzy,64157_0460_00015,G,15 RUE CHATEAU DE LASSALLE,
380965954,00015,38096595400015,O,1991-02-17,,,,2019-12-13T03:38:53,true,6,,4,,RUE,DE BONNEHON,64260,BUZY,,,64157,,,,,,,,,,,,,,,,,,,2019-09-09,F,,,,,55.20Z,NAFRev2,N,-0.460626,43.132457,0.8,housenumber,4 Rue Bonnehon 64260 Buzy,64157_0370_00004,G,4 RUE BONNEHON,
381041706,00015,38104170600015,O,1991-02-01,00,2018,,2021-02-23T11:09:30,true,3,,12,,CHE,DE BERNIS,64260,BUZY,,,64157,,,,,,,,,,,,,,,,,,,2008-01-01,A,,,,,01.41Z,NAFRev2,N,-0.447741,43.144721,0.83,housenumber,12 Chemin de Bernis 64260 Buzy,64157_0330_00012,G,12 CHEMIN DE BERNIS,
381076181,00019,38107618100019,O,1991-01-01,NN,,,2008-01-04T21:51:09,true,3,,,,,,64260,BUZY,,,64157,,,,,,,,,,,,,,,,,,,2008-01-01,A,,,,,01.42Z,NAFRev2,N,,,0,,,,,,
381719962,00031,38171996200031,O,1996-12-01,03,2018,,2020-08-25T10:18:44,true,3,,,,,,64260,BUZY,,,64157,,,,,,,,,,,,,,,,,,,2008-01-01,A,,,,,94.99Z,NAFRev2,O,,,0,,,,,,
383576659,00015,38357665900015,O,1991-11-12,00,2018,4332AA,2020-08-25T10:20:34,false,5,,,,RUE,DU STADE,64260,BUZY,,,64157,,,,,,,,,,,,,,,,,,,2018-12-31,F,,,,,43.32A,NAFRev2,O,-0.461618,43.132965,0.94,street,Rue du Stade 64260 Buzy,64157_0880,G,RUE DU STADE,
384497764,00017,38449776400017,O,1992-01-01,NN,,,2008-01-04T22:39:42,true,4,,,,,,64260,BUZY,,,64157,,,,,,,,,,,,,,,,,,,2007-01-01,F,,,,,01.1A,NAFRev1,N,,,0,,,,,,
384853545,00018,38485354500018,O,1992-01-06,NN,,,2008-01-05T19:57:17,true,3,,,,,QUARTIER D'OURTE ET SERRUS,64260,BUZY,,BP 3,64157,,,,,,,,,,,,,,,,,,,2008-01-01,A,,,,,68.20B,NAFRev2,N,,,0,,,,,,
387588676,00024,38758867600024,O,2005-10-01,,,,2010-06-14T08:48:36,false,3,CAMPING MUNICIPAL LES CHEN,,,,VILLAGE,64260,BUZY,,,64157,,,,,,,,,,,,,,,,,,,2010-06-01,F,,,,,90.01Z,NAFRev2,N,4.39087,45.4547668,0.89,poi.cafe,Village Café Saint-Étienne,https://osm.org/node/5321738834,G,,
387882889,00042,38788288900042,O,,,,,,true,1,,,,PL,DU PRAT,64260,BUZY,,,64157,,,,,,,,,,,,,,,,,,,1997-10-05,F,,,,,92.6C,NAF1993,N,-0.460894,43.130163,0.77,street,Place du Prat 64260 Buzy,64157_0810,G,PLACE DU PRAT,
387929714,00013,38792971400013,O,1989-01-01,NN,,,2011-12-23T06:01:21,true,5,CAFE LANOT,,,PL,DE L'EGLISE,64260,BUZY,,,64157,,,,,,,,,,,,,,,,,,,2011-09-30,A,,,,,93.12Z,NAFRev2,N,-0.459078,43.133628,0.81,street,Place de l'Eglise 64260 Buzy,64157_0005,G,PLACE DE L EGLISE,
387930142,00014,38793014200014,O,1989-01-01,NN,,,2008-01-04T23:01:23,true,3,,,,,,64260,BUZY,,,64157,,,,,,,,,,,,,,,,,,,2008-01-01,A,,,,,93.12Z,NAFRev2,N,,,0,,,,,,
387932213,00011,38793221300011,O,1986-05-01,NN,,,2008-01-04T23:01:26,true,3,,,,,,64260,BUZY,,,64157,,,,,,,,,,,,,,,,,,,2008-01-01,A,,,,,68.20B,NAFRev2,N,,,0,,,,,,
387934987,00018,38793498700018,O,1992-06-11,,,,2006-12-15T00:47:00,false,3,,,,,MAISON BORIE,64260,BUZY,,,64157,,,,,,,,,,,,,,,,,,,1997-04-22,F,,,,,01.3Z,NAF1993,N,4.8229676,45.731344,0.89,poi.restaurant,Maison Borie (Restaurant) Lyon,https://osm.org/node/470912184,G,,
387934987,00026,38793498700026,O,1992-06-11,NN,,,2008-01-04T23:01:28,true,3,,,,,,64260,BUZY,,,64157,,,,,,,,,,,,,,,,,,,2008-01-01,A,,,,,01.11Z,NAFRev2,N,,,0,,,,,,
387944515,00015,38794451500015,O,1986-01-01,NN,,,2008-01-04T23:01:35,true,3,,,,,,64260,BUZY,,,64157,,,,,,,,,,,,,,,,,,,2008-01-01,A,,,,,93.12Z,NAFRev2,N,,,0,,,,,,
390385318,00014,39038531800014,O,1993-02-01,NN,,,2017-05-04T03:31:20,true,4,,,,,,64260,BUZY,,,64157,,,,,,,,,,,,,,,,,,,2017-03-01,A,,,,,68.20B,NAFRev2,N,,,0,,,,,,
390752160,00031,39075216000031,O,2000-05-12,NN,,,2007-11-12T08:15:33,true,3,,8,,CHE,BERNIS,64260,BUZY,,,64157,,,,,,,,,,,,,,,,,,,2007-09-30,F,,,,,55.3B,NAFRev1,N,-0.449699,43.148059,0.86,housenumber,8 Chemin de Bernis 64260 Buzy,64157_0330_00008,G,8 CHEMIN DE BERNIS,
390960599,00038,39096059900038,O,2010-07-19,,,,2021-02-23T11:16:51,true,1,LOT LES CHENES,5,,IMP,SAGETTE,64260,BUZY,,,64157,,,,,,,,,,,,,,,,,,,2010-07-19,A,,,,,81.30Z,NAFRev2,N,-0.464321,43.126653,0.8,housenumber,5 Impasse Sagette 64260 Buzy,64157_0845_00005,G,5 IMPASSE SAGETTE,
391822285,00014,39182228500014,O,1993-07-12,NN,,,2016-12-30T09:11:15,false,4,,,,,LOTISSEMENT LES CHENES,64260,BUZY,,,64157,,,,,,,,,,,,,,,,,,,2016-06-13,F,,,,,68.20A,NAFRev2,N,-0.6531587,44.9496666,0.89,poi.cycleway,Lotissement Les Chênes (Piste cyclable) Le Pian-Médoc,https://osm.org/way/328867555,G,,
392483673,00019,39248367300019,O,1991-07-26,NN,,,2013-10-21T11:18:45,true,4,MR HARGOUS J.PH.,,,,MAIRIE,64260,BUZY,,,64157,,,,,,,,,,,,,,,,,,,2013-10-21,A,,,,,94.99Z,NAFRev2,N,-0.458168,43.134312,0.91,street,Place de la Mairie 64260 Buzy,64157_0690,G,PLACE DE LA MAIRIE,
393275672,00086,39327567200086,O,2013-04-01,,,,2021-02-23T11:19:01,true,1,,15,B,RUE,DU CHATEAU DE LASSALLE,64260,BUZY,,,64157,,,,,,,,,,,,,,,,,,,2013-04-01,A,,,,,86.90D,NAFRev2,N,-0.456153,43.132985,0.73,housenumber,15 bis Rue Chateau de Lassalle 64260 Buzy,64157_0460_00015_bis,G,15 BIS RUE CHATEAU DE LASSALLE,
393574520,00010,39357452000010,O,1994-01-10,NN,,4399CZ,2020-07-16T03:42:09,true,6,,,,,,64260,BUZY,,,64157,,,,,,,,,,,,,,,,,,,2020-03-31,F,,,,,43.99C,NAFRev2,N,,,0,,,,,,
393701842,00014,39370184200014,O,1992-12-14,NN,,,2008-01-05T00:19:03,true,3,,,,,,64260,BUZY,,,64157,,,,,,,,,,,,,,,,,,,2008-01-01,A,,,,,01.42Z,NAFRev2,N,,,0,,,,,,
394250377,00014,39425037700014,O,1993-10-22,NN,,,2008-01-04T18:02:54,true,3,MME DUC NATHALIE,,,,,64260,BUZY,,,64157,,,,,,,,,,,,,,,,,,,2008-01-01,A,,,,,94.99Z,NAFRev2,N,,,0,,,,,,
394823025,00033,39482302500033,O,2018-02-07,,,,2021-02-23T11:20:36,true,1,,4,,CHE,BIELHO BORDE,64260,BUZY,,,64157,,,,,,,,,,,,,,,,,,,2018-02-07,A,,,,,85.51Z,NAFRev2,N,-0.427744,43.159603,0.86,housenumber,4 Chemin de Borde Bielho 64260 Buzy,64157_0375_00004,G,4 CHEMIN DE BORDE BIELHO,
397652116,00039,39765211600039,O,2012-07-02,,,,2021-02-23T11:21:25,true,1,LES JARDINS D'OSSAU,2,,CHE,DE DEPART,64260,BUZY,,,64157,,,,,,,,,,,,,,,,,,,2012-07-02,A,,,,,95.29Z,NAFRev2,N,-0.444812,43.151686,0.87,housenumber,2 Chemin de Depart 64260 Buzy,64157_0470_00002,G,2 CHEMIN DE DEPART,
398891580,00019,39889158000019,O,1994-06-19,NN,,,2008-01-04T18:58:41,true,3,CHEZ MR JEAN GUEDOT,,,,,64260,BUZY,,,64157,,,,,,,,,,,,,,,,,,,2008-01-01,A,,,,,73.12Z,NAFRev2,N,,,0,,,,,,
399870633,00019,39987063300019,O,,NN,,,,true,1,,,,,,64260,BUZY,,,64157,,,,,,,,,,,,,,,,,,,1996-03-31,F,,,,,51.5E,NAF1993,N,,,0,,,,,,
400407862,00012,40040786200012,O,1995-01-01,NN,,,2019-11-21T04:08:11,true,3,,,,,,64260,BUZY,,,64157,,,,,,,,,,,,,,,,,,,2007-03-31,F,,,,,01.2A,NAFRev1,N,,,0,,,,,,
401665088,00019,40166508800019,O,1995-06-14,NN,,,2008-01-04T19:51:06,true,5,,,,,MAIRIE,64260,BUZY,,,64157,,,,,,,,,,,,,,,,,,,2008-01-01,A,,,,,93.12Z,NAFRev2,N,-0.458168,43.134312,0.91,street,Place de la Mairie 64260 Buzy,64157_0690,G,PLACE DE LA MAIRIE,
402790646,00010,40279064600010,O,1995-11-06,NN,,,2008-11-08T01:14:14,true,3,,,,,QUARTIER TUBERNE,64260,BUZY,,,64157,,,,,,,,,,,,,,,,,,,2006-06-30,F,,,,,45.2V,NAFRev1,N,,,0,,,,,,
403264617,00024,40326461700024,O,2013-04-01,NN,,,2016-04-26T03:39:46,true,2,,1,,CHE,TUCAT,64260,BUZY,,,64157,,,,,,,,,,,,,,,,,,,2015-04-01,F,,,,,01.45Z,NAFRev2,N,-0.449217,43.140774,0.78,housenumber,1 Chemin Tucat 64260 Buzy,64157_0900_00001,G,1 CHEMIN TUCAT,
407481670,00021,40748167000021,O,2009-07-01,,,,2015-12-17T03:26:51,true,2,,1,,CHE,D OSSAU,64260,BUZY,,,64157,,,,,,,,,,,,,,,,,,,2015-12-15,F,,,,,43.91B,NAFRev2,N,-0.42555,43.159064,0.81,housenumber,1 Chemin d'Ossau 64260 Buzy,64157_0720_00001,G,1 CHEMIN D OSSAU,
408222040,00011,40822204000011,O,1996-07-01,NN,,,,true,1,,,,,CAMPING MUNICIPAL,64260,BUZY,,,64157,,,,,,,,,,,,,,,,,,,2002-12-31,F,,,,,55.2C,NAF1993,N,2.196998,44.9625649,0.92,poi.camp_site,Camping municipal Laroquebrou,https://osm.org/way/244693173,G,,
409520335,00038,40952033500038,O,2021-01-01,,,,2021-02-08T15:43:55,true,2,,15,,CHE,DE LACASSIE,64260,BUZY,,,64157,,,,,,,,,,,,,,,,,,,2021-01-01,F,BIOGEU,,,,01.25Z,NAFRev2,N,,,0,,,,,,
410134696,00054,41013469600054,O,2006-07-01,,,,2016-05-31T10:34:05,false,2,,18,,RUE,LARRIBAU,64260,BUZY,,,64157,,,,,,,,,,,,,,,,,,,2006-12-15,F,,,,,85.1C,NAFRev1,N,-0.464225,43.132039,0.94,housenumber,18 Rue Larribau 64260 Buzy,64157_0670_00018,G,18 RUE LARRIBAU,
410262695,00019,41026269500019,O,1996-12-10,NN,,,2019-03-06T03:40:40,true,3,,,,,,64260,BUZY,,,64157,,,,,,,,,,,,,,,,,,,2008-01-01,A,,,,,01.42Z,NAFRev2,N,,,0,,,,,,
412603649,00010,41260364900010,O,1983-01-01,NN,,,2008-01-04T22:19:23,true,3,,,,,,64260,BUZY,,,64157,,,,,,,,,,,,,,,,,,,2008-01-01,A,,,,,01.42Z,NAFRev2,N,,,0,,,,,,
412603664,00019,41260366400019,O,1981-01-01,NN,,,2008-01-04T22:19:23,true,3,,,,,,64260,BUZY,,,64157,,,,,,,,,,,,,,,,,,,2008-01-01,A,,,,,01.42Z,NAFRev2,N,,,0,,,,,,
412603680,00015,41260368000015,O,1980-09-01,NN,,,2008-01-04T22:19:23,true,3,MAISON LAPEYRE,,,,,64260,BUZY,,,64157,,,,,,,,,,,,,,,,,,,2008-01-01,A,,,,,01.41Z,NAFRev2,N,,,0,,,,,,
412603706,00018,41260370600018,O,1976-01-01,NN,,,2008-01-04T22:19:23,true,3,,,,,,64260,BUZY,,,64157,,,,,,,,,,,,,,,,,,,2008-01-01,A,,,,,01.11Z,NAFRev2,N,,,0,,,,,,
412603722,00015,41260372200015,O,1974-04-01,NN,,,2008-01-04T22:19:23,true,3,,,,,,64260,BUZY,,,64157,,,,,,,,,,,,,,,,,,,2008-01-01,A,,,,,01.42Z,NAFRev2,N,,,0,,,,,,
412605800,00017,41260580000017,O,1986-11-01,NN,,,2008-01-04T22:19:27,true,3,,,,,,64260,BUZY,,,64157,,,,,,,,,,,,,,,,,,,2008-01-01,A,,,,,01.45Z,NAFRev2,N,,,0,,,,,,
412605800,00025,41260580000025,O,2011-01-12,,,,2012-11-09T01:07:15,false,2,,,,,,64260,BUZY,,,64157,,,,,,,,,,,,,,,,,,,2011-12-31,F,,,,,85.59A,NAFRev2,N,,,0,,,,,,
412669921,00014,41266992100014,O,1997-04-04,,,,2008-01-04T22:20:38,true,3,,,,,BORDE DE SABATE,64260,BUZY,,,64157,,,,,,,,,,,,,,,,,,,2008-01-01,A,,,,,94.99Z,NAFRev2,N,0.3960909,42.8717766,0.71,poi.footway,Bié de Dessus Sabathé (Chemin piéton) Bordères-Louron,https://osm.org/way/315377643,G,,
413843079,00018,41384307900018,O,1997-07-15,NN,,,2008-01-04T22:39:26,true,3,,,,RTE,DE BELAY,64260,BUZY,,,64157,,,,,,,,,,,,,,,,,,,2008-01-01,A,,,,,55.20Z,NAFRev2,N,,,0,,,,,,
415114289,00010,41511428900010,O,1997-11-05,NN,,,2015-05-14T08:12:56,true,4,,,,,MAIRIE,64260,BUZY,,,64157,,,,,,,,,,,,,,,,,,,2013-09-30,A,,,,,93.12Z,NAFRev2,N,-0.458168,43.134312,0.91,street,Place de la Mairie 64260 Buzy,64157_0690,G,PLACE DE LA MAIRIE,