siren,nic,siret,statutDiffusionEtablissement,dateCreationEtablissement,trancheEffectifsEtablissement,anneeEffectifsEtablissement,activitePrincipaleRegistreMetiersEtablissement,dateDernierTraitementEtablissement,etablissementSiege,nombrePeriodesEtablissement,complementAdresseEtablissement,numeroVoieEtablissement,indiceRepetitionEtablissement,typeVoieEtablissement,libelleVoieEtablissement,codePostalEtablissement,libelleCommuneEtablissement,libelleCommuneEtrangerEtablissement,distributionSpecialeEtablissement,codeCommuneEtablissement,codeCedexEtablissement,libelleCedexEtablissement,codePaysEtrangerEtablissement,libellePaysEtrangerEtablissement,complementAdresse2Etablissement,numeroVoie2Etablissement,indiceRepetition2Etablissement,typeVoie2Etablissement,libelleVoie2Etablissement,codePostal2Etablissement,libelleCommune2Etablissement,libelleCommuneEtranger2Etablissement,distributionSpeciale2Etablissement,codeCommune2Etablissement,codeCedex2Etablissement,libelleCedex2Etablissement,codePaysEtranger2Etablissement,libellePaysEtranger2Etablissement,dateDebut,etatAdministratifEtablissement,enseigne1Etablissement,enseigne2Etablissement,enseigne3Etablissement,denominationUsuelleEtablissement,activitePrincipaleEtablissement,nomenclatureActivitePrincipaleEtablissement,caractereEmployeurEtablissement,longitude,latitude,geo_score,geo_type,geo_adresse,geo_id,geo_ligne,geo_l4,geo_l5
218901981,00017,21890198100017,O,1983-03-01,12,2018,,2020-08-25T10:19:35,true,4,,,,,,89250,GURGY,,,89198,,,,,,,,,,,,,,,,,,,2008-01-01,A,MAIRIE,,,,84.11Z,NAFRev2,O,,,0,,,,,,
218901981,00025,21890198100025,O,1983-12-21,02,2018,,2020-08-25T10:19:35,false,3,,2,,,GDE RUE,89250,GURGY,,,89198,,,,,,,,,,,,,,,,,,,2008-01-01,A,ECOLE PRIMAIRE PUBLIQUE LE MOULIN,,,,85.20Z,NAFRev2,N,3.560522,47.866278,0.75,housenumber,2 Grande Rue 89250 Gurgy,89198_0160_00002,G,2 GRANDE RUE,
218901981,00033,21890198100033,O,1983-12-21,01,2018,,2020-08-25T10:19:35,false,3,,2,,,GDE RUE,89250,GURGY,,,89198,,,,,,,,,,,,,,,,,,,2008-01-01,A,ECOLE MATERNELLE LE BLE EN HERBE,,,,85.10Z,NAFRev2,N,3.560522,47.866278,0.75,housenumber,2 Grande Rue 89250 Gurgy,89198_0160_00002,G,2 GRANDE RUE,
218901981,00041,21890198100041,O,1996-12-25,NN,,,2008-01-04T18:45:04,false,2,MAIRIE,,,,,89250,GURGY,,,89198,,,,,,,,,,,,,,,,,,,2008-01-01,A,SERVICE ASSAINISSEMENT,,,,37.00Z,NAFRev2,N,,,0,,,,,,
268902111,00015,26890211100015,O,1983-03-01,NN,,,2014-06-13T23:48:20,true,4,,,,,MAIRIE,89250,GURGY,,,89198,,,,,,,,,,,,,,,,,,,2008-01-01,A,CCAS,,,,88.99B,NAFRev2,O,3.0709671,50.6304695,0.92,poi.townhall,Hôtel de Ville Lille,https://osm.org/way/40917078,G,,
278901129,00017,27890112900017,O,,,,,,true,1,,,,,,89250,GURGY,,,89198,,,,,,,,,,,,,,,,,,,1995-12-25,F,,,,,90.0A,NAF1993,N,,,0,,,,,,
298901984,00013,29890198400013,O,1983-08-10,NN,,,2011-08-03T15:08:29,true,4,,,,,MAIRIE,89250,GURGY,,,89198,,,,,,,,,,,,,,,,,,,2011-07-25,F,,,,,42.99Z,NAFRev2,N,3.0709671,50.6304695,0.92,poi.townhall,Hôtel de Ville Lille,https://osm.org/way/40917078,G,,
300107547,00030,30010754700030,O,1990-02-17,NN,,,2008-01-04T19:08:53,true,3,,,,,,89250,GURGY,,,89198,,,,,,,,,,,,,,,,,,,2008-01-01,A,,,,,68.20B,NAFRev2,N,,,0,,,,,,
302020144,00515,30202014400515,O,2017-11-07,,,,2017-12-01T04:20:07,false,1,,,,,LIEUDIT LE PETIT ETANG,89250,GURGY,,,89198,,,,,,,,,,,,,,,,,,,2017-11-07,A,,,,,08.12Z,NAFRev2,N,3.544927,47.888701,0.76,street,Lieu Dit Petit Étang 89250 Gurgy,89198_b084,G,LIEU DIT PETIT ETANG,
302663802,00015,30266380200015,O,,NN,,,,true,1,,,,,,89250,GURGY,,,89198,,,,,,,,,,,,,,,,,,,1987-04-16,F,,,,,67.08,NAP,N,,,0,,,,,,
303236400,00014,30323640000014,O,1900-01-01,,,,,true,3,,4,,IMP,DE L'ABBAYE,89250,GURGY,,,89198,,,,,,,,,,,,,,,,,,,1991-12-25,F,,,,,59.08,NAP,N,3.562083,47.868656,0.84,housenumber,4 Impasse de l'Abbaye 89250 Gurgy,89198_0012_00004,G,4 IMPASSE DE L ABBAYE,
304082183,00043,30408218300043,O,,NN,,,,true,1,,30,,RUE,DE SAULCIS,89250,GURGY,,,89198,,,,,,,,,,,,,,,,,,,1995-03-31,F,,,,,45.2V,NAF1993,N,3.564485,47.864681,0.79,housenumber,30 Rue du Saulcis 89250 Gurgy,89198_0440_00030,G,30 RUE DU SAULCIS,
305505943,00038,30550594300038,O,,NN,,,,true,1,,23,,RUE,DU SAULCIS,89250,GURGY,,,89198,,,,,,,,,,,,,,,,,,,1996-05-31,F,,,,,85.1G,NAF1993,N,3.56183,47.865389,0.94,housenumber,23 Rue du Saulcis 89250 Gurgy,89198_0440_00023,G,23 RUE DU SAULCIS,
307590620,00026,30759062000026,O,,NN,,,,true,1,,3,,PL,DE LA MAIRIE,89250,GURGY,,,89198,,,,,,,,,,,,,,,,,,,,F,,,,,67.08,NAP,N,4.9019022,46.7490994,0.79,poi.park,Place de la Mairie (Parc) Épervans,https://osm.org/way/234085031,G,,
308066307,00023,30806630700023,O,1997-01-01,,,,2008-04-26T08:48:47,false,3,,41,,RUE,DE L'ILE CHAMONT,89250,GURGY,,,89198,,,,,,,,,,,,,,,,,,,2005-11-26,F,,,,,45.2V,NAFRev1,O,3.560547,47.859304,0.87,housenumber,41 Rue de l'Ile Chamond 89250 Gurgy,89198_0210_00041,G,41 RUE DE L ILE CHAMOND,
310078571,00034,31007857100034,O,1987-01-01,NN,,,2012-07-23T11:38:56,false,5,,9,,RUE,DE L ILE CHAMOND,89250,GURGY,,,89198,,,,,,,,,,,,,,,,,,,2012-05-25,F,,,,,86.23Z,NAFRev2,N,3.559871,47.864284,0.94,housenumber,9 Rue de l'Ile Chamond 89250 Gurgy,89198_0210_00009,G,9 RUE DE L ILE CHAMOND,
311272512,00014,31127251200014,O,,,,,,true,1,,,,,CHATEAU DE GUILLEBEAUDON,89250,GURGY,,,89198,,,,,,,,,,,,,,,,,,,1984-12-25,F,,,,,64.49,NAP,N,3.58598,47.877386,0.87,street,Chateau de Guillebaudon 89250 Gurgy,89198_b030,G,CHATEAU DE GUILLEBAUDON,
311875876,00030,31187587600030,O,1992-07-02,NN,,,2006-12-22T10:13:15,true,3,,23,,,GRANDE RUE,89250,GURGY,,,89198,,,,,,,,,,,,,,,,,,,2006-12-31,F,,,,,52.2P,NAFRev1,N,3.562937,47.866226,0.94,housenumber,23 Grande Rue 89250 Gurgy,89198_0160_00023,G,23 GRANDE RUE,
312987118,00014,31298711800014,O,1900-01-01,,,,2016-03-15T03:26:15,true,6,NERON RAVEUSE,3,,RTE,DES CHAUMES,89250,GURGY,,,89198,,,,,,,,,,,,,,,,,,,2016-03-10,F,,,,,02.10Z,NAFRev2,N,3.561745,47.870569,0.83,housenumber,3 Route des Chaumes 89250 Gurgy,89198_0072_00003,G,3 ROUTE DES CHAUMES,
313522807,00038,31352280700038,O,1986-06-01,NN,,,2009-06-27T03:59:54,true,5,,11,,RUE,DES VARENNES,89250,GURGY,,,89198,,,,,,,,,,,,,,,,,,,2008-01-01,F,,,,,56.21Z,NAFRev2,O,3.563155,47.870018,0.94,housenumber,11 Rue des Varennes 89250 Gurgy,89198_0475_00011,G,11 RUE DES VARENNES,
313740052,00037,31374005200037,O,1981-11-01,NN,,,2014-07-08T00:17:45,true,4,,3,,RUE,DE VARENNES,89250,GURGY,,,89198,,,,,,,,,,,,,,,,,,,2009-03-31,F,,,,,43.34Z,NAFRev2,N,3.56228,47.870022,0.84,housenumber,3 Rue des Varennes 89250 Gurgy,89198_0475_00003,G,3 RUE DES VARENNES,
314175639,00017,31417563900017,O,,,,,,true,1,,,,CHE,DE L'ORMEE,89250,GURGY,,,89198,,,,,,,,,,,,,,,,,,,,F,,,,,55.60,NAP,N,3.565223,47.866275,0.82,street,Chemin de l'Ormee 89250 Gurgy,89198_0321,G,CHEMIN DE L ORMEE,
316378116,00016,31637811600016,O,1979-01-01,,,,2008-07-08T16:25:01,true,3,,,,LD,BAS DE LA RUE AUX VACHES,89250,GURGY,,,89198,,,,,,,,,,,,,,,,,,,2008-01-01,A,,,,,01.13Z,NAFRev2,N,3.575532,47.866361,0.94,street,Le Bas de la Rue aux Vaches 89250 Gurgy,89198_b008,G,LE BAS DE LA RUE AUX VACHES,
318457843,00031,31845784300031,O,2008-10-01,,,,2021-02-23T10:43:03,true,1,,20,,RUE,SAINT ANDRE,89250,GURGY,,,89198,,,,,,,,,,,,,,,,,,,2008-10-01,A,,,,,68.20B,NAFRev2,N,3.55758,47.86305,0.94,housenumber,20 Rue Saint André 89250 Gurgy,89198_0430_00020,G,20 RUE SAINT ANDRE,
318949443,00010,31894944300010,O,,NN,,,,true,1,,6,,RUE,DU HALAGE,89250,GURGY,,,89198,,,,,,,,,,,,,,,,,,,,F,,,,,51.10,NAP,N,3.556169,47.867018,0.94,housenumber,6 Rue du Halage 89250 Gurgy,89198_0195_00006,G,6 RUE DU HALAGE,
320511561,00047,32051156100047,O,1991-11-05,NN,,,2008-11-07T00:36:32,false,4,,9,,,,89250,GURGY,,,89198,,,,,,,,,,,,,,,,,,,1996-12-25,F,,,,,15.8C,NAF1993,O,,,0,,,,,,
321482044,00039,32148204400039,O,2007-10-09,,,,2008-11-07T00:37:43,false,2,,6,,CHE,LA FOLLE PENSEE,89250,GURGY,,,89198,,,,,,,,,,,,,,,,,,,2007-12-17,F,,,,,45.2V,NAFRev1,N,3.537048,47.881189,0.89,housenumber,6 Chemin de la Folle Pensée 89250 Gurgy,89198_0115_00006,G,6 CHEMIN DE LA FOLLE PENSEE,
321482044,00047,32148204400047,O,2007-12-17,01,2018,4399CZ,2020-08-25T10:29:11,true,4,,16,,CHE,PRIVE DE RAVRY,89250,GURGY,,,89198,,,,,,,,,,,,,,,,,,,2019-07-31,F,,,,,43.99C,NAFRev2,O,3.537577,47.881482,0.86,housenumber,16 Chemin Privé de Ravry 89250 Gurgy,89198_0380_00016,G,16 CHEMIN PRIVE DE RAVRY,
321916397,00011,32191639700011,O,,NN,,,,true,1,,15,,RUE,DE LA RONDE,89250,GURGY,,,89198,,,,,,,,,,,,,,,,,,,1990-01-12,F,,,,,69.23,NAP,N,3.556154,47.861629,0.94,housenumber,15 Rue de la Ronde 89250 Gurgy,89198_0400_00015,G,15 RUE DE LA RONDE,
322302787,00013,32230278700013,O,,NN,,,,true,1,,14,,RUE,DE LA RONDE,89250,GURGY,,,89198,,,,,,,,,,,,,,,,,,,,F,,,,,64.11,NAP,N,3.555854,47.861689,0.94,housenumber,14 Rue de la Ronde 89250 Gurgy,89198_0400_00014,G,14 RUE DE LA RONDE,
322342924,00022,32234292400022,O,1952-08-01,NN,,,2006-12-15T00:21:22,false,4,,,,LD,LE CHARME,89250,GURGY,,,89198,,,,,,,,,,,,,,,,,,,2002-12-25,F,,,,,55.1A,NAF1993,N,5.2066288,46.5947152,0.9,poi.forest,Le Charme (Forêt) La Chapelle-Naude,https://osm.org/way/337853270,G,,
324371707,00013,32437170700013,O,1982-04-01,03,2018,4321AB,2020-08-25T10:30:44,true,4,,1,,RUE,DES PATURES,89250,GURGY,,,89198,,,,,,,,,,,,,,,,,,,2008-01-01,A,,,,,43.21A,NAFRev2,O,3.556901,47.870062,0.94,housenumber,1 Rue des Pâtures 89250 Gurgy,89198_0340_00001,G,1 RUE DES PATURES,
326467339,00015,32646733900015,O,1982-01-01,,,,,false,3,,1,B,ALL,DES BLEUETS,89250,GURGY,,,89198,,,,,,,,,,,,,,,,,,,1995-11-27,F,,,,,91.3E,NAF1993,N,3.566147,47.866467,0.71,housenumber,1 bis Allée des Bleuets 89250 Gurgy,89198_0040_00001_bis,G,1 BIS ALLEE DES BLEUETS,
328395843,00019,32839584300019,O,,NN,,,,true,1,,,,CHE,DE RAVRY,89250,GURGY,,,89198,,,,,,,,,,,,,,,,,,,1987-12-31,F,,,,,55.60,NAP,N,3.539987,47.881305,0.86,street,Chemin Privé de Ravry 89250 Gurgy,89198_0380,G,CHEMIN PRIVE DE RAVRY,
328872064,00030,32887206400030,O,,NN,,,,true,1,,1,,CHE,DE L ORMEE,89250,GURGY,,,89198,,,,,,,,,,,,,,,,,,,1997-11-03,F,,,,,70.2C,NAF1993,N,3.565223,47.866275,0.83,housenumber,1 Chemin de l'Ormee 89250 Gurgy,89198_0321_00001,G,1 CHEMIN DE L ORMEE,
329938799,00015,32993879900015,O,1984-06-01,NN,,,2009-06-27T04:49:54,true,4,,,,PL,DE L EGLISE,89250,GURGY,,,89198,,,,,,,,,,,,,,,,,,,2007-03-31,F,,,,,55.1A,NAFRev1,O,3.557199,47.866011,0.82,street,Place de l'Eglise 89250 Gurgy,89198_0100,G,PLACE DE L EGLISE,
330816901,00012,33081690100012,O,,,,,,true,1,,,,,PORT D APPOIGNY,89250,GURGY,,,89198,,,,,,,,,,,,,,,,,,,1986-06-03,F,,,,,54.03,NAP,N,,,0,,,,,,
330847401,00032,33084740100032,O,2002-07-15,NN,,,2008-11-07T00:49:25,false,4,,5,,RUE,DE L ILE CHAMOND,89250,GURGY,,,89198,,,,,,,,,,,,,,,,,,,2005-07-30,F,,,,,93.0D,NAFRev1,N,3.560018,47.864436,0.94,housenumber,5 Rue de l'Ile Chamond 89250 Gurgy,89198_0210_00005,G,5 RUE DE L ILE CHAMOND,
331550640,00030,33155064000030,O,1997-06-12,NN,,9609ZP,2016-01-28T04:59:37,true,10,CIDEX 19,13,,RUE,DES TROIS CAILLOUX,89250,GURGY,,,89198,,,,,,,,,,,,,,,,,,,2015-03-16,A,,,,,96.09Z,NAFRev2,N,3.559894,47.866255,0.71,housenumber,13 Rue des 3 Cailloux 89250 Gurgy,89198_0450_00013,G,13 RUE DES 3 CAILLOUX,
331732594,00014,33173259400014,O,1984-05-04,NN,,,2009-06-17T11:34:30,false,4,,1,,PL,DE L EGLISE,89250,GURGY,,,89198,,,,,,,,,,,,,,,,,,,2009-06-10,F,,,,,86.21Z,NAFRev2,N,3.557199,47.866011,0.83,housenumber,1 Place de l'Eglise 89250 Gurgy,89198_0100_00001,G,1 PLACE DE L EGLISE,
331732594,00022,33173259400022,O,2009-06-10,,,,2020-12-24T03:42:46,true,2,,10,,RUE,SAINT ANDRE,89250,GURGY,,,89198,,,,,,,,,,,,,,,,,,,2020-12-31,F,,,,,86.21Z,NAFRev2,N,3.557401,47.864766,0.94,housenumber,10 Rue Saint André 89250 Gurgy,89198_0430_00010,G,10 RUE SAINT ANDRE,
332033919,00017,33203391900017,O,,NN,,,,true,1,,5,,RUE,DES VARENNES,89250,GURGY,,,89198,,,,,,,,,,,,,,,,,,,1990-01-12,F,,,,,65.03,NAP,N,3.562501,47.870006,0.94,housenumber,5 Rue des Varennes 89250 Gurgy,89198_0475_00005,G,5 RUE DES VARENNES,
337712699,00012,33771269900012,O,1986-05-05,NN,,,2008-11-07T00:56:30,true,3,,,,RUE,DE LA RIVIERE,89250,GURGY,,,89198,,,,,,,,,,,,,,,,,,,2007-11-30,F,,,,,50.2Z,NAFRev1,N,3.557087,47.86742,0.94,street,Rue de la Rivière 89250 Gurgy,89198_0390,G,RUE DE LA RIVIERE,
338219041,00021,33821904100021,O,,NN,,,,true,1,,16,,IMP,DES FONTAINES,89250,GURGY,,,89198,,,,,,,,,,,,,,,,,,,,F,,,,,64.11,NAP,N,3.558236,47.85994,0.85,housenumber,16 Impasse des Fontaines 89250 Gurgy,89198_0124_00016,G,16 IMPASSE DES FONTAINES,
338271455,00010,33827145500010,O,,,,,,true,1,,,,,PORT D APPOIGNY,89250,GURGY,,,89198,,,,,,,,,,,,,,,,,,,1989-06-05,F,,,,,54.03,NAP,N,,,0,,,,,,
338429434,00016,33842943400016,O,1986-07-11,NN,,,2008-11-07T00:57:35,false,4,,,,RUE,DE L ILE CHAMOND,89250,GURGY,,,89198,,,,,,,,,,,,,,,,,,,2002-07-14,F,,,,,93.0D,NAF1993,O,3.559986,47.864583,0.94,street,Rue de l'Ile Chamond 89250 Gurgy,89198_0210,G,RUE DE L ILE CHAMOND,
338448756,00019,33844875600019,O,1986-08-01,NN,,,,true,4,,,,,CHATEAU DE GUILLEBEAUDON,89250,GURGY,,,89198,,,,,,,,,,,,,,,,,,,1993-12-25,F,,,,,92.1C,NAF1993,N,3.58598,47.877386,0.87,street,Chateau de Guillebaudon 89250 Gurgy,89198_b030,G,CHATEAU DE GUILLEBAUDON,
338549884,00041,33854988400041,O,2005-06-27,NN,,,2012-05-05T02:33:39,false,4,,4,,RUE,DE LA RIVIERE,89250,GURGY,,,89198,,,,,,,,,,,,,,,,,,,2010-08-23,F,,,,,10.71B,NAFRev2,O,3.557328,47.867357,0.94,housenumber,4 Rue de la Rivière 89250 Gurgy,89198_0390_00004,G,4 RUE DE LA RIVIERE,
338549884,00066,33854988400066,O,2015-04-24,01,2018,,2021-02-23T10:55:03,true,2,,4,,IMP,LES VARENNES,89250,GURGY,,,89198,,,,,,,,,,,,,,,,,,,2015-09-06,A,LA FEUILLE D'OR,,,,56.10C,NAFRev2,O,3.564058,47.870467,0.74,housenumber,4 Impasse des Varennes 89250 Gurgy,89198_0472_00004,G,4 IMPASSE DES VARENNES,
338624448,00019,33862444800019,O,,NN,,,,true,1,,16,,IMP,DES FONTAINES,89250,GURGY,,,89198,,,,,,,,,,,,,,,,,,,,F,,,,,64.11,NAP,N,3.558236,47.85994,0.85,housenumber,16 Impasse des Fontaines 89250 Gurgy,89198_0124_00016,G,16 IMPASSE DES FONTAINES,
339035149,00014,33903514900014,O,,,,,,true,1,,,,,CENTRE COMMERCIAL,89250,GURGY,,,89198,,,,,,,,,,,,,,,,,,,1991-09-30,F,,,,,64.24,NAP,N,6.1860165,48.6405315,0.66,poi.mall,(Galerie marchande) Houdemont,https://osm.org/way/115500752,G,,
339362477,00038,33936247700038,O,1992-07-01,NN,,,2020-07-05T20:08:33,true,3,,,,LD,LE PETIT ETANG,89250,GURGY,,,89198,,,,,,,,,,,,,,,,,,,2008-01-01,A,,,,,08.12Z,NAFRev2,N,3.544927,47.888701,0.76,street,Lieu Dit Petit Étang 89250 Gurgy,89198_b084,G,LIEU DIT PETIT ETANG,
339370272,00017,33937027200017,O,1986-10-01,NN,,,,true,1,,15,,RUE,DES TROIS CAILLOUX,89250,GURGY,,,89198,,,,,,,,,,,,,,,,,,,2001-07-12,F,,,,,55.1A,NAF1993,N,3.560012,47.866251,0.71,housenumber,15 Rue des 3 Cailloux 89250 Gurgy,89198_0450_00015,G,15 RUE DES 3 CAILLOUX,
339736589,00021,33973658900021,O,1991-01-01,,,,2008-11-07T00:59:31,false,4,,39,,RUE,DE L ILE CHAMOND,89250,GURGY,,,89198,,,,,,,,,,,,,,,,,,,1994-01-01,F,,,,,45.4D,NAF1993,N,3.560269,47.85949,0.94,housenumber,39 Rue de l'Ile Chamond 89250 Gurgy,89198_0210_00039,G,39 RUE DE L ILE CHAMOND,
340214485,00013,34021448500013,O,1987-01-01,NN,,,2016-01-12T00:12:31,true,3,,,,,FERME DE NERON,89250,GURGY,,,89198,,,,,,,,,,,,,,,,,,,2008-01-01,A,,,,,01.11Z,NAFRev2,N,3.530353,47.895946,0.94,street,Ferme de Neron 89250 Gurgy,89198_a090,G,FERME DE NERON,
341443745,00011,34144374500011,O,1987-06-01,NN,,,2014-07-08T00:46:02,true,6,,2,,,GUE DE LA BAUME,89250,GURGY,,,89198,,,,,,,,,,,,,,,,,,,2011-01-31,F,,,,,43.32A,NAFRev2,O,3.559255,47.853437,0.88,housenumber,2 Rue du Gué de la Baume 89250 Gurgy,89198_0175_00002,G,2 RUE DU GUE DE LA BAUME,
342263191,00013,34226319100013,O,1987-07-20,NN,,,,false,3,,2,,RUE,ST ANDRE,89250,GURGY,,,89198,,,,,,,,,,,,,,,,,,,1994-12-01,F,,,,,70.2A,NAF1993,N,3.556998,47.865459,0.82,housenumber,2 Rue Saint André 89250 Gurgy,89198_0430_00002,G,2 RUE SAINT ANDRE,
342263191,00039,34226319100039,O,2014-06-20,,,,2020-04-24T07:39:21,false,2,,5,,RUE,DES JARDINS,89250,GURGY,,,89198,,,,,,,,,,,,,,,,,,,2020-02-28,F,,,,,68.20A,NAFRev2,N,3.557081,47.867014,0.94,housenumber,5 Rue des Jardins 89250 Gurgy,89198_0230_00005,G,5 RUE DES JARDINS,
342263191,00047,34226319100047,O,2020-02-28,,,,2020-04-24T07:39:21,true,1,,4,,PL,DE L'EGLISE,89250,GURGY,,,89198,,,,,,,,,,,,,,,,,,,2020-02-28,A,,,,,68.20A,NAFRev2,N,3.556451,47.865681,0.83,housenumber,4 Place de l'Eglise 89250 Gurgy,89198_0100_00004,G,4 PLACE DE L EGLISE,
343621751,00035,34362175100035,O,1992-09-01,NN,,,2009-06-27T05:35:04,false,5,,,,RTE,D APPOIGNY,89250,GURGY,,,89198,,,,,,,,,,,,,,,,,,,2007-05-01,F,,,,,26.6E,NAFRev1,N,3.553637,47.875506,0.82,street,Route d'Appoigny 89250 Gurgy,89198_0015,G,ROUTE D APPOIGNY,
343837860,00018,34383786000018,O,1988-02-29,NN,,,,true,4,,4,,,QUAI GUE DE LA BAUME,89250,GURGY,,,89198,,,,,,,,,,,,,,,,,,,2003-06-30,F,,,,,74.1G,NAFRev1,N,3.558794,47.852412,0.9,housenumber,4 Quai du Gué de la Baume 89250 Gurgy,89198_0176_00004,G,4 QUAI DU GUE DE LA BAUME,
344038393,00015,34403839300015,O,,NN,,,,true,1,,,,CHE,DE L ORMEE,89250,GURGY,,,89198,,,,,,,,,,,,,,,,,,,1988-12-31,F,,,,,22.02,NAP,N,3.565223,47.866275,0.82,street,Chemin de l'Ormee 89250 Gurgy,89198_0321,G,CHEMIN DE L ORMEE,
344587670,00011,34458767000011,O,1988-04-15,11,2018,4520AA,2020-08-25T10:42:06,true,5,,,,RUE,DE LISLE CHAMOND,89250,GURGY,,CIDEX 61 B,89198,,,,,,,,,,,,,,,,,,,2015-10-23,A,,,,,45.20A,NAFRev2,O,3.559986,47.864583,0.77,street,Rue de l'Ile Chamond 89250 Gurgy,89198_0210,G,RUE DE L ILE CHAMOND,
344906003,00019,34490600300019,O,1988-05-17,NN,,,2009-06-27T05:40:13,true,4,,12,,CHE,PRIVE DE RAVRY,89250,GURGY,,,89198,,,,,,,,,,,,,,,,,,,2007-09-30,F,,,,,45.4J,NAFRev1,N,3.538599,47.881506,0.86,housenumber,12 Chemin Privé de Ravry 89250 Gurgy,89198_0380_00012,G,12 CHEMIN PRIVE DE RAVRY,
348103144,00021,34810314400021,O,1996-07-26,NN,,,2015-05-14T07:40:33,true,5,,9,,RUE,DE L ILE CHAMOND,89250,GURGY,,,89198,,,,,,,,,,,,,,,,,,,2013-05-31,F,,,,,10.71C,NAFRev2,O,3.559871,47.864284,0.94,housenumber,9 Rue de l'Ile Chamond 89250 Gurgy,89198_0210_00009,G,9 RUE DE L ILE CHAMOND,
348295064,00011,34829506400011,O,1988-03-01,NN,,,2008-01-04T22:50:22,true,3,,,,PL,DE L EGLISE,89250,GURGY,,,89198,,,,,,,,,,,,,,,,,,,2008-01-01,A,,,,,68.20B,NAFRev2,N,3.557199,47.866011,0.82,street,Place de l'Eglise 89250 Gurgy,89198_0100,G,PLACE DE L EGLISE,
348456625,00014,34845662500014,O,,NN,,,,true,1,,29,,RUE,DES TROIS CAILLOUX,89250,GURGY,,,89198,,,,,,,,,,,,,,,,,,,1995-12-31,F,,,,,15.1F,NAF1993,N,3.560433,47.867,0.71,housenumber,29 Rue des 3 Cailloux 89250 Gurgy,89198_0450_00029,G,29 RUE DES 3 CAILLOUX,
348866260,00071,34886626000071,O,1989-01-01,NN,,,,false,3,SABLIERES DE GURGY,,,,LE PETIT ETANG,89250,GURGY,,,89198,,,,,,,,,,,,,,,,,,,2000-12-31,F,,,,,14.2A,NAF1993,N,3.544927,47.888701,0.76,street,Lieu Dit Petit Étang 89250 Gurgy,89198_b084,G,LIEU DIT PETIT ETANG,
348899295,00250,34889929500250,O,2017-12-29,,,,2018-03-03T04:26:18,false,1,,,,LD,LE PETIT ETANG LE CHAMP PAPON,89250,GURGY,,,89198,,,,,,,,,,,,,,,,,,,2017-12-29,A,,,,,42.11Z,NAFRev2,O,,,0,,,,,,
348934712,00012,34893471200012,O,,NN,,,,true,1,,,,,PORT D APPOIGNY,89250,GURGY,,,89198,,,,,,,,,,,,,,,,,,,1990-03-29,F,,,,,80.06,NAP,N,,,0,,,,,,
349050807,00024,34905080700024,O,1990-12-01,,,,,true,4,,,,LD,LE CHARME,89250,GURGY,,,89198,,,,,,,,,,,,,,,,,,,1997-12-25,F,,,,,15.7A,NAF1993,N,5.2066288,46.5947152,0.9,poi.forest,Le Charme (Forêt) La Chapelle-Naude,https://osm.org/way/337853270,G,,
349237990,00024,34923799000024,O,2019-10-19,,,,2021-02-23T11:02:07,true,1,,1,,IMP,DE LA GRANDE RUE,89250,GURGY,,,89198,,,,,,,,,,,,,,,,,,,2019-10-19,A,,,,,68.20A,NAFRev2,N,3.563538,47.866662,0.86,housenumber,1 Impasse de la Grande Rue 89250 Gurgy,89198_0158_00001,G,1 IMPASSE DE LA GRANDE RUE,
349328997,00011,34932899700011,O,,NN,,,,true,1,,,,,PORT D APPOIGNY,89250,GURGY,,,89198,,,,,,,,,,,,,,,,,,,1991-12-31,F,,,,,71.4B,NAF1993,N,,,0,,,,,,
349562140,00013,34956214000013,O,1988-07-01,NN,,,2008-01-04T23:06:01,true,3,,2,,PL,DE L EGLISE,89250,GURGY,,,89198,,,,,,,,,,,,,,,,,,,2008-01-01,A,,,,,01.49Z,NAFRev2,N,3.557439,47.865584,0.83,housenumber,2 Place de l'Eglise 89250 Gurgy,89198_0100_00002,G,2 PLACE DE L EGLISE,
349562983,00016,34956298300016,O,,NN,,,,true,1,,,,,FERME DE NERON,89250,GURGY,,,89198,,,,,,,,,,,,,,,,,,,1995-12-25,F,,,,,70.2C,NAF1993,N,3.530353,47.895946,0.94,street,Ferme de Neron 89250 Gurgy,89198_a090,G,FERME DE NERON,
349564484,00021,34956448400021,O,1995-01-01,NN,,,2016-01-12T00:13:10,true,3,,,,LD,NERON,89250,GURGY,,,89198,,,,,,,,,,,,,,,,,,,2008-01-01,A,,,,,02.10Z,NAFRev2,N,3.538084,47.895608,0.91,street,Neron Hameau 89250 Gurgy,89198_a180,G,NERON HAMEAU,
350547527,00035,35054752700035,O,1993-11-01,NN,,,2009-10-02T16:28:13,false,4,,1,,PL,DE L EGLISE,89250,GURGY,,,89198,,,,,,,,,,,,,,,,,,,2009-05-27,F,,,,,86.21Z,NAFRev2,N,3.557199,47.866011,0.83,housenumber,1 Place de l'Eglise 89250 Gurgy,89198_0100_00001,G,1 PLACE DE L EGLISE,
350547527,00043,35054752700043,O,2009-05-27,,,,2021-02-23T11:03:16,true,1,,10,,RUE,SAINT ANDRE,89250,GURGY,,,89198,,,,,,,,,,,,,,,,,,,2009-05-27,A,,,,,86.21Z,NAFRev2,N,3.557401,47.864766,0.94,housenumber,10 Rue Saint André 89250 Gurgy,89198_0430_00010,G,10 RUE SAINT ANDRE,
350660254,00045,35066025400045,O,1996-07-01,01,2018,,2020-08-25T10:10:54,false,3,,,,,FERME DE GUILLEBAUDON,89250,GURGY,,,89198,,,,,,,,,,,,,,,,,,,2008-01-01,A,ARRAS DE VAL EN PRE,,,,55.20Z,NAFRev2,O,,,0,,,,,,
350710448,00019,35071044800019,O,,NN,,,,true,1,,10,,RUE,DES FAUVETTES,89250,GURGY,,,89198,,,,,,,,,,,,,,,,,,,1991-06-26,F,,,,,54.05,NAP,N,3.560361,47.864114,0.94,housenumber,10 Rue des Fauvettes 89250 Gurgy,89198_0110_00010,G,10 RUE DES FAUVETTES,
350783619,00017,35078361900017,O,1989-05-14,NN,,,,true,1,,26,,RUE,DE L ILE CHAMOND,89250,GURGY,,,89198,,,,,,,,,,,,,,,,,,,2000-05-15,F,,,,,52.6E,NAF1993,N,3.558989,47.86244,0.94,housenumber,26 Rue de l'Ile Chamond 89250 Gurgy,89198_0210_00026,G,26 RUE DE L ILE CHAMOND,
352169478,00018,35216947800018,O,1989-01-01,NN,,,2010-02-08T14:18:35,true,4,,,,,FERME DE GUILLEBAUDON,89250,GURGY,,,89198,,,,,,,,,,,,,,,,,,,2000-10-26,F,,,,,01.1A,NAF1993,N,,,0,,,,,,
352206171,00022,35220617100022,O,1998-10-01,NN,,,2020-08-14T09:08:08,false,4,,,,RUE,ST EXUPERY,89250,GURGY,,,89198,,,,,,,,,,,,,,,,,,,2001-12-08,F,,,,,74.1J,NAF1993,N,5.8528118,45.2166151,0.78,poi,Rue Saint-Exupéry (Pont) Le Versoud,https://osm.org/way/283909780,G,,
352206171,00030,35220617100030,O,2020-08-14,,,9521ZZ,2021-02-23T11:04:42,true,1,,1,,ALL,DES BLEUETS,89250,GURGY,,,89198,,,,,,,,,,,,,,,,,,,2020-08-14,A,,,,,95.21Z,NAFRev2,N,3.565693,47.866856,0.84,housenumber,1 Allée des Bleuets 89250 Gurgy,89198_0040_00001,G,1 ALLEE DES BLEUETS,
352391098,00014,35239109800014,O,,NN,,,,true,1,,8,,RUE,DU SAULCIS,89250,GURGY,,,89198,,,,,,,,,,,,,,,,,,,1994-03-31,F,,,,,45.3F,NAF1993,N,3.561491,47.864841,0.94,housenumber,8 Rue du Saulcis 89250 Gurgy,89198_0440_00008,G,8 RUE DU SAULCIS,
352483341,01742,35248334101742,O,1992-02-25,NN,,,2008-01-04T23:43:02,false,3,,,,,CTRE COMMERCIAL LA VALLEE,89250,GURGY,,,89198,,,,,,,,,,,,,,,,,,,2008-01-01,A,,,,,64.19Z,NAFRev2,N,0.6791543,47.349239,0.74,poi.mall,Centre Commercial de la Valée Violette (Galerie marchande) Joué-lès-Tours,https://osm.org/way/71112600,G,,
352753107,00015,35275310700015,O,1989-12-05,NN,,,,false,3,,2,,RUE,SAINT ANDRE,89250,GURGY,,,89198,,,,,,,,,,,,,,,,,,,1995-10-16,F,,,,,70.2A,NAF1993,N,3.556998,47.865459,0.94,housenumber,2 Rue Saint André 89250 Gurgy,89198_0430_00002,G,2 RUE SAINT ANDRE,
352753107,00049,35275310700049,O,2009-07-01,,,,2021-02-23T11:05:10,true,1,,5,,RUE,DES JARDINS,89250,GURGY,,,89198,,,,,,,,,,,,,,,,,,,2009-07-01,A,,,,,68.20B,NAFRev2,N,3.557081,47.867014,0.94,housenumber,5 Rue des Jardins 89250 Gurgy,89198_0230_00005,G,5 RUE DES JARDINS,
353967060,00032,35396706000032,O,1996-08-21,NN,,,2016-10-04T08:33:10,true,4,,9,,RUE,DE L'ILE CHAMOND,89250,GURGY,,,89198,,,,,,,,,,,,,,,,,,,2016-11-30,F,,,,,86.23Z,NAFRev2,N,3.559871,47.864284,0.94,housenumber,9 Rue de l'Ile Chamond 89250 Gurgy,89198_0210_00009,G,9 RUE DE L ILE CHAMOND,