siren,nic,siret,statutDiffusionEtablissement,dateCreationEtablissement,trancheEffectifsEtablissement,anneeEffectifsEtablissement,activitePrincipaleRegistreMetiersEtablissement,dateDernierTraitementEtablissement,etablissementSiege,nombrePeriodesEtablissement,complementAdresseEtablissement,numeroVoieEtablissement,indiceRepetitionEtablissement,typeVoieEtablissement,libelleVoieEtablissement,codePostalEtablissement,libelleCommuneEtablissement,libelleCommuneEtrangerEtablissement,distributionSpecialeEtablissement,codeCommuneEtablissement,codeCedexEtablissement,libelleCedexEtablissement,codePaysEtrangerEtablissement,libellePaysEtrangerEtablissement,complementAdresse2Etablissement,numeroVoie2Etablissement,indiceRepetition2Etablissement,typeVoie2Etablissement,libelleVoie2Etablissement,codePostal2Etablissement,libelleCommune2Etablissement,libelleCommuneEtranger2Etablissement,distributionSpeciale2Etablissement,codeCommune2Etablissement,codeCedex2Etablissement,libelleCedex2Etablissement,codePaysEtranger2Etablissement,libellePaysEtranger2Etablissement,dateDebut,etatAdministratifEtablissement,enseigne1Etablissement,enseigne2Etablissement,enseigne3Etablissement,denominationUsuelleEtablissement,activitePrincipaleEtablissement,nomenclatureActivitePrincipaleEtablissement,caractereEmployeurEtablissement,longitude,latitude,geo_score,geo_type,geo_adresse,geo_id,geo_ligne,geo_l4,geo_l5
171402118,00060,17140211800060,O,1983-01-01,,,,,false,4,,,,AV,CHARLES DE GAULLE,14350,VALDALLIERE,,,14726,,,,,,,,,,,,,,,,,,,2000-12-25,F,TRESORERIE VASSY-VIESSOIX,,,,75.1A,NAF1993,N,-0.67757,48.85266,0.86,street,Avenue Charles de Gaulle 14410 Valdallière,14726_0015,G,AVENUE CHARLES DE GAULLE,
191400860,00018,19140086000018,O,1983-03-01,12,2018,,2020-08-25T10:14:01,true,4,,11,,RTE,DE SAINT-VIGOR,14410,VALDALLIERE,,,14726,,,,,,,,,,,,,,,,,,,2008-01-01,A,,,,,85.31Z,NAFRev2,N,-0.789935,48.925996,0.38,housenumber,11 Route de la Ferronniere 14410 Valdallière,14564_0006_00011,G,11 ROUTE DE LA FERRONNIERE,
200054641,00010,20005464100010,O,2016-01-01,21,2018,,2021-02-23T10:29:40,true,1,MAIRIE,7,,RUE,DES ECOLES,14410,VALDALLIERE,,,14726,,,,,,,,,,,,,,,,,,,2016-01-01,A,MAIRIE,,,,84.11Z,NAFRev2,O,-0.678833,48.852282,0.93,housenumber,7 Rue des Ecoles (Vassy) 14410 Valdallière,14726_0039_00007,G,7 RUE DES ECOLES,VASSY
200054641,00028,20005464100028,O,2016-01-01,,,,2016-01-23T00:10:22,false,1,MAIRIE ANNEXE,,,PL,DU COLONEL CANDAU,14410,VALDALLIERE,,,14726,,,,,,,,,,,,,,,,,,,2016-01-01,A,COMMUNE DELEGUEE DE VASSY,,,,84.11Z,NAFRev2,N,-0.677269,48.852652,0.86,street,Place du Colonel Candau 14410 Valdallière,14726_b749,G,PLACE DU COLONEL CANDAU,
200054641,00036,20005464100036,O,2016-01-01,,,,2016-01-12T11:07:05,false,1,MAIRIE ANNEXE,4,,PL,DE LA MAIRIE,14410,VALDALLIERE,,,14726,,,,,,,,,,,,,,,,,,,2016-01-01,A,COMMUNE DELEGUEE DE BERNIERES LE PATRY,,,,84.11Z,NAFRev2,N,-0.736532,48.814354,0.84,housenumber,4 Place de la Mairie 14410 Valdallière,14065_0010_00004,G,4 PLACE DE LA MAIRIE,
200054641,00044,20005464100044,O,2016-01-01,,,,2016-01-12T10:39:26,false,1,MAIRIE ANNEXE,,,,LE BOURG,14410,VALDALLIERE,,,14726,,,,,,,,,,,,,,,,,,,2016-01-01,A,COMMUNE DELEGUEE DE BURCY,,,,84.11Z,NAFRev2,N,-0.811161,48.90391,0.95,street,Le Bourg 14410 Valdallière,14726_59inga,G,LE BOURG,
200054641,00051,20005464100051,O,2016-01-01,,,,2016-01-12T10:45:01,false,1,MAIRIE ANNEXE,,,,LE BOURG,14410,VALDALLIERE,,,14726,,,,,,,,,,,,,,,,,,,2016-01-01,A,COMMUNE DELEGUEE DE CHENEDOLLE,,,,84.11Z,NAFRev2,N,-0.811161,48.90391,0.95,street,Le Bourg 14410 Valdallière,14726_59inga,G,LE BOURG,
200054641,00069,20005464100069,O,2016-01-01,,,,2016-01-23T00:10:22,false,1,MAIRIE ANNEXE,,,,LE BOURG,14410,VALDALLIERE,,,14726,,,,,,,,,,,,,,,,,,,2016-01-01,A,COMMUNE DELEGUEE DE LE DESERT,,,,84.11Z,NAFRev2,N,-0.811161,48.90391,0.95,street,Le Bourg 14410 Valdallière,14726_59inga,G,LE BOURG,
200054641,00077,20005464100077,O,2016-01-01,,,,2016-01-12T10:52:41,false,1,MAIRIE ANNEXE,,,,LE BOURG,14410,VALDALLIERE,,,14726,,,,,,,,,,,,,,,,,,,2016-01-01,A,COMMUNE DELEGUEE D'ESTRY,,,,84.11Z,NAFRev2,N,-0.811161,48.90391,0.95,street,Le Bourg 14410 Valdallière,14726_59inga,G,LE BOURG,
200054641,00085,20005464100085,O,2016-01-01,,,,2016-01-23T00:10:22,false,1,MAIRIE ANNEXE,3,,RUE,DE LA LIBERTE,14410,VALDALLIERE,,,14726,,,,,,,,,,,,,,,,,,,2016-01-01,A,COMMUNE DELEGUEE DE MONTCHAMP,,,,84.11Z,NAFRev2,N,-0.766722,48.920356,0.95,housenumber,3 Rue de la Liberte 14410 Valdallière,14442_0045_00003,G,3 RUE DE LA LIBERTE,
200054641,00093,20005464100093,O,2016-01-01,,,,2016-01-12T11:07:10,false,1,MAIRIE ANNEXE,,,PL,GASTON DE COUPIGNY,14410,VALDALLIERE,,,14726,,,,,,,,,,,,,,,,,,,2016-01-01,A,COMMUNE DELEGUEE DE PIERRES,,,,84.11Z,NAFRev2,N,,,0,,,,,,
200054641,00101,20005464100101,O,2016-01-01,,,,2016-01-12T10:27:23,false,1,MAIRIE ANNEXE,,,,VIEILLE RUE,14410,VALDALLIERE,,,14726,,,,,,,,,,,,,,,,,,,2016-01-01,A,COMMUNE DELEGUEE DE PRESLES,,,,84.11Z,NAFRev2,N,-0.782093,48.876501,0.95,street,Vieille Rue 14410 Valdallière,14726_g350,G,VIEILLE RUE,
200054641,00119,20005464100119,O,2016-01-01,,,,2016-01-12T10:31:04,false,1,MAIRIE ANNEXE,,,,LE BOURG,14410,VALDALLIERE,,,14726,,,,,,,,,,,,,,,,,,,2016-01-01,A,COMMUNE DELEGUEE DE LA ROCQUE,,,,84.11Z,NAFRev2,N,-0.811161,48.90391,0.95,street,Le Bourg 14410 Valdallière,14726_59inga,G,LE BOURG,
200054641,00127,20005464100127,O,2016-01-01,,,,2016-01-12T10:36:53,false,1,MAIRIE ANNEXE,,,,LE BOURG,14410,VALDALLIERE,,,14726,,,,,,,,,,,,,,,,,,,2016-01-01,A,COMMUNE DELEGUEE DE RULLY,,,,84.11Z,NAFRev2,N,-0.811161,48.90391,0.95,street,Le Bourg 14410 Valdallière,14726_59inga,G,LE BOURG,
200054641,00135,20005464100135,O,2016-01-01,,,,2016-01-23T00:10:22,false,1,MAIRIE DELEGUEE,,,,LE BOURG,14410,VALDALLIERE,,,14726,,,,,,,,,,,,,,,,,,,2016-01-01,A,COMMUNE DELEGUEE DE SAINT CHARLES DE PERCY,,,,84.11Z,NAFRev2,N,-0.811161,48.90391,0.95,street,Le Bourg 14410 Valdallière,14726_59inga,G,LE BOURG,
200054641,00143,20005464100143,O,2016-01-01,,,,2016-01-12T10:42:34,false,1,MAIRIE ANNEXE,,,,LE BOURG,14410,VALDALLIERE,,,14726,,,,,,,,,,,,,,,,,,,2016-01-01,A,COMMUNE DELEGUEE DE LE THEIL BOCAGE,,,,84.11Z,NAFRev2,N,-0.811161,48.90391,0.95,street,Le Bourg 14410 Valdallière,14726_59inga,G,LE BOURG,
200054641,00150,20005464100150,O,2016-01-01,,,,2016-01-12T10:50:27,false,1,MAIRIE ANNEXE,1,,RUE,DES ECOLES,14410,VALDALLIERE,,,14726,,,,,,,,,,,,,,,,,,,2016-01-01,A,COMMUNE DELEGUEE DE VIESSOIX,,,,84.11Z,NAFRev2,N,-0.679288,48.85159,0.93,housenumber,1 Rue des Ecoles (Vassy) 14410 Valdallière,14726_0039_00001,G,1 RUE DES ECOLES,VASSY
200054641,00168,20005464100168,O,2016-01-01,02,2018,,2020-08-25T10:14:58,false,1,,19,B,RTE,DE MONTSECRET,14410,VALDALLIERE,,,14726,,,,,,,,,,,,,,,,,,,2016-01-01,A,ECOLE MATERNELLE,,,,85.10Z,NAFRev2,N,-0.678796,48.851535,0.71,housenumber,19 bis Rue de Montsecret 14410 Valdallière,14726_0105_00019_bis,G,19 BIS RUE DE MONTSECRET,
200054641,00176,20005464100176,O,2016-01-01,03,2018,,2020-08-25T10:14:58,false,1,,2,,RTE,DE MONTSECRET,14410,VALDALLIERE,,,14726,,,,,,,,,,,,,,,,,,,2016-01-01,A,ECOLE PRIMAIRE,,,,85.20Z,NAFRev2,N,-0.733224,48.814442,0.86,housenumber,2 Route de Montsecret 14410 Valdallière,14065_0005_00002,G,2 ROUTE DE MONTSECRET,
200054641,00184,20005464100184,O,2016-01-01,,,,2016-01-23T00:10:22,false,1,RESIDENCE DE LA CRETE,,,RUE,DE LA CRETE,14410,VALDALLIERE,,,14726,,,,,,,,,,,,,,,,,,,2016-01-01,A,CANTINE SCOLAIRE,,,,56.29B,NAFRev2,N,-0.677396,48.847706,0.95,street,Rue de la Crete 14410 Valdallière,14726_c046,G,RUE DE LA CRETE,
200054641,00192,20005464100192,O,2016-01-01,01,2018,,2020-08-25T10:14:58,false,1,,14,,RUE,DES ECOLES,14410,VALDALLIERE,,,14726,,,,,,,,,,,,,,,,,,,2016-01-01,A,ECOLE MATERNELLE,,,,85.10Z,NAFRev2,N,-0.679288,48.85159,0.81,street,Rue des Ecoles (Vassy) 14410 Valdallière,14726_0039,G,RUE DES ECOLES,VASSY
200054641,00200,20005464100200,O,2016-01-01,11,2018,,2020-08-25T10:14:58,false,1,GROUPE SCOLAIRE HENRI MOREL,38,,RUE,DE LA LIBERTE,14410,VALDALLIERE,,,14726,,,,,,,,,,,,,,,,,,,2016-01-01,A,ECOLE PRIMAIRE HENRI MOREL,,,,85.20Z,NAFRev2,N,-0.765118,48.920471,0.95,housenumber,38 Rue de la Liberte 14410 Valdallière,14442_0045_00038,G,38 RUE DE LA LIBERTE,
200054641,00218,20005464100218,O,2016-01-01,,,,2016-01-23T00:10:22,false,1,GROUPE SCOLAIRE HENRI MOREL,38,,RUE,DE LA LIBERTE,14410,VALDALLIERE,,,14726,,,,,,,,,,,,,,,,,,,2016-01-01,A,CANTINE SCOLAIRE,,,,56.29B,NAFRev2,N,-0.765118,48.920471,0.95,housenumber,38 Rue de la Liberte 14410 Valdallière,14442_0045_00038,G,38 RUE DE LA LIBERTE,
200054641,00226,20005464100226,O,2016-01-01,01,2018,,2020-08-25T10:14:58,false,1,,,,,VIEILLE RUE,14410,VALDALLIERE,,,14726,,,,,,,,,,,,,,,,,,,2016-01-01,A,ECOLE MATERNELLE,,,,86.10Z,NAFRev2,N,-0.782093,48.876501,0.95,street,Vieille Rue 14410 Valdallière,14726_g350,G,VIEILLE RUE,
200054641,00234,20005464100234,O,2016-01-01,03,2018,,2020-08-25T10:14:58,false,1,,4,,RUE,DES ECOLES,14410,VALDALLIERE,,,14726,,,,,,,,,,,,,,,,,,,2016-01-01,A,ECOLE PRIMAIRE,,,,85.20Z,NAFRev2,N,-0.798988,48.839656,0.93,housenumber,4 Rue des Ecoles (Viessoix) 14410 Valdallière,14746_0001_00004,G,4 RUE DES ECOLES,VIESSOIX
200054641,00242,20005464100242,O,2016-01-01,,,,2021-02-23T10:29:40,false,1,MAIRIE,7,,RUE,DES ECOLES,14410,VALDALLIERE,,,14726,,,,,,,,,,,,,,,,,,,2016-01-01,A,LOTISSEMENT LES ALLAUX,,,,42.99Z,NAFRev2,N,-0.678833,48.852282,0.93,housenumber,7 Rue des Ecoles (Vassy) 14410 Valdallière,14726_0039_00007,G,7 RUE DES ECOLES,VASSY
200054658,00014,20005465800014,O,2016-01-01,,,,2015-11-13T10:36:49,true,1,MAIRIE,7,,RUE,DES ECOLES,14350,VALDALLIERE,,,14726,,,,,,,,,,,,,,,,,,,2016-01-01,A,,,,,88.99B,NAFRev2,N,-0.678833,48.852282,0.93,housenumber,7 Rue des Ecoles (Vassy) 14410 Valdallière,14726_0039_00007,G,7 RUE DES ECOLES,VASSY
200054658,00022,20005465800022,O,2016-01-01,,,,2015-11-13T10:37:56,false,1,,4,,RUE,DE LA CRETE,14350,VALDALLIERE,,,14726,,,,,,,,,,,,,,,,,,,2016-01-01,A,LOGEMENT FOYER LA CRETE,,,,87.30A,NAFRev2,N,-0.677869,48.850927,0.95,housenumber,4 Rue de la Crete 14410 Valdallière,14726_c046_00004,G,4 RUE DE LA CRETE,
211400650,00019,21140065000019,O,1983-03-01,NN,,,2017-05-04T01:22:24,true,5,,,,,LE BOURG,14410,VALDALLIERE,,,14726,,,,,,,,,,,,,,,,,,,2016-01-01,F,MAIRIE,,,,84.11Z,NAFRev2,O,-0.811161,48.90391,0.95,street,Le Bourg 14410 Valdallière,14726_59inga,G,LE BOURG,
211400650,00027,21140065000027,O,1983-03-16,NN,,,2016-01-12T10:30:28,false,3,,,,,LE BOURG,14410,VALDALLIERE,,,14726,,,,,,,,,,,,,,,,,,,2004-07-01,F,CANTINE SCOLAIRE,,,,55.5A,NAFRev1,N,-0.811161,48.90391,0.95,street,Le Bourg 14410 Valdallière,14726_59inga,G,LE BOURG,
211400650,00043,21140065000043,O,1987-12-10,NN,,,2016-04-26T01:19:57,false,6,,,,,LE BOURG,14410,VALDALLIERE,,,14726,,,,,,,,,,,,,,,,,,,2016-01-01,F,ECOLE MATERNELLE PUBLIQUE,,,,85.10Z,NAFRev2,N,-0.811161,48.90391,0.95,street,Le Bourg 14410 Valdallière,14726_59inga,G,LE BOURG,
211401138,00014,21140113800014,O,1983-03-01,NN,,,2017-05-04T01:22:25,true,4,,,,,LE BOURG,14410,VALDALLIERE,,,14726,,,,,,,,,,,,,,,,,,,2016-01-01,F,MAIRIE,,,,84.11Z,NAFRev2,O,-0.811161,48.90391,0.95,street,Le Bourg 14410 Valdallière,14726_59inga,G,LE BOURG,
211401138,00022,21140113800022,O,1983-12-21,NN,,,2016-01-12T10:36:37,false,4,,,,,LE BOURG,14410,VALDALLIERE,,,14726,,,,,,,,,,,,,,,,,,,2005-08-31,F,ECOLE PRIMAIRE PUBLIQUE,,,,80.1Z,NAFRev1,N,-0.811161,48.90391,0.95,street,Le Bourg 14410 Valdallière,14726_59inga,G,LE BOURG,
211401567,00014,21140156700014,O,1983-03-01,NN,,,2017-05-04T01:22:25,true,4,,,,,LE BOURG,14410,VALDALLIERE,,,14726,,,,,,,,,,,,,,,,,,,2016-01-01,F,MAIRIE,,,,84.11Z,NAFRev2,N,-0.811161,48.90391,0.95,street,Le Bourg 14410 Valdallière,14726_59inga,G,LE BOURG,
211402227,00014,21140222700014,O,1983-03-01,NN,,,2017-05-04T01:22:26,true,4,,,,,LE BOURG,14350,VALDALLIERE,,,14726,,,,,,,,,,,,,,,,,,,2016-01-01,F,MAIRIE,,,,84.11Z,NAFRev2,N,-0.811161,48.90391,0.95,street,Le Bourg 14410 Valdallière,14726_59inga,G,LE BOURG,
211402532,00017,21140253200017,O,1983-03-01,NN,,,2017-05-04T01:22:27,true,5,,,,,LE BOURG,14410,VALDALLIERE,,,14726,,,,,,,,,,,,,,,,,,,2016-01-01,F,MAIRIE,,,,84.11Z,NAFRev2,O,-0.811161,48.90391,0.95,street,Le Bourg 14410 Valdallière,14726_59inga,G,LE BOURG,
211402532,00025,21140253200025,O,1983-12-21,NN,,,2016-04-26T01:19:58,false,5,,,,,LE BOURG,14410,VALDALLIERE,,,14726,,,,,,,,,,,,,,,,,,,2016-01-01,F,ECOLE PRIMAIRE PUBLIQUE,,,,85.20Z,NAFRev2,N,-0.811161,48.90391,0.95,street,Le Bourg 14410 Valdallière,14726_59inga,G,LE BOURG,
211402532,00033,21140253200033,O,1987-12-11,NN,,,2016-02-13T13:10:20,false,5,,,,,LE BOURG,14410,VALDALLIERE,,,14726,,,,,,,,,,,,,,,,,,,2008-01-01,F,ECOLE MATERNELLE PUBLIQUE,,,,85.20Z,NAFRev2,N,-0.811161,48.90391,0.95,street,Le Bourg 14410 Valdallière,14726_59inga,G,LE BOURG,
211404421,00011,21140442100011,O,1983-03-01,NN,,,2017-05-04T01:22:28,true,5,,,,,LE BOURG,14350,VALDALLIERE,,,14726,,,,,,,,,,,,,,,,,,,2016-01-01,F,MAIRIE,,,,84.11Z,NAFRev2,O,-0.811161,48.90391,0.95,street,Le Bourg 14410 Valdallière,14726_59inga,G,LE BOURG,
211404421,00029,21140442100029,O,1983-03-16,NN,,,2016-02-13T13:12:31,false,4,,,,,LE BOURG,14350,VALDALLIERE,,,14726,,,,,,,,,,,,,,,,,,,2016-01-01,F,CANTINE SCOLAIRE,,,,56.29B,NAFRev2,N,-0.811161,48.90391,0.95,street,Le Bourg 14410 Valdallière,14726_59inga,G,LE BOURG,
211404421,00037,21140442100037,O,1995-01-01,NN,,,2016-01-12T10:59:52,false,3,MAIRIE,,,,LE BOURG,14350,VALDALLIERE,,,14726,,,,,,,,,,,,,,,,,,,2000-12-31,F,SERVICE EAU,,,,41.0Z,NAF1993,N,-0.811161,48.90391,0.95,street,Le Bourg 14410 Valdallière,14726_59inga,G,LE BOURG,
211404421,00045,21140442100045,O,2005-03-23,,,,2016-01-12T10:59:52,false,4,MAIRIE,,,,LE BOURG,14350,VALDALLIERE,,,14726,,,,,,,,,,,,,,,,,,,2010-12-31,F,BA LOTISSEMENT DES CHENES MONTCHAMP,,,,42.99Z,NAFRev2,O,-0.811161,48.90391,0.95,street,Le Bourg 14410 Valdallière,14726_59inga,G,LE BOURG,
211405030,00019,21140503000019,O,1983-03-01,NN,,,2017-05-04T01:22:29,true,4,,,,,LE BOURG,14410,VALDALLIERE,,,14726,,,,,,,,,,,,,,,,,,,2016-01-01,F,MAIRIE,,,,84.11Z,NAFRev2,N,-0.811161,48.90391,0.95,street,Le Bourg 14410 Valdallière,14726_59inga,G,LE BOURG,
211405212,00013,21140521200013,O,1983-03-01,NN,,,2017-05-04T01:22:29,true,4,,,,,LE BOURG,14410,VALDALLIERE,,,14726,,,,,,,,,,,,,,,,,,,2016-01-01,F,MAIRIE,,,,84.11Z,NAFRev2,N,-0.811161,48.90391,0.95,street,Le Bourg 14410 Valdallière,14726_59inga,G,LE BOURG,
211405212,00039,21140521200039,O,1987-12-15,NN,,,2017-05-04T01:22:29,false,6,,,,,VIEILLE RUE,14410,VALDALLIERE,,,14726,,,,,,,,,,,,,,,,,,,2008-01-01,F,ECOLE MATERNELLE PUBLIQUE,,,,85.20Z,NAFRev2,N,-0.782093,48.876501,0.95,street,Vieille Rue 14410 Valdallière,14726_g350,G,VIEILLE RUE,
211405394,00019,21140539400019,O,1983-03-01,NN,,,2017-05-04T01:22:30,true,4,,,,,LE BOURG,14410,VALDALLIERE,,,14726,,,,,,,,,,,,,,,,,,,2016-01-01,F,MAIRIE,,,,84.11Z,NAFRev2,N,-0.811161,48.90391,0.95,street,Le Bourg 14410 Valdallière,14726_59inga,G,LE BOURG,
211405493,00019,21140549300019,O,1983-03-01,NN,,,2017-05-04T01:22:30,true,4,,,,,LE BOURG,14410,VALDALLIERE,,,14726,,,,,,,,,,,,,,,,,,,2016-01-01,F,MAIRIE,,,,84.11Z,NAFRev2,N,-0.811161,48.90391,0.95,street,Le Bourg 14410 Valdallière,14726_59inga,G,LE BOURG,
211405642,00011,21140564200011,O,1983-03-01,NN,,,2017-05-04T01:22:30,true,4,,,,,LE BOURG,14350,VALDALLIERE,,,14726,,,,,,,,,,,,,,,,,,,2016-01-01,F,MAIRIE,,,,84.11Z,NAFRev2,N,-0.811161,48.90391,0.95,street,Le Bourg 14410 Valdallière,14726_59inga,G,LE BOURG,
211406863,00012,21140686300012,O,1983-03-01,NN,,,2017-05-04T01:22:31,true,4,,,,,LE BOURG,14410,VALDALLIERE,,,14726,,,,,,,,,,,,,,,,,,,2016-01-01,F,MAIRIE,,,,84.11Z,NAFRev2,O,-0.811161,48.90391,0.95,street,Le Bourg 14410 Valdallière,14726_59inga,G,LE BOURG,
211406863,00020,21140686300020,O,1988-09-01,NN,,,2016-01-12T10:45:11,false,4,,,,,,14410,VALDALLIERE,,,14726,,,,,,,,,,,,,,,,,,,2003-10-21,F,ECOLE PRIMAIRE PUBLIQUE,,,,80.1Z,NAFRev1,N,,,0,,,,,,
211407267,00015,21140726700015,O,1983-03-01,NN,,,2017-05-04T01:22:31,true,5,,,,PL,DU COLONEL CANDAU,14350,VALDALLIERE,,,14726,,,,,,,,,,,,,,,,,,,2016-01-01,F,MAIRIE,,,,84.11Z,NAFRev2,O,-0.677269,48.852652,0.86,street,Place du Colonel Candau 14410 Valdallière,14726_b749,G,PLACE DU COLONEL CANDAU,
211407267,00023,21140726700023,O,1983-03-16,NN,,,2016-02-13T12:38:03,false,4,,,,,,14350,VALDALLIERE,,,14726,,,,,,,,,,,,,,,,,,,2016-01-01,F,CANTINE SCOLAIRE,,,,56.29B,NAFRev2,N,,,0,,,,,,
211407267,00031,21140726700031,O,1983-12-21,NN,,,2017-05-04T01:22:31,false,5,,29,,RUE,FRANCOIS CAULET,14350,VALDALLIERE,,,14726,,,,,,,,,,,,,,,,,,,2016-01-01,F,ECOLE MATERNELLE PUBLIQUE,,,,85.10Z,NAFRev2,N,-0.670369,48.853454,0.95,housenumber,29 Rue François Caulet 14410 Valdallière,14726_b955_00029,G,29 RUE FRANCOIS CAULET,
211407267,00049,21140726700049,O,1983-12-21,NN,,,2017-05-04T01:22:31,false,5,,2,,RTE,DE MONTSECRET,14350,VALDALLIERE,,,14726,,,,,,,,,,,,,,,,,,,2016-01-01,F,ECOLE PRIMAIRE PUBLIQUE,,,,85.20Z,NAFRev2,N,-0.733224,48.814442,0.86,housenumber,2 Route de Montsecret 14410 Valdallière,14065_0005_00002,G,2 ROUTE DE MONTSECRET,
211407267,00056,21140726700056,O,1994-01-01,NN,,,2016-02-05T11:11:24,false,4,MAIRIE,,,PL,DU COLONEL CANDAU,14350,VALDALLIERE,,,14726,,,,,,,,,,,,,,,,,,,2009-02-09,F,SERVICE D'ASSAINISSEMENT,,,,37.00Z,NAFRev2,N,-0.677269,48.852652,0.86,street,Place du Colonel Candau 14410 Valdallière,14726_b749,G,PLACE DU COLONEL CANDAU,
211407267,00064,21140726700064,O,2002-07-01,NN,,,2008-06-03T11:30:20,false,4,MAIRIE,,,PL,DU COLONEL CANDAU,14350,VALDALLIERE,,,14726,,,,,,,,,,,,,,,,,,,2008-06-03,F,LOTISSEMENT COMMUNAL,,,,42.99Z,NAFRev2,N,-0.677269,48.852652,0.86,street,Place du Colonel Candau 14410 Valdallière,14726_b749,G,PLACE DU COLONEL CANDAU,
211407465,00015,21140746500015,O,1983-03-01,NN,,,2017-05-04T01:22:31,true,5,,,,,LE BOURG,14410,VALDALLIERE,,,14726,,,,,,,,,,,,,,,,,,,2016-01-01,F,MAIRIE,,,,84.11Z,NAFRev2,O,-0.811161,48.90391,0.95,street,Le Bourg 14410 Valdallière,14726_59inga,G,LE BOURG,
211407465,00023,21140746500023,O,1983-03-16,NN,,,2016-01-12T10:45:23,false,3,,,,,,14410,VALDALLIERE,,,14726,,,,,,,,,,,,,,,,,,,2000-12-25,F,CANTINE SCOLAIRE,,,,55.5A,NAF1993,N,,,0,,,,,,
211407465,00031,21140746500031,O,1983-12-21,NN,,,2017-05-04T01:22:31,false,5,,,,,LE BOURG,14410,VALDALLIERE,,,14726,,,,,,,,,,,,,,,,,,,2016-01-01,F,ECOLE PRIMAIRE PUBLIQUE,,,,85.20Z,NAFRev2,N,-0.811161,48.90391,0.95,street,Le Bourg 14410 Valdallière,14726_59inga,G,LE BOURG,
241400522,00017,24140052200017,O,1993-04-21,NN,,,2016-01-14T04:56:35,false,4,MAIRIE,,,PL,DU COLONEL CANDAU,14350,VALDALLIERE,,,14726,,,,,,,,,,,,,,,,,,,2004-10-14,F,,,,,75.1A,NAFRev1,N,-0.677269,48.852652,0.86,street,Place du Colonel Candau 14410 Valdallière,14726_b749,G,PLACE DU COLONEL CANDAU,
241400522,00025,24140052200025,O,1997-01-01,NN,,,2016-01-19T15:19:37,false,4,,7,,RUE,DES ECOLES,14350,VALDALLIERE,,,14726,,,,,,,,,,,,,,,,,,,2016-01-01,F,ATELIER RELAIS,,,,68.20B,NAFRev2,N,-0.678833,48.852282,0.93,housenumber,7 Rue des Ecoles (Vassy) 14410 Valdallière,14726_0039_00007,G,7 RUE DES ECOLES,VASSY
241400522,00033,24140052200033,O,2004-10-14,NN,,,2017-05-04T01:32:16,true,4,,7,,RUE,DES ECOLES,14350,VALDALLIERE,,,14726,,,,,,,,,,,,,,,,,,,2016-01-01,F,,,,,84.11Z,NAFRev2,O,-0.678833,48.852282,0.93,housenumber,7 Rue des Ecoles (Vassy) 14410 Valdallière,14726_0039_00007,G,7 RUE DES ECOLES,VASSY
241400522,00066,24140052200066,O,2012-09-01,NN,,,2017-05-04T01:32:16,false,2,,,,,LE BOURG,14410,VALDALLIERE,,,14726,,,,,,,,,,,,,,,,,,,2016-01-01,F,ECOLE PRIMAIRE PUBLIQUE,,,,85.20Z,NAFRev2,N,-0.811161,48.90391,0.95,street,Le Bourg 14410 Valdallière,14726_59inga,G,LE BOURG,
241400522,00074,24140052200074,O,2014-09-01,NN,,,2017-05-04T01:32:16,false,2,GROUPE SCOLAIRE,38,,RUE,DE LA LIBERTE,14350,VALDALLIERE,,,14726,,,,,,,,,,,,,,,,,,,2016-01-01,F,ECOLE PRIMAIRE HENRI MOREL,,,,85.20Z,NAFRev2,N,-0.765118,48.920471,0.95,housenumber,38 Rue de la Liberte 14410 Valdallière,14442_0045_00038,G,38 RUE DE LA LIBERTE,
251400529,00011,25140052900011,O,1983-03-01,NN,,,2016-01-12T10:45:10,true,5,MAIRIE,,,,LE BOURG,14410,VALDALLIERE,,,14726,,,,,,,,,,,,,,,,,,,2008-06-30,F,,,,,84.12Z,NAFRev2,N,-0.811161,48.90391,0.95,street,Le Bourg 14410 Valdallière,14726_59inga,G,LE BOURG,
251400586,00011,25140058600011,O,1983-03-01,NN,,,2016-01-12T10:39:45,true,4,MAIRIE,,,,LE BOURG,14410,VALDALLIERE,,,14726,,,,,,,,,,,,,,,,,,,2008-12-31,F,,,,,36.00Z,NAFRev2,N,-0.811161,48.90391,0.95,street,Le Bourg 14410 Valdallière,14726_59inga,G,LE BOURG,
251401014,00013,25140101400013,O,,NN,,,,true,1,,,,,,14350,VALDALLIERE,,,14726,,,,,,,,,,,,,,,,,,,1996-06-04,F,,,,,75.1C,NAF1993,O,,,0,,,,,,
251401188,00015,25140118800015,O,1983-03-01,NN,,,2016-01-12T11:02:25,true,5,MAIRIE,,,,LE BOURG,14350,VALDALLIERE,,,14726,,,,,,,,,,,,,,,,,,,2012-08-31,F,,,,,84.12Z,NAFRev2,O,-0.811161,48.90391,0.95,street,Le Bourg 14410 Valdallière,14726_59inga,G,LE BOURG,
251401188,00023,25140118800023,O,1984-06-21,NN,,,2016-01-12T10:39:35,false,5,,,,,LE BOURG,14350,VALDALLIERE,,,14726,,,,,,,,,,,,,,,,,,,2012-08-31,F,ECOLE MATERNELLE PUBLIQUE,,,,85.10Z,NAFRev2,N,-0.811161,48.90391,0.95,street,Le Bourg 14410 Valdallière,14726_59inga,G,LE BOURG,
251401188,00031,25140118800031,O,1984-06-21,NN,,,2016-01-12T10:55:09,false,5,,,,,,14350,VALDALLIERE,,,14726,,,,,,,,,,,,,,,,,,,2012-08-31,F,ECOLE PRIMAIRE PUBLIQUE HENRI MOREL,,,,85.20Z,NAFRev2,N,,,0,,,,,,
251401238,00018,25140123800018,O,1983-03-01,NN,,,2016-01-12T10:39:20,false,5,MAIRIE,,,,LE BOURG,14410,VALDALLIERE,,,14726,,,,,,,,,,,,,,,,,,,2008-01-01,F,,,,,84.12Z,NAFRev2,O,-0.811161,48.90391,0.95,street,Le Bourg 14410 Valdallière,14726_59inga,G,LE BOURG,
251401238,00026,25140123800026,O,2005-08-03,NN,,,2016-01-12T10:39:19,true,2,MAIRIE,,,,LE BOURG,14410,VALDALLIERE,,,14726,,,,,,,,,,,,,,,,,,,2012-08-31,F,,,,,84.12Z,NAFRev2,O,-0.811161,48.90391,0.95,street,Le Bourg 14410 Valdallière,14726_59inga,G,LE BOURG,
251401352,00017,25140135200017,O,1983-03-01,NN,,,2016-01-12T10:50:09,true,5,MAIRIE,,,,LE BOURG,14410,VALDALLIERE,,,14726,,,,,,,,,,,,,,,,,,,2012-08-31,F,,,,,84.12Z,NAFRev2,O,-0.811161,48.90391,0.95,street,Le Bourg 14410 Valdallière,14726_59inga,G,LE BOURG,
251401352,00025,25140135200025,O,1984-06-21,NN,,,2016-01-12T10:42:33,false,4,,,,,LE BOURG,14410,VALDALLIERE,,,14726,,,,,,,,,,,,,,,,,,,2012-08-31,F,ECOLE PRIMAIRE PUBLIQUE,,,,85.20Z,NAFRev2,N,-0.811161,48.90391,0.95,street,Le Bourg 14410 Valdallière,14726_59inga,G,LE BOURG,
251401444,00012,25140144400012,O,1983-03-01,NN,,,2006-10-26T23:43:17,true,3,MAIRIE,,,PL,DU COLONEL CANDAU,14350,VALDALLIERE,,,14726,,,,,,,,,,,,,,,,,,,2005-05-25,F,,,,,75.1E,NAFRev1,N,-0.677269,48.852652,0.86,street,Place du Colonel Candau 14410 Valdallière,14726_b749,G,PLACE DU COLONEL CANDAU,
251402251,00010,25140225100010,O,1983-03-01,NN,,,2008-11-19T15:44:43,true,4,,,,,,14350,VALDALLIERE,,,14726,,,,,,,,,,,,,,,,,,,1999-12-25,F,,,,,90.0A,NAF1993,N,,,0,,,,,,
251403549,00016,25140354900016,O,,NN,,,2006-11-25T09:08:56,true,1,,,,,MAIRIE,14350,VALDALLIERE,,,14726,,,,,,,,,,,,,,,,,,,1993-04-21,F,,,,,70.1C,NAF1993,N,-0.736328,48.814041,0.92,street,Place de la Mairie 14410 Valdallière,14065_0010,G,PLACE DE LA MAIRIE,
251404075,00011,25140407500011,O,1986-06-04,NN,,,2016-01-12T10:36:44,true,3,MAIRIE,,,,LE BOURG,14410,VALDALLIERE,,,14726,,,,,,,,,,,,,,,,,,,2002-12-31,F,,,,,70.1C,NAF1993,N,-0.811161,48.90391,0.95,street,Le Bourg 14410 Valdallière,14726_59inga,G,LE BOURG,
261400261,00010,26140026100010,O,1983-03-01,NN,,,2016-02-13T13:09:05,true,5,MAIRIE,,,PL,DU COLONEL CANDAU,14350,VALDALLIERE,,,14726,,,,,,,,,,,,,,,,,,,2016-01-01,F,,,,,88.99B,NAFRev2,O,-0.677269,48.852652,0.86,street,Place du Colonel Candau 14410 Valdallière,14726_b749,G,PLACE DU COLONEL CANDAU,
261400261,00028,26140026100028,O,1983-03-16,NN,,,2017-05-04T01:38:00,false,5,,,,,RESIDENCE DE LA CRETE,14350,VALDALLIERE,,,14726,,,,,,,,,,,,,,,,,,,2016-01-01,F,RESIDENCE PERSONNES AGEES,,,,87.10A,NAFRev2,O,-0.678213,48.850217,0.89,street,Lieu Dit Residence de la Crette 14410 Valdallière,14726_c040,G,LIEU DIT RESIDENCE DE LA CRETTE,