siren,nic,siret,statutDiffusionEtablissement,dateCreationEtablissement,trancheEffectifsEtablissement,anneeEffectifsEtablissement,activitePrincipaleRegistreMetiersEtablissement,dateDernierTraitementEtablissement,etablissementSiege,nombrePeriodesEtablissement,complementAdresseEtablissement,numeroVoieEtablissement,indiceRepetitionEtablissement,typeVoieEtablissement,libelleVoieEtablissement,codePostalEtablissement,libelleCommuneEtablissement,libelleCommuneEtrangerEtablissement,distributionSpecialeEtablissement,codeCommuneEtablissement,codeCedexEtablissement,libelleCedexEtablissement,codePaysEtrangerEtablissement,libellePaysEtrangerEtablissement,complementAdresse2Etablissement,numeroVoie2Etablissement,indiceRepetition2Etablissement,typeVoie2Etablissement,libelleVoie2Etablissement,codePostal2Etablissement,libelleCommune2Etablissement,libelleCommuneEtranger2Etablissement,distributionSpeciale2Etablissement,codeCommune2Etablissement,codeCedex2Etablissement,libelleCedex2Etablissement,codePaysEtranger2Etablissement,libellePaysEtranger2Etablissement,dateDebut,etatAdministratifEtablissement,enseigne1Etablissement,enseigne2Etablissement,enseigne3Etablissement,denominationUsuelleEtablissement,activitePrincipaleEtablissement,nomenclatureActivitePrincipaleEtablissement,caractereEmployeurEtablissement,longitude,latitude,geo_score,geo_type,geo_adresse,geo_id,geo_ligne,geo_l4,geo_l5
212702146,00011,21270214600011,O,1983-03-01,03,2018,,2020-08-25T10:16:28,true,4,,,,,,27440,ECOUIS,,,27214,,,,,,,,,,,,,,,,,,,2008-01-01,A,MAIRIE,,,,84.11Z,NAFRev2,O,,,0,,,,,,
212702146,00029,21270214600029,O,1983-12-21,02,2018,,2020-08-25T10:16:28,false,6,,6,,RTE,DE LYONS,27440,ECOUIS,,,27214,,,,,,,,,,,,,,,,,,,2008-01-01,A,ECOLE PRIMAIRE,,,,85.20Z,NAFRev2,N,1.434265,49.311334,0.82,housenumber,6 Route de Lyons 27440 Écouis,27214_0031_00006,G,6 ROUTE DE LYONS,
212702146,00037,21270214600037,O,1983-12-21,NN,,,,false,4,,6,,RTE,,27440,ECOUIS,,,27214,,,,,,,,,,,,,,,,,,,2001-12-31,F,ECOLE MATERNELLE PUBLIQUE,,,,80.1Z,NAF1993,N,3.1206907,45.7709538,0.88,poi.industrial,RTE (Zone industrielle) Clermont-Ferrand,https://osm.org/way/43852862,G,,
212702146,00045,21270214600045,O,1996-12-25,NN,,,2018-11-20T13:43:15,false,3,,,,RTE,DE LYONS,27440,ECOUIS,,,27214,,,,,,,,,,,,,,,,,,,2017-12-11,F,SERVICE D'ASSAINISSEMENT,,,,37.00Z,NAFRev2,N,1.434015,49.311521,0.8,street,Route de Lyons 27440 Écouis,27214_0031,G,ROUTE DE LYONS,
212702146,00052,21270214600052,O,1998-09-21,NN,,,,false,3,,,,RTE,DE LYONS,27440,ECOUIS,,,27214,,,,,,,,,,,,,,,,,,,2003-08-28,F,SERVICE DE TRANSPORT SCOLAIRE,,,,60.2A,NAFRev1,N,1.434015,49.311521,0.8,street,Route de Lyons 27440 Écouis,27214_0031,G,ROUTE DE LYONS,
262702129,00012,26270212900012,O,1983-03-01,NN,,,2006-10-26T23:45:04,true,3,,,,,,27440,ECOUIS,,,27214,,,,,,,,,,,,,,,,,,,2000-12-31,F,CDE,,,,85.3K,NAF1993,N,,,0,,,,,,
262702988,00011,26270298800011,O,1983-03-01,NN,,,2016-04-26T01:32:48,false,5,,9,,RTE,DE PARIS,27440,ECOUIS,,,27214,,,,,,,,,,,,,,,,,,,2014-12-01,F,,,,,87.10A,NAFRev2,O,1.433405,49.309991,0.82,housenumber,9 Route de Paris 27440 Écouis,27214_0045_00009,G,9 ROUTE DE PARIS,
262702988,00029,26270298800029,O,2003-12-19,,,,2015-06-01T15:03:22,false,4,,,,RTE,DU MOULINET,27440,ECOUIS,,BP 6,27214,,,,,,,,,,,,,,,,,,,2014-12-31,F,FOYER LOGEMENT,,,,87.10A,NAFRev2,N,7.4186745,43.8921781,0.79,poi,Route du Moulinet (Pont) Sospel,https://osm.org/way/71126543,G,,
262702988,00037,26270298800037,O,2004-01-01,,,,2015-06-01T15:05:54,false,4,,,,RTE,DU MOULINET,27440,ECOUIS,,BP 6,27214,,,,,,,,,,,,,,,,,,,2014-12-31,F,DOTATION NON AFFECTEE,,,,66.19A,NAFRev2,N,7.4186745,43.8921781,0.79,poi,Route du Moulinet (Pont) Sospel,https://osm.org/way/71126543,G,,
262702988,00045,26270298800045,O,2014-12-01,21,2018,,2020-08-25T10:20:53,true,1,,,,RTE,DU MOULINET,27440,ECOUIS,,,27214,,,,,,,,,,,,,,,,,,,2014-12-01,A,,,,,87.10A,NAFRev2,O,7.4186745,43.8921781,0.79,poi,Route du Moulinet (Pont) Sospel,https://osm.org/way/71126543,G,,
262703200,00010,26270320000010,O,1983-10-14,21,2018,,2020-08-25T10:20:53,true,4,,1,,RTE,DE ROUEN,27440,ECOUIS,,,27214,,,,,,,,,,,,,,,,,,,2008-01-01,A,,,,,87.10B,NAFRev2,O,1.431448,49.310138,0.82,housenumber,1 Route de Rouen 27440 Écouis,27214_0051_00001,G,1 ROUTE DE ROUEN,
262705783,00013,26270578300013,O,1995-12-25,,,,2010-06-26T03:07:21,true,2,,,,RTE,DE LYONS,27440,ECOUIS,,,27214,,,,,,,,,,,,,,,,,,,2008-01-01,A,CCAS,,,,88.99B,NAFRev2,N,1.434015,49.311521,0.8,street,Route de Lyons 27440 Écouis,27214_0031,G,ROUTE DE LYONS,
272701004,00017,27270100400017,O,,,,,,true,1,,,,,,27440,ECOUIS,,,27214,,,,,,,,,,,,,,,,,,,1995-12-25,F,,,,,90.0A,NAF1993,N,,,0,,,,,,
303382279,00022,30338227900022,O,1984-05-18,NN,,,,true,1,,31,,RTE,DE ROUEN,27440,ECOUIS,,,27214,,,,,,,,,,,,,,,,,,,1998-12-31,F,,,,,45.2V,NAF1993,N,1.425732,49.312255,0.83,housenumber,31 Route de Rouen 27440 Écouis,27214_0051_00031,G,31 ROUTE DE ROUEN,
303496202,00027,30349620200027,O,,,,4520AC,2015-03-18T01:41:27,true,1,,28,,RTE,NATIONALE 14MUSSEGROS,27440,ECOUIS,,,27214,,,,,,,,,,,,,,,,,,,1984-12-25,F,,,,,56.01,NAP,N,1.458875,49.298868,0.43,street,Rue Nationale 27440 Écouis,27214_0042,G,RUE NATIONALE,
304540412,00018,30454041200018,O,,NN,,,,true,1,,,,,RTE DE PARIS,27440,ECOUIS,,,27214,,,,,,,,,,,,,,,,,,,1997-09-30,F,,,,,71.3G,NAF1993,O,1.432323,49.309947,0.8,street,Route de Paris 27440 Écouis,27214_0045,G,ROUTE DE PARIS,
306614249,00010,30661424900010,O,,,,,,true,1,,,,RTE,NATIONALE 14,27440,ECOUIS,,,27214,,,,,,,,,,,,,,,,,,,1984-12-25,F,,,,,65.02,NAP,N,1.458875,49.298868,0.63,street,Rue Nationale 27440 Écouis,27214_0042,G,RUE NATIONALE,
307719740,00010,30771974000010,O,,NN,,,2006-11-25T09:22:31,true,1,,,,,MAIRIE,27440,ECOUIS,,,27214,,,,,,,,,,,,,,,,,,,1990-12-31,F,,,,,86.08,NAP,N,1.433263,49.310146,0.91,street,Place de la Mairie 27440 Écouis,27214_0034,G,PLACE DE LA MAIRIE,
309736866,00018,30973686600018,O,,,,,,true,1,,,,RTE,NATIONALE14,27440,ECOUIS,,,27214,,,,,,,,,,,,,,,,,,,1990-10-07,F,,,,,62.11,NAP,N,,,0,,,,,,
310769070,00015,31076907000015,O,,NN,,,,true,1,,13,,RTE,DE VILLEREST,27440,ECOUIS,,,27214,,,,,,,,,,,,,,,,,,,1988-06-01,F,,,,,69.25,NAP,N,1.427601,49.309317,0.85,housenumber,13 Route de Villerest 27440 Écouis,27214_0061_00013,G,13 ROUTE DE VILLEREST,
311984801,00010,31198480100010,O,,NN,,,,true,1,,,,RTE,NATIONALE,27440,ECOUIS,,,27214,,,,,,,,,,,,,,,,,,,1990-01-11,F,,,,,67.05,NAP,N,1.458875,49.298868,0.74,street,Rue Nationale 27440 Écouis,27214_0042,G,RUE NATIONALE,
313336802,00019,31333680200019,O,1978-01-01,NN,,,,true,5,,5,,RTE,DE PARIS,27440,ECOUIS,,,27214,,,,,,,,,,,,,,,,,,,2003-12-25,F,,,,,74.8F,NAFRev1,O,1.432957,49.310043,0.82,housenumber,5 Route de Paris 27440 Écouis,27214_0045_00005,G,5 ROUTE DE PARIS,
313450462,00012,31345046200012,O,1900-01-01,,,,2011-04-28T00:14:31,false,2,,,,,VILLEREST,27440,ECOUIS,,,27214,,,,,,,,,,,,,,,,,,,1984-12-25,F,,,,,01.00,NAP,N,1.410322,49.310567,0.94,street,Villerest 27440 Écouis,27214_fwj21r,G,VILLEREST,
313450470,00015,31345047000015,O,1978-01-01,,,,2006-12-15T00:18:00,false,3,,18,,RTE,DE ROUEN,27440,ECOUIS,,,27214,,,,,,,,,,,,,,,,,,,1996-03-31,F,,,,,01.1A,NAF1993,N,1.429854,49.310918,0.83,housenumber,18 Route de Rouen 27440 Écouis,27214_0051_00018,G,18 ROUTE DE ROUEN,
313455511,00011,31345551100011,O,,,,,,true,1,,18,,RTE,DE ROUEN,27440,ECOUIS,,,27214,,,,,,,,,,,,,,,,,,,1978-01-01,F,,,,,01.1A,NAF1993,N,1.429854,49.310918,0.83,housenumber,18 Route de Rouen 27440 Écouis,27214_0051_00018,G,18 ROUTE DE ROUEN,
315084038,00019,31508403800019,O,1979-01-01,NN,,,2015-04-16T08:57:58,true,4,LISORS,,,LD,LE VILLAGE,27440,ECOUIS,,,27214,,,,,,,,,,,,,,,,,,,2015-03-31,F,,,,,68.20A,NAFRev2,N,2.2950702,48.9311749,0.9,poi.bar,bar le village Gennevilliers,https://osm.org/node/3287755128,G,,
316093970,00028,31609397000028,O,2019-10-23,,,,2020-06-10T04:11:40,true,2,,4,,RUE,DE LA LIBERATION,27440,ECOUIS,,,27214,,,,,,,,,,,,,,,,,,,2020-05-01,F,,,,,93.29Z,NAFRev2,N,1.428864,49.308745,0.94,housenumber,4 Rue de la Libération 27440 Écouis,27214_0027_00004,G,4 RUE DE LA LIBERATION,
318508082,00019,31850808200019,O,,,,,,true,1,,,,,RN 14,27440,ECOUIS,,,27214,,,,,,,,,,,,,,,,,,,1997-03-31,F,,,,,52.5Z,NAF1993,N,,,0,,,,,,
319314514,00013,31931451400013,O,,NN,,,,true,1,,,,RTE,NATIONALE 14,27440,ECOUIS,,,27214,,,,,,,,,,,,,,,,,,,1989-06-27,F,,,,,50.5Z,NAF1993,N,1.458875,49.298868,0.63,street,Rue Nationale 27440 Écouis,27214_0042,G,RUE NATIONALE,
320333537,00035,32033353700035,O,,NN,,,,true,1,,10,,RTE,DE PARIS,27440,ECOUIS,,,27214,,,,,,,,,,,,,,,,,,,1991-05-14,F,,,,,64.25,NAP,N,1.432661,49.309912,0.82,housenumber,10 Route de Paris 27440 Écouis,27214_0045_00010,G,10 ROUTE DE PARIS,
321181778,00028,32118177800028,O,1982-01-01,NN,,,2014-07-08T00:25:14,true,4,,11,,RTE,DE FRESNE,27440,ECOUIS,,,27214,,,,,,,,,,,,,,,,,,,2009-12-31,F,,,,,43.39Z,NAFRev2,N,1.42679,49.308531,0.83,housenumber,11 Route de Fresne 27440 Écouis,27214_0022_00011,G,11 ROUTE DE FRESNE,
321306326,00018,32130632600018,O,,,,,,true,1,,3,,PL,DE LA COLLEGIALE,27440,ECOUIS,,,27214,,,,,,,,,,,,,,,,,,,1984-12-25,F,,,,,38.40,NAP,N,1.431523,49.310391,0.85,housenumber,3 Place de la Collègiale 27440 Écouis,27214_0013_00003,G,3 PLACE DE LA COLLEGIALE,
322369869,00019,32236986900019,O,,,,,,true,1,,20,,RTE,DE ROUEN,27440,ECOUIS,,,27214,,,,,,,,,,,,,,,,,,,1984-12-25,F,,,,,64.25,NAP,N,1.429831,49.31132,0.83,housenumber,20 Route de Rouen 27440 Écouis,27214_0051_00020,G,20 ROUTE DE ROUEN,
323032615,00037,32303261500037,O,,NN,,,,true,1,,,,RTE,DE PARIS,27440,ECOUIS,,,27214,,,,,,,,,,,,,,,,,,,1993-05-14,F,,,,,55.4B,NAF1993,N,1.432323,49.309947,0.8,street,Route de Paris 27440 Écouis,27214_0045,G,ROUTE DE PARIS,
323567610,00015,32356761000015,O,1982-01-01,NN,,,,true,1,,16,,RTE,DE ROUEN,27440,ECOUIS,,,27214,,,,,,,,,,,,,,,,,,,2002-12-31,F,,,,,93.0D,NAF1993,O,1.430309,49.310733,0.83,housenumber,16 Route de Rouen 27440 Écouis,27214_0051_00016,G,16 ROUTE DE ROUEN,
323567628,00025,32356762800025,O,1984-01-01,NN,,,2008-11-07T00:40:16,false,4,,,,RTE,DE VILLEREST,27440,ECOUIS,,,27214,,,,,,,,,,,,,,,,,,,1999-01-01,F,,,,,45.4C,NAF1993,O,1.430975,49.310251,0.83,street,Route de Villerest 27440 Écouis,27214_0061,G,ROUTE DE VILLEREST,
323567628,00033,32356762800033,O,1999-01-01,NN,,,2009-06-27T04:28:11,true,4,,19,B,RTE,DE ROUEN,27440,ECOUIS,,,27214,,,,,,,,,,,,,,,,,,,2007-09-30,F,,,,,45.4C,NAFRev1,O,0.8348256,49.6535235,0.76,poi,Route de Rouen (Pont) Grémonville,https://osm.org/way/114800686,G,,
323632653,00032,32363265300032,O,2000-03-01,NN,,,2018-03-19T08:49:50,false,4,,1,,HAM,DE BREMULES,27440,ECOUIS,,,27214,,,,,,,,,,,,,,,,,,,2002-12-31,F,,,,,93.0N,NAF1993,N,1.408463,49.321769,0.71,street,Les Bremules 27440 Écouis,27214_1dpqu2,G,LES BREMULES,
323632653,00040,32363265300040,O,2018-01-01,,,,2021-02-23T10:46:59,true,1,1 HAMEAU LES BREMULES,1,,,RN 14,27440,ECOUIS,,,27214,,,,,,,,,,,,,,,,,,,2018-01-01,A,,,,,68.20B,NAFRev2,N,1.431448,49.310138,0.34,housenumber,1 Route de Rouen 27440 Écouis,27214_0051_00001,G,1 ROUTE DE ROUEN,
324952613,00010,32495261300010,O,,,,,,true,1,,13,,RTE,DE ROUEN,27440,ECOUIS,,,27214,,,,,,,,,,,,,,,,,,,1984-12-25,F,,,,,79.06,NAP,N,1.428787,49.311279,0.83,housenumber,13 Route de Rouen 27440 Écouis,27214_0051_00013,G,13 ROUTE DE ROUEN,
325005148,00011,32500514800011,O,1982-06-25,NN,,,2017-05-04T03:35:15,true,5,,6,,RTE,DE ROUEN,27440,ECOUIS,,,27214,,,,,,,,,,,,,,,,,,,2015-05-06,F,,,,,69.10Z,NAFRev2,N,1.431083,49.310401,0.82,housenumber,6 Route de Rouen 27440 Écouis,27214_0051_00006,G,6 ROUTE DE ROUEN,
325282127,00019,32528212700019,O,1982-07-01,NN,,4520AC,2018-09-29T12:21:53,true,7,,11,,RTE,DE VILLERET,27440,ECOUIS,,,27214,,,,,,,,,,,,,,,,,,,2016-12-29,F,,,,,45.20A,NAFRev2,O,1.428126,49.309307,0.75,housenumber,11 Route de Villerest 27440 Écouis,27214_0061_00011,G,11 ROUTE DE VILLEREST,
325282127,00027,32528212700027,O,1997-03-01,,,,2008-11-07T00:42:27,false,2,,11,,RTE,DE VILLERET,27440,ECOUIS,,,27214,,,,,,,,,,,,,,,,,,,1997-12-25,F,,,,,50.1Z,NAF1993,N,1.428126,49.309307,0.75,housenumber,11 Route de Villerest 27440 Écouis,27214_0061_00011,G,11 ROUTE DE VILLEREST,
326359148,00029,32635914800029,O,2000-06-21,NN,,,2008-11-07T00:43:44,true,5,,12,,RTE,DE VILLEREST,27440,ECOUIS,,,27214,,,,,,,,,,,,,,,,,,,2007-12-31,F,,,,,45.2J,NAFRev1,N,1.42713,49.309687,0.85,housenumber,12 Route de Villerest 27440 Écouis,27214_0061_00012,G,12 ROUTE DE VILLEREST,
326956232,00010,32695623200010,O,1983-04-01,NN,,,2014-01-31T08:21:48,true,4,,12,,RTE,DE VERCLIVES,27440,ECOUIS,,,27214,,,,,,,,,,,,,,,,,,,2014-03-31,F,,,,,71.11Z,NAFRev2,N,1.435297,49.310412,0.85,housenumber,12 Route de Verclives 27440 Écouis,27214_0059_00012,G,12 ROUTE DE VERCLIVES,
327166849,00015,32716684900015,O,1983-01-01,NN,,,2008-01-04T19:24:51,true,3,,4,,RUE,DE LA CHAPELLE,27440,ECOUIS,,,27214,,,,,,,,,,,,,,,,,,,2008-01-01,A,,,,,68.20B,NAFRev2,N,1.409549,49.310264,0.94,housenumber,4 Rue de la Chapelle 27440 Écouis,27214_0009_00004,G,4 RUE DE LA CHAPELLE,
327204475,00013,32720447500013,O,1983-04-09,NN,,,2012-01-23T10:19:30,false,4,,30,,RTE,DE PARIS,27440,ECOUIS,,,27214,,,,,,,,,,,,,,,,,,,2012-01-20,F,,,,,68.20B,NAFRev2,N,1.43454,49.30885,0.82,housenumber,30 Route de Paris 27440 Écouis,27214_0045_00030,G,30 ROUTE DE PARIS,
327634549,00015,32763454900015,O,,,,,,true,1,,,,RTE,NATIONALE,27440,ECOUIS,,,27214,,,,,,,,,,,,,,,,,,,1984-12-25,F,,,,,00.10,NAP,N,1.458875,49.298868,0.74,street,Rue Nationale 27440 Écouis,27214_0042,G,RUE NATIONALE,
327634556,00010,32763455600010,O,,,,,,true,1,,,,RTE,NATIONALE,27440,ECOUIS,,,27214,,,,,,,,,,,,,,,,,,,1984-12-25,F,,,,,00.10,NAP,N,1.458875,49.298868,0.74,street,Rue Nationale 27440 Écouis,27214_0042,G,RUE NATIONALE,
328153895,00011,32815389500011,O,1983-08-01,01,2018,,2020-08-25T10:33:02,true,4,HAMEAU DE VILLEREST,4,,RUE,DE LA CHAPELLE,27440,ECOUIS,,,27214,,,,,,,,,,,,,,,,,,,2008-01-01,A,,,,,01.11Z,NAFRev2,O,1.409549,49.310264,0.94,housenumber,4 Rue de la Chapelle 27440 Écouis,27214_0009_00004,G,4 RUE DE LA CHAPELLE,
329935746,00019,32993574600019,O,1984-04-01,NN,,,2008-01-04T19:54:36,true,3,,,,HAM,DE MUSSEGROS,27440,ECOUIS,,,27214,,,,,,,,,,,,,,,,,,,2008-01-01,A,,,,,01.50Z,NAFRev2,N,1.453065,49.301526,0.74,street,Mussegros 27440 Écouis,27214_9wgss3,G,MUSSEGROS,
330467135,00027,33046713500027,O,1985-06-05,NN,,,2009-06-27T04:51:44,true,4,,,,HAM,MUSSEGROS,27440,ECOUIS,,,27214,,,,,,,,,,,,,,,,,,,2007-06-14,F,,,,,50.1Z,NAFRev1,O,1.453065,49.301526,0.94,street,Mussegros 27440 Écouis,27214_9wgss3,G,MUSSEGROS,
331435446,00017,33143544600017,O,,NN,,,,true,1,,10,,,LES POMMIERS,27440,ECOUIS,,,27214,,,,,,,,,,,,,,,,,,,1994-12-31,F,,,,,92.3B,NAF1993,N,1.426027,49.313257,0.92,housenumber,10 Lotissement les Pommiers 27440 Écouis,27214_kjk7lj_00010,G,10 LOTISSEMENT LES POMMIERS,
332152198,00013,33215219800013,O,1985-04-01,NN,,,2014-07-08T00:37:10,true,5,,29,,RTE,DE ROUEN,27440,ECOUIS,,,27214,,,,,,,,,,,,,,,,,,,2011-03-31,F,,,,,43.22A,NAFRev2,O,1.42625,49.312354,0.83,housenumber,29 Route de Rouen 27440 Écouis,27214_0051_00029,G,29 ROUTE DE ROUEN,
332290071,00015,33229007100015,O,1985-01-01,NN,,,2017-05-04T04:37:31,false,5,,30,,RTE,DE PARIS,27440,ECOUIS,,,27214,,,,,,,,,,,,,,,,,,,2015-09-29,F,,,,,01.11Z,NAFRev2,O,1.43454,49.30885,0.82,housenumber,30 Route de Paris 27440 Écouis,27214_0045_00030,G,30 ROUTE DE PARIS,
332290071,00023,33229007100023,O,2015-09-29,01,2018,,2021-02-23T10:52:06,true,1,,19,B,RTE,DE PARIS,27440,ECOUIS,,,27214,,,,,,,,,,,,,,,,,,,2015-09-29,A,,,,,01.11Z,NAFRev2,O,2.9843805,49.571231,0.76,poi,Route de Paris (Pont) Noyon,https://osm.org/way/39704118,G,,
332471333,00010,33247133300010,O,,NN,,,,true,1,,2,,RTE,DES ANDELYS,27440,ECOUIS,,,27214,,,,,,,,,,,,,,,,,,,,F,,,,,60.09,NAP,N,1.429872,49.308376,0.84,housenumber,2 Route des Andelys 27440 Écouis,27214_0004_00002,G,2 ROUTE DES ANDELYS,
332529635,00010,33252963500010,O,,,,,,true,1,,7,,PL,DE L EGLISE,27440,ECOUIS,,,27214,,,,,,,,,,,,,,,,,,,1994-07-31,F,,,,,45.1A,NAF1993,N,-1.1676989,44.0766928,0.78,poi.park,Place de l'Église (Parc) Mézos,https://osm.org/way/37053988,G,,
338194509,00026,33819450900026,O,2005-10-01,NN,,4399CZ,2021-02-23T10:54:49,false,8,MUSEGROS,62,,RTE,NATIONALE,27440,ECOUIS,,,27214,,,,,,,,,,,,,,,,,,,2017-03-31,A,,,,,41.20A,NAFRev2,N,1.446556,49.30398,0.78,housenumber,62 Rue Nationale 27440 Écouis,27214_0042_00062,G,62 RUE NATIONALE,
338212863,00025,33821286300025,O,1900-01-01,NN,,,2011-04-28T00:30:40,false,3,,18,,RTE,DE PARIS,27440,ECOUIS,,,27214,,,,,,,,,,,,,,,,,,,1994-12-25,F,,,,,52.4Z,NAF1993,N,1.433626,49.309467,0.82,housenumber,18 Route de Paris 27440 Écouis,27214_0045_00018,G,18 ROUTE DE PARIS,
339149767,00016,33914976700016,O,1900-01-01,NN,,,2011-04-28T00:31:31,false,3,,,,,RN 14 MUSEGROS,27440,ECOUIS,,,27214,,,,,,,,,,,,,,,,,,,1987-12-25,F,,,,,55.60,NAP,N,1.453065,49.301526,0.53,street,Mussegros 27440 Écouis,27214_9wgss3,G,MUSSEGROS,
339149791,00016,33914979100016,O,,NN,,,,true,1,,,,,RN 14 MUSEGROS,27440,ECOUIS,,,27214,,,,,,,,,,,,,,,,,,,1987-02-28,F,,,,,55.70,NAP,N,1.453065,49.301526,0.53,street,Mussegros 27440 Écouis,27214_9wgss3,G,MUSSEGROS,
339149866,00016,33914986600016,O,,NN,,,,true,1,,,,,RN 14 MUSEGROS,27440,ECOUIS,,,27214,,,,,,,,,,,,,,,,,,,1987-02-28,F,,,,,55.70,NAP,N,1.453065,49.301526,0.53,street,Mussegros 27440 Écouis,27214_9wgss3,G,MUSSEGROS,
340739903,00011,34073990300011,O,,NN,,,,true,1,,12,,RTE,DE LYONS LA FORET,27440,ECOUIS,,,27214,,,,,,,,,,,,,,,,,,,1992-12-31,F,,,,,93.0N,NAF1993,N,1.4786619,49.3995308,0.78,poi.post_office,Lyons-la-Forêt (Bureau de poste) Lyons-la-Forêt,https://osm.org/node/3508744628,G,,
341824456,00022,34182445600022,O,,NN,,,,true,1,,2,,RTE,DE PARIS,27440,ECOUIS,,,27214,,,,,,,,,,,,,,,,,,,1993-12-31,F,,,,,45.4C,NAF1993,O,1.432154,49.309886,0.82,housenumber,2 Route de Paris 27440 Écouis,27214_0045_00002,G,2 ROUTE DE PARIS,
341900447,00010,34190044700010,O,,NN,,,,true,1,,,,RTE,DE PARIS,27440,ECOUIS,,,27214,,,,,,,,,,,,,,,,,,,1995-12-15,F,,,,,50.1Z,NAF1993,O,1.432323,49.309947,0.8,street,Route de Paris 27440 Écouis,27214_0045,G,ROUTE DE PARIS,
343262622,11575,34326262211575,O,2003-06-18,NN,,,2018-09-29T12:35:27,false,4,,,,RTE,NATIONALE 14,27440,ECOUIS,,,27214,,,,,,,,,,,,,,,,,,,2016-11-12,F,,,,,47.11D,NAFRev2,O,1.458875,49.298868,0.63,street,Rue Nationale 27440 Écouis,27214_0042,G,RUE NATIONALE,
343262622,20683,34326262220683,O,2017-01-18,,,,2016-12-30T07:55:26,false,1,,,,,ANGLE RN14 ET 14 BIS,27440,ECOUIS,,,27214,,,,,,,,,,,,,,,,,,,2017-01-18,A,LIDL,,,SNC LIDL,47.11D,NAFRev2,O,,,0,,,,,,
343456695,00034,34345669500034,O,1996-03-10,NN,,,2013-06-11T11:35:22,true,4,,18,,RTE,DE ROUEN,27440,ECOUIS,,,27214,,,,,,,,,,,,,,,,,,,2012-12-31,F,,,,,86.90D,NAFRev2,N,1.429854,49.310918,0.83,housenumber,18 Route de Rouen 27440 Écouis,27214_0051_00018,G,18 ROUTE DE ROUEN,
347716581,00025,34771658100025,O,2017-04-15,,,,2017-09-15T11:07:43,true,1,,36,B,RTE,DE PARIS,27440,ECOUIS,,,27214,,,,,,,,,,,,,,,,,,,2017-04-15,A,,,,,68.20B,NAFRev2,N,2.9843805,49.571231,0.76,poi,Route de Paris (Pont) Noyon,https://osm.org/way/39704118,G,,
348652991,00012,34865299100012,O,,NN,,,,true,1,,5,,RUE,DE LA CHAPELLE,27440,ECOUIS,,,27214,,,,,,,,,,,,,,,,,,,1989-03-03,F,,,,,86.06,NAP,N,1.409656,49.310166,0.94,housenumber,5 Rue de la Chapelle 27440 Écouis,27214_0009_00005,G,5 RUE DE LA CHAPELLE,
348685223,00011,34868522300011,O,1988-10-01,NN,,,,true,1,,,,RTE,NATIONALE,27440,ECOUIS,,,27214,,,,,,,,,,,,,,,,,,,2002-03-21,F,,,,,50.1Z,NAF1993,N,1.458875,49.298868,0.74,street,Rue Nationale 27440 Écouis,27214_0042,G,RUE NATIONALE,
348740408,00029,34874040800029,O,1997-09-01,,,,2008-11-08T00:23:18,false,3,LE BOURG,15,,RTE,DE MESNIL VERCLIVES,27440,ECOUIS,,,27214,,,,,,,,,,,,,,,,,,,2000-01-01,F,,,,,45.4C,NAF1993,N,1.4685236,49.3206725,0.79,poi.place_of_worship,Église Saint-Martin (Lieu de culte) Mesnil-Verclives,https://osm.org/way/80984706,G,,
348740408,00037,34874040800037,O,2000-01-01,NN,,,2014-07-08T00:52:06,true,4,,23,,RTE,DE ROUEN,27440,ECOUIS,,,27214,,,,,,,,,,,,,,,,,,,2009-03-31,F,,,,,43.32A,NAFRev2,N,1.427178,49.311961,0.83,housenumber,23 Route de Rouen 27440 Écouis,27214_0051_00023,G,23 ROUTE DE ROUEN,
348782962,00016,34878296200016,O,1988-11-09,,,,,false,3,,15,,RTE,DE FRESNE,27440,ECOUIS,,,27214,,,,,,,,,,,,,,,,,,,1997-04-01,F,,,,,70.2C,NAF1993,N,1.426331,49.308251,0.83,housenumber,15 Route de Fresne 27440 Écouis,27214_0022_00015,G,15 ROUTE DE FRESNE,
349379453,00013,34937945300013,O,,,,,,true,1,,10,,PL,DE LA MAIRIE,27440,ECOUIS,,,27214,,,,,,,,,,,,,,,,,,,1991-09-05,F,,,,,38.40,NAP,N,1.433144,49.310527,0.84,housenumber,10 Place de la Mairie 27440 Écouis,27214_0034_00010,G,10 PLACE DE LA MAIRIE,
349404269,00038,34940426900038,O,2007-01-01,NN,,,2021-01-26T14:21:37,true,4,ANCIEN ARSENAL,,,RUE,DU MOULIN,27440,ECOUIS,,,27214,,,,,,,,RTE,DE LYONS,27440,ECOUIS,,,27214,,,,,2019-08-31,A,,,,,90.01Z,NAFRev2,N,1.435743,49.312855,0.94,street,Rue du Moulin 27440 Écouis,27214_0040,G,RUE DU MOULIN,
349466987,00048,34946698700048,O,2018-05-18,,,7420ZS,2019-01-19T04:08:23,true,2,,4,,PL,DE LA COLLEGIALE,27440,ECOUIS,,,27214,,,,,,,,,,,,,,,,,,,2018-12-30,F,,,,A L'EURE DU DRONE,74.20Z,NAFRev2,N,1.432395,49.310209,0.85,housenumber,4 Place de la Collègiale 27440 Écouis,27214_0013_00004,G,4 PLACE DE LA COLLEGIALE,
353050321,00010,35305032100010,O,1978-04-01,00,2018,,2020-08-25T10:13:14,true,5,,5,,RTE,DE PARIS,27440,ECOUIS,,,27214,,,,,,,,,,,,,,,,,,,2018-12-31,F,,,,,86.21Z,NAFRev2,O,1.432957,49.310043,0.82,housenumber,5 Route de Paris 27440 Écouis,27214_0045_00005,G,5 ROUTE DE PARIS,
353759558,00011,35375955800011,O,1990-02-08,NN,,,2018-10-10T04:47:28,true,3,,10,,RTE,NATIONALE 14,27440,ECOUIS,,,27214,,,,,,,,,,,,,,,,,,,2008-01-01,A,,,,,68.20A,NAFRev2,N,1.45796,49.299248,0.68,housenumber,10 Rue Nationale 27440 Écouis,27214_0042_00010,G,10 RUE NATIONALE,
353761109,00019,35376110900019,O,1990-02-26,NN,,,2012-02-10T12:15:08,false,4,,,,,FERME DE CRESSENVILLE,27440,ECOUIS,,,27214,,,,,,,,,,,,,,,,,,,2012-02-09,F,,,,,01.61Z,NAFRev2,N,1.445634,49.292231,0.4,street,Ferme de Saint-prix 27440 Écouis,27214_b017,G,FERME DE SAINT PRIX,
356000000,00736,35600000000736,O,2012-01-01,,,,2014-01-19T05:33:39,false,2,,4,,PL,GLORIA,27440,ECOUIS,,,27214,,,,,,,,,,,,,,,,,,,2014-01-10,A,LA POSTE,,,,53.10Z,NAFRev2,N,1.432196,49.310141,0.78,housenumber,4 Place Gloria 27440 Écouis,27214_0023_00004,G,4 PLACE GLORIA,
356000232,03330,35600023203330,O,1991-01-01,NN,,,2009-10-17T12:18:11,false,4,,2,,PL,GLORIA,27440,ECOUIS,,,27214,,,,,,,,,,,,,,,,,,,2009-03-18,F,BUREAU DE POSTE,,,,53.10Z,NAFRev2,O,1.432367,49.310085,0.78,housenumber,2 Place Gloria 27440 Écouis,27214_0023_00002,G,2 PLACE GLORIA,
379438039,00016,37943803900016,O,1990-10-01,,,,2008-11-08T00:35:44,false,3,,2,,SQ,ANDRE POTEL,27440,ECOUIS,,,27214,,,,,,,,,,,,,,,,,,,1997-09-15,F,,,,,45.4J,NAF1993,N,1.429072,49.308337,0.83,housenumber,2 Square André-potel 27440 Écouis,27214_0006_00002,G,2 SQUARE ANDRE POTEL,
379438039,00032,37943803900032,O,1998-08-26,NN,,,2008-11-08T00:35:44,false,3,,4,,SQ,ANDRE POTEL,27440,ECOUIS,,,27214,,,,,,,,,,,,,,,,,,,2004-06-01,F,,,,,45.4J,NAFRev1,N,1.428561,49.308188,0.83,housenumber,4 Square André-potel 27440 Écouis,27214_0006_00004,G,4 SQUARE ANDRE POTEL,
379904402,00029,37990440200029,O,1999-01-04,NN,,,2014-07-08T01:03:46,true,4,,2,,RTE,DE VILLEREST,27440,ECOUIS,,,27214,,,,,,,,,,,,,,,,,,,2009-06-30,F,,,,,33.20B,NAFRev2,O,1.430214,49.310118,0.84,housenumber,2 Route de Villerest 27440 Écouis,27214_0061_00002,G,2 ROUTE DE VILLEREST,
380710095,00015,38071009500015,O,1990-11-27,NN,,,2008-01-04T21:46:33,true,4,,,,RTE,NATIONALE 14,27440,ECOUIS,,,27214,,,,,,,,,,,,,,,,,,,2007-12-31,F,,,,,52.1B,NAFRev1,N,1.458875,49.298868,0.63,street,Rue Nationale 27440 Écouis,27214_0042,G,RUE NATIONALE,
382342657,00014,38234265700014,O,,NN,,,,true,1,,5,,RTE,DE LYONS LA FORET,27440,ECOUIS,,,27214,,,,,,,,,,,,,,,,,,,1992-09-30,F,,,,,51.1T,NAF1993,N,1.4786619,49.3995308,0.78,poi.post_office,Lyons-la-Forêt (Bureau de poste) Lyons-la-Forêt,https://osm.org/node/3508744628,G,,