siren,nic,siret,statutDiffusionEtablissement,dateCreationEtablissement,trancheEffectifsEtablissement,anneeEffectifsEtablissement,activitePrincipaleRegistreMetiersEtablissement,dateDernierTraitementEtablissement,etablissementSiege,nombrePeriodesEtablissement,complementAdresseEtablissement,numeroVoieEtablissement,indiceRepetitionEtablissement,typeVoieEtablissement,libelleVoieEtablissement,codePostalEtablissement,libelleCommuneEtablissement,libelleCommuneEtrangerEtablissement,distributionSpecialeEtablissement,codeCommuneEtablissement,codeCedexEtablissement,libelleCedexEtablissement,codePaysEtrangerEtablissement,libellePaysEtrangerEtablissement,complementAdresse2Etablissement,numeroVoie2Etablissement,indiceRepetition2Etablissement,typeVoie2Etablissement,libelleVoie2Etablissement,codePostal2Etablissement,libelleCommune2Etablissement,libelleCommuneEtranger2Etablissement,distributionSpeciale2Etablissement,codeCommune2Etablissement,codeCedex2Etablissement,libelleCedex2Etablissement,codePaysEtranger2Etablissement,libellePaysEtranger2Etablissement,dateDebut,etatAdministratifEtablissement,enseigne1Etablissement,enseigne2Etablissement,enseigne3Etablissement,denominationUsuelleEtablissement,activitePrincipaleEtablissement,nomenclatureActivitePrincipaleEtablissement,caractereEmployeurEtablissement,longitude,latitude,geo_score,geo_type,geo_adresse,geo_id,geo_ligne,geo_l4,geo_l5
213100399,00012,21310039900012,O,1983-03-01,02,2018,,2020-08-25T10:16:39,true,3,,,,,LE VILLAGE,31420,BACHAS,,,31039,,,,,,,,,,,,,,,,,,,2008-01-01,A,MAIRIE,,,,84.11Z,NAFRev2,N,0.936751,43.244068,0.93,street,Le Village 31420 Bachas,31039_swdux1,G,LE VILLAGE,
213100399,00020,21310039900020,O,1999-10-30,NN,,,2008-01-04T18:30:33,false,3,MAIRIE,,,,LE VILLAGE,31420,BACHAS,,,31039,,,,,,,,,,,,,,,,,,,2008-01-01,A,LOGEMENTS PALULOS,,,,68.20A,NAFRev2,N,0.936751,43.244068,0.93,street,Le Village 31420 Bachas,31039_swdux1,G,LE VILLAGE,
213100399,00038,21310039900038,O,2000-01-01,NN,,,2006-10-26T23:40:43,false,3,,,,,LE VILLAGE,31420,BACHAS,,,31039,,,,,,,,,,,,,,,,,,,2005-03-10,F,LOGEMENTS PALULOS DE BACHAS,,,,70.2A,NAFRev1,N,0.936751,43.244068,0.93,street,Le Village 31420 Bachas,31039_swdux1,G,LE VILLAGE,
213100399,00046,21310039900046,O,2004-08-06,,,,2010-07-23T07:54:49,false,4,MAIRIE,,,,LE VILLAGE,31420,BACHAS,,,31039,,,,,,,,,,,,,,,,,,,2009-09-20,F,SERVICE ASSAINISSEMENT NON COLLECTIF,,,,37.00Z,NAFRev2,N,0.936751,43.244068,0.93,street,Le Village 31420 Bachas,31039_swdux1,G,LE VILLAGE,
263101735,00011,26310173500011,O,1984-06-19,NN,,,2010-06-26T03:08:01,true,3,,,,,MAIRIE,31420,BACHAS,,,31039,,,,,,,,,,,,,,,,,,,2008-01-01,A,CCAS,,,,88.99B,NAFRev2,N,0.937646,43.248294,0.36,street,Impasse du Mailho Blanc 31420 Bachas,31039_0030,G,IMPASSE DU MAILHO BLANC,
326914819,00080,32691481900080,O,2013-11-27,,,,2021-02-23T10:48:44,true,1,,7,,,LAPART D EN BAS,31420,BACHAS,,,31039,,,,,,,,,,,,,,,,,,,2013-11-27,A,,,,,43.22A,NAFRev2,N,0.949956,43.246561,0.93,housenumber,7 Lapart d'En Bas 31420 Bachas,31039_b010_00007,G,7 LAPART D EN BAS,
332529296,00011,33252929600011,O,,NN,,,,true,1,,,,,,31420,BACHAS,,,31039,,,,,,,,,,,,,,,,,,,1988-12-23,F,,,,,55.60,NAP,N,,,0,,,,,,
333150795,00016,33315079500016,O,,NN,,,,true,1,,,,,,31420,BACHAS,,,31039,,,,,,,,,,,,,,,,,,,1992-12-25,F,,,,,52.6E,NAF1993,N,,,0,,,,,,
340967181,00017,34096718100017,O,,NN,,,,true,1,,,,,,31420,BACHAS,,,31039,,,,,,,,,,,,,,,,,,,1990-12-31,F,,,,,01.00,NAP,N,,,0,,,,,,
342413580,00024,34241358000024,O,2010-01-22,,,,2016-01-14T03:35:04,true,3,,,,,LE VILLAGE,31420,BACHAS,,,31039,,,,,,,,,,,,,,,,,,,2014-08-01,A,,,,,56.10C,NAFRev2,N,0.936751,43.244068,0.93,street,Le Village 31420 Bachas,31039_swdux1,G,LE VILLAGE,
342698115,00033,34269811500033,O,2006-11-01,,,,2021-02-23T10:58:08,true,2,,,,,LE VILLAGE,31420,BACHAS,,,31039,,,,,,,,,,,,,,,,,,,2008-01-01,A,,,,,64.99Z,NAFRev2,N,0.936751,43.244068,0.93,street,Le Village 31420 Bachas,31039_swdux1,G,LE VILLAGE,
342830932,00048,34283093200048,O,2007-10-02,,,,2014-07-08T00:47:30,false,3,LES ENCLOS LOGEMENT B,,,,ANCIENNE ECOLE DE BACHAS,31420,BACHAS,,,31039,,,,,,,,,,,,,,,,,,,2008-12-07,F,,,,,43.31Z,NAFRev2,N,0.939098,43.247982,0.41,street,Les Enclos 31420 Bachas,31039_hwxb3u,D,LES ENCLOS,
349974378,00029,34997437800029,O,2017-11-01,,,,2021-02-23T11:02:46,true,1,,,,,LE VILLAGE,31420,BACHAS,,,31039,,,,,,,,,,,,,,,,,,,2017-11-01,A,,,,,13.92Z,NAFRev2,N,0.936751,43.244068,0.93,street,Le Village 31420 Bachas,31039_swdux1,G,LE VILLAGE,
381878446,00016,38187844600016,O,,NN,,,,true,1,,,,,VILLAGE,31420,BACHAS,,,31039,,,,,,,,,,,,,,,,,,,1991-08-25,F,,,,,67.01,NAP,N,0.936751,43.244068,0.91,street,Le Village 31420 Bachas,31039_swdux1,G,LE VILLAGE,
387687155,00011,38768715500011,O,,NN,,,2006-11-25T11:49:53,true,1,,,,,,31420,BACHAS,,,31039,,,,,,,,,,,,,,,,,,,1996-03-04,F,,,,,55.4B,NAF1993,O,,,0,,,,,,
398986836,00011,39898683600011,O,1989-11-24,NN,,,2008-01-04T19:00:41,true,3,,,,,,31420,BACHAS,,,31039,,,,,,,,,,,,,,,,,,,2008-01-01,A,,,,,94.99Z,NAFRev2,N,,,0,,,,,,
404016859,00013,40401685900013,O,1987-10-01,NN,,,2008-01-04T20:33:04,true,3,,,,,,31420,BACHAS,,,31039,,,,,,,,,,,,,,,,,,,2008-01-01,A,,,,,01.11Z,NAFRev2,N,,,0,,,,,,
404016867,00016,40401686700016,O,1985-05-01,NN,,,2008-01-04T20:33:04,true,3,,,,,,31420,BACHAS,,,31039,,,,,,,,,,,,,,,,,,,2008-01-01,A,,,,,01.11Z,NAFRev2,N,,,0,,,,,,
431795525,00010,43179552500010,O,1969-01-01,NN,,,2008-01-04T18:19:23,true,3,,,,,LAPART,31420,BACHAS,,,31039,,,,,,,,,,,,,,,,,,,2008-01-01,A,,,,,01.11Z,NAFRev2,N,0.947791,43.248546,0.9,street,Lapart d'En Bas 31420 Bachas,31039_b010,G,LAPART D EN BAS,
482609625,00025,48260962500025,O,2011-02-28,01,2018,,2021-02-23T13:46:51,true,4,,,,LD,LE VILLAGE,31420,BACHAS,,,31039,,,,,,,,,,,,,,,,,,,2017-11-01,A,,,,,43.33Z,NAFRev2,O,0.936751,43.244068,0.93,street,Le Village 31420 Bachas,31039_swdux1,G,LE VILLAGE,
484444401,00034,48444440100034,O,2007-04-17,,,,2014-07-10T00:16:54,true,3,,,,LD,GROUGNAUX,31420,BACHAS,,,31039,,,,,,,,,,,,,,,,,,,2009-04-30,F,,,,,95.11Z,NAFRev2,N,0.938786,43.242861,0.93,street,Grougnaux 31420 Bachas,31039_vgdre9,G,GROUGNAUX,
494919178,00017,49491917800017,O,2007-03-23,,,,2014-10-06T09:15:00,false,2,,,,,GRANDE RUE,31420,BACHAS,,,31039,,,,,,,,,,,,,,,,,,,2007-10-08,F,,,,,85.1G,NAFRev1,N,0.94892,43.24686,0.82,street,Rue de la Grande Ourse 31420 Bachas,31039_0028,G,RUE DE LA GRANDE OURSE,
517861704,00024,51786170400024,O,2016-04-01,,,,2016-07-13T10:30:43,true,1,,,,,LES ENCLOS,31420,BACHAS,,,31039,,,,,,,,,,,,,,,,,,,2016-04-01,A,,,,,71.12A,NAFRev2,N,0.939098,43.247982,0.93,street,Les Enclos 31420 Bachas,31039_hwxb3u,G,LES ENCLOS,
524474350,00021,52447435000021,O,2016-12-21,,,,2021-02-23T15:41:28,true,1,,,,RTE,DE LA CHAPELLE DE MAILHO BLANC,31420,BACHAS,,,31039,,,,,,,,,,,,,,,,,,,2016-12-21,A,FERME DE MAILHO BLANC,,,,01.45Z,NAFRev2,N,0.937282,43.24485,0.46,street,Rue du Mailho Blanc 31420 Bachas,31039_0025,G,RUE DU MAILHO BLANC,
753922418,00045,75392241800045,O,2017-11-10,,,,2021-02-23T16:11:31,true,1,,,,,296 ROUTE DU CANIGOU,31420,BACHAS,,,31039,,,,,,,,,,,,,,,,,,,2017-11-10,A,,,,,18.13Z,NAFRev2,N,0.94131,43.243588,0.73,housenumber,296 Rue du Canigou 31420 Bachas,31039_0026_00296,G,296 RUE DU CANIGOU,
776772675,00018,77677267500018,O,1900-01-01,NN,,,,true,4,MAIRIE,,,,,31420,BACHAS,,,31039,,,,,,,,,,,,,,,,,,,1998-06-22,F,,,,,01.4A,NAF1993,N,0.937646,43.248294,0.36,street,Impasse du Mailho Blanc 31420 Bachas,31039_0030,D,IMPASSE DU MAILHO BLANC,
