siren,nic,siret,statutDiffusionEtablissement,dateCreationEtablissement,trancheEffectifsEtablissement,anneeEffectifsEtablissement,activitePrincipaleRegistreMetiersEtablissement,dateDernierTraitementEtablissement,etablissementSiege,nombrePeriodesEtablissement,complementAdresseEtablissement,numeroVoieEtablissement,indiceRepetitionEtablissement,typeVoieEtablissement,libelleVoieEtablissement,codePostalEtablissement,libelleCommuneEtablissement,libelleCommuneEtrangerEtablissement,distributionSpecialeEtablissement,codeCommuneEtablissement,codeCedexEtablissement,libelleCedexEtablissement,codePaysEtrangerEtablissement,libellePaysEtrangerEtablissement,complementAdresse2Etablissement,numeroVoie2Etablissement,indiceRepetition2Etablissement,typeVoie2Etablissement,libelleVoie2Etablissement,codePostal2Etablissement,libelleCommune2Etablissement,libelleCommuneEtranger2Etablissement,distributionSpeciale2Etablissement,codeCommune2Etablissement,codeCedex2Etablissement,libelleCedex2Etablissement,codePaysEtranger2Etablissement,libellePaysEtranger2Etablissement,dateDebut,etatAdministratifEtablissement,enseigne1Etablissement,enseigne2Etablissement,enseigne3Etablissement,denominationUsuelleEtablissement,activitePrincipaleEtablissement,nomenclatureActivitePrincipaleEtablissement,caractereEmployeurEtablissement,longitude,latitude,geo_score,geo_type,geo_adresse,geo_id,geo_ligne,geo_l4,geo_l5
213701915,00018,21370191500018,O,1983-03-01,03,2018,,2020-08-25T10:17:01,true,4,,10,,PL,DE LA MAIRIE,37120,RAZINES,,,37191,,,,,,,,,,,,,,,,,,,2008-01-01,A,MAIRIE,,,,84.11Z,NAFRev2,O,0.377444,46.976097,0.84,housenumber,10 Place de la Mairie 37120 Razines,37191_0128_00010,G,10 PLACE DE LA MAIRIE,
213701915,00026,21370191500026,O,1983-12-21,01,2018,,2020-08-25T10:17:01,false,3,,8,,RUE,DES ECOLES,37120,RAZINES,,,37191,,,,,,,,,,,,,,,,,,,2008-01-01,A,ECOLE MATERNELLE PUBLIQUE,,,,85.20Z,NAFRev2,N,0.37905,46.974896,0.93,housenumber,8 Rue des Ecoles 37120 Razines,37191_0085_00008,G,8 RUE DES ECOLES,
213701915,00042,21370191500042,O,2004-12-25,NN,,,2008-01-04T18:32:29,false,2,MAIRIE,10,,PL,DE LA MAIRIE,37120,RAZINES,,,37191,,,,,,,,,,,,,,,,,,,2008-01-01,A,SERVICE ASSAINISSEMENT,,,,37.00Z,NAFRev2,N,0.377444,46.976097,0.84,housenumber,10 Place de la Mairie 37120 Razines,37191_0128_00010,G,10 PLACE DE LA MAIRIE,
263701922,00019,26370192200019,O,1983-03-01,NN,,,2016-07-23T12:18:57,true,5,MAIRIE,10,,PL,DE LA MAIRIE,37120,RAZINES,,,37191,,,,,,,,,,,,,,,,,,,2016-01-01,F,,,,,88.99B,NAFRev2,N,0.377444,46.976097,0.84,housenumber,10 Place de la Mairie 37120 Razines,37191_0128_00010,G,10 PLACE DE LA MAIRIE,
263703621,00015,26370362100015,O,1985-12-17,NN,,,2010-06-26T03:09:12,true,4,MAIRIE,10,,PL,DE LA MAIRIE,37120,RAZINES,,,37191,,,,,,,,,,,,,,,,,,,2008-01-01,A,,,,,88.99B,NAFRev2,N,0.377444,46.976097,0.84,housenumber,10 Place de la Mairie 37120 Razines,37191_0128_00010,G,10 PLACE DE LA MAIRIE,
293701587,00017,29370158700017,O,1991-10-29,NN,,,2009-06-27T03:33:12,true,5,MAIRIE,10,,PL,DE LA MAIRIE,37120,RAZINES,,,37191,,,,,,,,,,,,,,,,,,,2008-01-01,F,,,,,42.99Z,NAFRev2,O,0.377444,46.976097,0.84,housenumber,10 Place de la Mairie 37120 Razines,37191_0128_00010,G,10 PLACE DE LA MAIRIE,
293701686,00017,29370168600017,O,1991-11-08,NN,,,2018-09-29T12:08:56,true,4,MAIRIE,10,,PL,DE LA MAIRIE,37120,RAZINES,,,37191,,,,,,,,,,,,,,,,,,,2011-10-01,A,,,,,42.99Z,NAFRev2,O,0.377444,46.976097,0.84,housenumber,10 Place de la Mairie 37120 Razines,37191_0128_00010,G,10 PLACE DE LA MAIRIE,
301588216,00020,30158821600020,O,,NN,,,,true,1,,,,,LE BOURG,37120,RAZINES,,,37191,,,,,,,,,,,,,,,,,,,1992-03-24,F,,,,,55.3A,NAF1993,N,0.378759,46.974634,0.93,street,Le Bourg 37120 Razines,37191_lld2ea,G,LE BOURG,
316037167,00012,31603716700012,O,1900-01-01,,,,,true,4,,,,,LE RONDIN,37120,RAZINES,,,37191,,,,,,,,,,,,,,,,,,,1992-12-25,F,,,,,29.3D,NAF1993,N,-1.7426765,47.9276345,0.71,poi.school,École primaire publique les Rondines Bourg-des-Comptes,https://osm.org/way/386867514,G,,
317574689,00012,31757468900012,O,1979-01-01,NN,,,2008-04-05T00:17:33,true,3,,,,,,37120,RAZINES,,,37191,,,,,,,,,,,,,,,,,,,2008-01-01,A,,,,,68.32A,NAFRev2,N,,,0,,,,,,
317681229,00017,31768122900017,O,,,,,,true,1,,,,,CHATEAU DE MILLY,37120,RAZINES,,,37191,,,,,,,,,,,,,,,,,,,1988-12-19,F,,,,,67.08,NAP,N,2.463778,48.4019059,0.9,poi.castle,Château de Milly-la-Forêt Milly-la-Forêt,https://osm.org/node/4865701882,G,,
320697386,00011,32069738600011,O,1978-01-01,NN,,,2007-01-18T09:15:24,true,3,,,,LD,LE FOUGERAY,37120,RAZINES,,,37191,,,,,,,,,,,,,,,,,,,1996-12-31,F,,,,,01.1A,NAF1993,N,0.365091,46.983654,0.93,street,Le Fougeray 37120 Razines,37191_boqzj7,G,LE FOUGERAY,
321463051,00011,32146305100011,O,,NN,,,,true,1,,,,,LE BOURG,37120,RAZINES,,,37191,,,,,,,,,,,,,,,,,,,,F,,,,,67.01,NAP,N,0.378759,46.974634,0.93,street,Le Bourg 37120 Razines,37191_lld2ea,G,LE BOURG,
321876385,00014,32187638500014,O,,NN,,,,true,1,,,,,LA METAIRIE,37120,RAZINES,,,37191,,,,,,,,,,,,,,,,,,,1986-12-31,F,,,,,58.04,NAP,N,-1.7735169,48.1460893,0.9,poi.community_centre,La Métairie (Salle des fêtes) Pacé,https://osm.org/way/67403517,G,,
324339563,00011,32433956300011,O,,,,,,true,1,,,,,LES FONTAINES D'ARCHES,37120,RAZINES,,,37191,,,,,,,,,,,,,,,,,,,1984-12-25,F,,,,,69.11,NAP,N,0.390282,46.960115,0.89,street,Les Fontaines d'Arche 37120 Razines,37191_b043,G,LES FONTAINES D ARCHE,
325695427,00014,32569542700014,O,1982-04-01,01,2018,,2020-08-25T10:31:30,true,3,BERNARD HERAUD,,,,LES PLANCHES,37120,RAZINES,,,37191,,,,,,,,,,,,,,,,,,,2008-01-01,A,,,,,01.50Z,NAFRev2,N,0.372572,46.976611,0.84,street,Le Moulin des Planches 37120 Razines,37191_b063,G,LE MOULIN DES PLANCHES,
328072160,00018,32807216000018,O,,NN,,,,true,1,,,,,,37120,RAZINES,,,37191,,,,,,,,,,,,,,,,,,,,F,,,,,84.10,NAP,N,,,0,,,,,,
329229637,00023,32922963700023,O,,NN,,,,true,1,,,,,LE BOURG,37120,RAZINES,,,37191,,,,,,,,,,,,,,,,,,,1989-07-01,F,,,,,67.01,NAP,N,0.378759,46.974634,0.93,street,Le Bourg 37120 Razines,37191_lld2ea,G,LE BOURG,
331000331,00032,33100033100032,O,1996-01-15,NN,,,,true,1,,9,,AV,DE L'ANCIENNE EGLISE,37120,RAZINES,,,37191,,,,,,,,,,,,,,,,,,,1999-11-02,F,,,,,45.2V,NAF1993,O,0.369088,46.971671,0.86,housenumber,9 Avenue de l'Ancienne Eglise 37120 Razines,37191_0090_00009,G,9 AVENUE DE L ANCIENNE EGLISE,
333661569,00017,33366156900017,O,1985-06-10,03,2018,2814ZZ,2020-09-07T20:05:46,true,6,,,,LD,LA METAIRIE,37120,RAZINES,,,37191,,,,,,,,,,,,,,,,,,,2009-10-06,A,,,,,28.14Z,NAFRev2,O,-1.7735169,48.1460893,0.9,poi.community_centre,La Métairie (Salle des fêtes) Pacé,https://osm.org/way/67403517,G,,
335034492,00017,33503449200017,O,1986-01-29,NN,,,2006-10-27T02:42:35,true,4,,,,,LA CHAUMERIE,37120,RAZINES,,,37191,,,,,,,,,,,,,,,,,,,2005-12-06,F,,,,,01.1C,NAFRev1,N,0.382495,46.978735,0.93,street,La Chaumerie 37120 Razines,37191_oiw2sj,G,LA CHAUMERIE,
337838999,00015,33783899900015,O,,NN,,,,true,1,,,,,PINSAURON,37120,RAZINES,,,37191,,,,,,,,,,,,,,,,,,,1990-05-29,F,,,,,56.01,NAP,N,0.368251,46.967987,0.93,street,Pinsauron 37120 Razines,37191_6xw3lf,G,PINSAURON,
342158870,00010,34215887000010,O,,NN,,,,true,1,,,,,LE PONT,37120,RAZINES,,,37191,,,,,,,,,,,,,,,,,,,1987-12-31,F,,,,,01.00,NAP,N,0.37467,46.982948,0.93,street,Le Pont 37120 Razines,37191_7ozpku,G,LE PONT,
343877056,00014,34387705600014,O,1988-02-16,NN,,,,false,4,,,,RTE,,37120,RAZINES,,,37191,,,,,,,,,,,,,,,,,,,1999-11-01,F,,,,,45.4M,NAF1993,O,3.1206907,45.7709538,0.88,poi.industrial,RTE (Zone industrielle) Clermont-Ferrand,https://osm.org/way/43852862,G,,
349484402,00012,34948440200012,O,1987-01-01,,,,,true,1,,,,,,37120,RAZINES,,,37191,,,,,,,,,,,,,,,,,,,1999-05-01,F,,,,,01.1G,NAF1993,N,,,0,,,,,,
350206926,00072,35020692600072,O,2014-10-01,,,,2021-02-23T11:02:58,true,1,,,,,LA LOGE,37120,RAZINES,,,37191,,,,,,,,,,,,,,,,,,,2014-10-01,A,,,,,01.13Z,NAFRev2,N,0.361574,46.971494,0.93,street,La Loge 37120 Razines,37191_zh6wbn,G,LA LOGE,
352565923,00021,35256592300021,O,2016-03-01,,,2562BZ,2021-02-23T11:05:00,false,1,,4,,,LES FONTAINES D'ARCHES,37120,RAZINES,,,37191,,,,,,,,,,,,,,,,,,,2016-03-01,A,,,,,33.20A,NAFRev2,N,0.390282,46.960115,0.89,housenumber,4 Les Fontaines d'Arche 37120 Razines,37191_b043_00004,G,4 LES FONTAINES D ARCHE,
352591267,00013,35259126700013,O,,NN,,,,true,1,,,,,LE BOURG,37120,RAZINES,,,37191,,,,,,,,,,,,,,,,,,,1990-10-31,F,,,,,55.60,NAP,N,0.378759,46.974634,0.93,street,Le Bourg 37120 Razines,37191_lld2ea,G,LE BOURG,
352591564,00013,35259156400013,O,,NN,,,,true,1,,,,,LE COCHEREAU,37120,RAZINES,,,37191,,,,,,,,,,,,,,,,,,,1990-11-21,F,,,,,55.60,NAP,N,0.37063,46.973269,0.91,street,Lotissement le Cochereau 37120 Razines,37191_yyib8e,G,LOTISSEMENT LE COCHEREAU,
379028467,00015,37902846700015,O,1989-11-23,NN,,,,true,1,,,,,LE BAS MONTEIL,37120,RAZINES,,,37191,,,,,,,,,,,,,,,,,,,1998-12-31,F,,,,,01.1A,NAF1993,N,0.385959,46.967902,0.93,street,Le Bas Monteil 37120 Razines,37191_b006,G,LE BAS MONTEIL,
379145436,00018,37914543600018,O,1990-05-21,NN,,,,true,4,RD 749,,,,CHATEAU DE MILLY,37120,RAZINES,,,37191,,,,,,,,,,,,,,,,,,,1997-09-16,F,,,,,55.1A,NAF1993,O,2.463778,48.4019059,0.9,poi.castle,Château de Milly-la-Forêt Milly-la-Forêt,https://osm.org/node/4865701882,G,,
388445793,00010,38844579300010,O,,NN,,,,true,1,,,,,LE BOURG,37120,RAZINES,,,37191,,,,,,,,,,,,,,,,,,,1993-06-14,F,,,,,55.3A,NAF1993,N,0.378759,46.974634,0.93,street,Le Bourg 37120 Razines,37191_lld2ea,G,LE BOURG,
391600228,00012,39160022800012,O,1993-05-02,NN,,,,true,4,,,,LD,LE RONDIN,37120,RAZINES,,,37191,,,,,,,,,,,,,,,,,,,1998-06-23,F,,,,,74.8K,NAF1993,O,-1.7426765,47.9276345,0.71,poi.school,École primaire publique les Rondines Bourg-des-Comptes,https://osm.org/way/386867514,G,,
398637926,00013,39863792600013,O,1978-03-01,NN,,,2017-12-28T09:13:27,true,5,,,,,LE PONT,37120,RAZINES,,,37191,,,,,,,,,,,,,,,,,,,2008-01-01,F,,,,,68.20B,NAFRev2,N,0.37467,46.982948,0.93,street,Le Pont 37120 Razines,37191_7ozpku,G,LE PONT,
401255625,00014,40125562500014,O,1995-06-06,NN,,,2008-01-04T19:43:36,true,6,,2,,AV,DE L'ANCIENNE EGLISE,37120,RAZINES,,,37191,,,,,,,,,,,,,,,,,,,2008-01-01,A,,,,,68.20B,NAFRev2,N,0.368999,46.971723,0.86,housenumber,2 Avenue de l'Ancienne Eglise 37120 Razines,37191_0090_00002,G,2 AVENUE DE L ANCIENNE EGLISE,
402947592,00018,40294759200018,O,1995-10-30,NN,,,2008-01-05T20:19:12,true,3,,,,LD,LE HAUT MONTEIL,37120,RAZINES,,,37191,,,,,,,,,,,,,,,,,,,2008-01-01,A,,,,,68.20B,NAFRev2,N,0.382529,46.96531,0.93,street,Le Haut Monteil 37120 Razines,37191_b052,G,LE HAUT MONTEIL,
408407294,00011,40840729400011,O,1996-07-22,NN,,,2010-07-08T05:12:16,true,3,,,,,LE MOULIN DES PLANCHES,37120,RAZINES,,,37191,,,,,,,,,,,,,,,,,,,2008-01-01,A,,,,,68.20B,NAFRev2,N,0.372572,46.976611,0.93,street,Le Moulin des Planches 37120 Razines,37191_b063,G,LE MOULIN DES PLANCHES,
409483328,00020,40948332800020,O,1998-09-01,,,,,false,3,,,,,CHARGE,37120,RAZINES,,,37191,,,,,,,,,,,,,,,,,,,1999-03-31,F,,,,,36.1G,NAF1993,N,0.398081,46.970107,0.93,street,Chargé 37120 Razines,37191_tf3ltt,G,CHARGE,
413308461,00016,41330846100016,O,1997-07-15,NN,,,2008-01-05T20:29:48,true,3,,,,,MILLY,37120,RAZINES,,,37191,,,,,,,,,,,,,,,,,,,2008-01-01,A,,,,,68.20B,NAFRev2,N,0.393998,46.958044,0.93,street,Milly 37120 Razines,37191_r2l1mh,G,MILLY,
419263488,00019,41926348800019,O,1998-01-01,NN,,,2006-10-28T04:41:35,true,3,,,,,LA COUARDE,37120,RAZINES,,,37191,,,,,,,,,,,,,,,,,,,2005-12-01,F,,,,,01.1A,NAFRev1,N,0.434398,46.980905,0.93,street,La Couarde 37120 Razines,37191_xoh9bs,G,LA COUARDE,
419761762,00014,41976176200014,O,1998-08-03,00,2018,,2021-02-23T11:40:41,true,4,,,,,LE BAS MONTEIL,37120,RAZINES,,,37191,,,,,,,,,,,,,,,,,,,2014-03-10,A,,,,,01.11Z,NAFRev2,N,0.385959,46.967902,0.93,street,Le Bas Monteil 37120 Razines,37191_b006,G,LE BAS MONTEIL,
420161499,00017,42016149900017,O,1982-12-31,,,,,true,1,,,,,LA L0GE,37120,RAZINES,,,37191,,,,,,,,,,,,,,,,,,,1998-12-31,F,,,,,01.1A,NAF1993,N,0.361574,46.971494,0.57,street,La Loge 37120 Razines,37191_zh6wbn,G,LA LOGE,
420161507,00017,42016150700017,O,1985-12-31,NN,,,2008-01-04T23:47:44,true,5,,,,,LA GARRELIERE,37120,RAZINES,,,37191,,,,,,,,,,,,,,,,,,,2008-01-01,A,,,,,68.20B,NAFRev2,N,0.401905,46.978464,0.93,street,La Garrelière 37120 Razines,37191_c9x277,G,LA GARRELIERE,
420161515,00010,42016151500010,O,1991-01-01,NN,,,2015-10-15T04:41:05,true,4,,,,,MILLY,37120,RAZINES,,,37191,,,,,,,,,,,,,,,,,,,2015-09-30,F,,,,,01.11Z,NAFRev2,N,0.393998,46.958044,0.93,street,Milly 37120 Razines,37191_r2l1mh,G,MILLY,
420161523,00014,42016152300014,O,1986-12-31,NN,,,2015-10-13T03:25:29,true,4,,,,,LE HAUT FOUGERAY,37120,RAZINES,,,37191,,,,,,,,,,,,,,,,,,,2015-12-31,F,,,,,01.11Z,NAFRev2,N,0.380552,46.9801,0.93,street,Le Haut Fougeray 37120 Razines,37191_b051,G,LE HAUT FOUGERAY,
420161531,00017,42016153100017,O,1991-01-01,NN,,,2007-01-18T09:40:33,true,3,,9,,RUE,DES CAVES,37120,RAZINES,,,37191,,,,,,,,,,,,,,,,,,,2004-09-27,F,,,,,01.1A,NAFRev1,N,0.379863,46.976081,0.93,housenumber,9 Rue des Caves 37120 Razines,37191_0070_00009,G,9 RUE DES CAVES,
420844227,00017,42084422700017,O,1998-10-22,NN,,,2008-01-04T23:58:11,true,3,LE BOURG,8,,PL,DE LA MAIRIE,37120,RAZINES,,,37191,,,,,,,,,,,,,,,,,,,2008-01-01,A,,,,,56.10A,NAFRev2,N,0.37731,46.975815,0.83,housenumber,8 Place de la Mairie 37120 Razines,37191_0128_00008,G,8 PLACE DE LA MAIRIE,
422008730,00042,42200873000042,O,2010-02-23,,,,2012-11-09T01:12:11,true,1,,,,LD,LIEU DIT LES COURNUS,37120,RAZINES,,,37191,,,,,,,,,,,,,,,,,,,2010-02-23,A,,,,,70.21Z,NAFRev2,N,0.392479,46.977559,0.71,street,Les Cornus 37120 Razines,37191_kebglv,G,LES CORNUS,
422769059,00029,42276905900029,O,1999-06-01,NN,,,2006-10-30T23:57:57,false,3,,,,,,37120,RAZINES,,,37191,,,,,,,,,,,,,,,,,,,2005-01-01,F,,,,,70.2B,NAFRev1,N,,,0,,,,,,
422964908,00012,42296490800012,O,1999-05-01,02,2018,,2020-08-25T10:13:54,true,4,,,,,LA GARRELIERE,37120,RAZINES,,,37191,,,,,,,,,,,,,,,,,,,2012-12-31,A,,,,,01.21Z,NAFRev2,O,0.401905,46.978464,0.93,street,La Garrelière 37120 Razines,37191_c9x277,G,LA GARRELIERE,
423052091,00018,42305209100018,O,1999-05-28,NN,,,2007-09-27T14:51:52,true,3,,,,,DEPARTEMENTALE 749,37120,RAZINES,,,37191,,,,,,,,,,,,,,,,,,,2001-05-17,F,,,,,55.1A,NAF1993,N,2.2226308,48.9136657,0.71,poi.hospital,Hôpital Max Fourestier Nanterre,https://osm.org/way/43453588,G,,
423177484,00015,42317748400015,O,1999-06-01,NN,,,2017-05-04T01:45:43,false,5,,,,,LE PONT,37120,RAZINES,,,37191,,,,,,,,,,,,,,,,,,,2017-01-01,F,,,,,01.11Z,NAFRev2,O,0.37467,46.982948,0.93,street,Le Pont 37120 Razines,37191_7ozpku,G,LE PONT,
423390830,00010,42339083000010,O,1999-06-01,NN,,,2009-09-09T04:35:59,true,4,,,,,LA GARRELIERE,37120,RAZINES,,,37191,,,,,,,,,,,,,,,,,,,2008-07-31,F,,,,,01.11Z,NAFRev2,N,0.401905,46.978464,0.93,street,La Garrelière 37120 Razines,37191_c9x277,G,LA GARRELIERE,
424876282,00015,42487628200015,O,1999-10-25,NN,,,2017-12-05T08:40:22,false,4,,8,,RUE,DES CAVES,37120,RAZINES,,,37191,,,,,,,,,,,,,,,,,,,2017-11-25,F,,,,,01.11Z,NAFRev2,N,0.378697,46.975644,0.93,housenumber,8 Rue des Caves 37120 Razines,37191_0070_00008,G,8 RUE DES CAVES,
424876282,00023,42487628200023,O,2008-01-02,,,,2014-07-08T02:03:09,false,2,,7,,RUE,DES CAVES,37120,RAZINES,,,37191,,,,,,,,,,,,,,,,,,,2008-12-31,F,,,,,37.00Z,NAFRev2,N,0.378209,46.975433,0.93,housenumber,7 Rue des Caves 37120 Razines,37191_0070_00007,G,7 RUE DES CAVES,
424876282,00031,42487628200031,O,2012-01-01,,,3700ZP,2021-02-23T11:47:11,false,1,,7,B,RUE,DES CAVES,37120,RAZINES,,,37191,,,,,,,,,,,,,,,,,,,2012-01-01,A,,,,,37.00Z,NAFRev2,N,0.378108,46.97556,0.78,housenumber,7 bis Rue des Caves 37120 Razines,37191_0070_00007_bis,G,7 BIS RUE DES CAVES,
424876282,00049,42487628200049,O,2017-11-25,,,,2021-02-23T11:47:11,true,1,,7,B,RUE,DES CAVES,37120,RAZINES,,,37191,,,,,,,,,,,,,,,,,,,2017-11-25,A,,,,,01.11Z,NAFRev2,N,0.378108,46.97556,0.78,housenumber,7 bis Rue des Caves 37120 Razines,37191_0070_00007_bis,G,7 BIS RUE DES CAVES,
428733620,00028,42873362000028,O,2002-04-08,NN,,,,true,4,,,,LD,LE FOUGEROY,37120,RAZINES,,,37191,,,,,,,,,,,,,,,,,,,2003-10-31,F,,,,,74.8K,NAFRev1,N,0.365091,46.983654,0.7,street,Le Fougeray 37120 Razines,37191_boqzj7,G,LE FOUGERAY,
429426125,00010,42942612500010,O,1999-01-01,NN,,,,true,1,,,,,LA LOGE,37120,RAZINES,,,37191,,,,,,,,,,,,,,,,,,,2001-12-31,F,,,,,01.1A,NAF1993,N,0.361574,46.971494,0.93,street,La Loge 37120 Razines,37191_zh6wbn,G,LA LOGE,
430881417,00017,43088141700017,O,1972-07-01,NN,,,2016-01-12T00:22:24,true,3,,,,,,37120,RAZINES,,,37191,,,,,,,,,,,,,,,,,,,2008-01-01,A,,,,,68.32A,NAFRev2,N,,,0,,,,,,
431698083,00018,43169808300018,O,2000-05-01,NN,,,,true,1,,8,,RUE,DES CAVES,37120,RAZINES,,,37191,,,,,,,,,,,,,,,,,,,2001-12-31,F,,,,,01.1A,NAF1993,N,0.378697,46.975644,0.93,housenumber,8 Rue des Caves 37120 Razines,37191_0070_00008,G,8 RUE DES CAVES,
432327351,00016,43232735100016,O,2000-05-06,NN,,,2008-01-04T18:34:13,true,3,,,,,LA PRUNELIERE,37120,RAZINES,,,37191,,,,,,,,,,,,,,,,,,,2008-01-01,A,,,,,55.20Z,NAFRev2,N,0.406061,46.970034,0.93,street,La Prunelière 37120 Razines,37191_nltolm,G,LA PRUNELIERE,
434624425,00022,43462442500022,O,2002-06-25,NN,,4776ZP,2021-02-23T13:16:34,true,4,,,,,LA LOGE,37120,RAZINES,,,37191,,,,,,,,,,,,,,,,,,,2008-01-01,A,JARDI LOGE PEPINIERE,,,,81.30Z,NAFRev2,O,0.361574,46.971494,0.93,street,La Loge 37120 Razines,37191_zh6wbn,G,LA LOGE,
434655528,00017,43465552800017,O,1998-01-01,NN,,,,true,3,,,,,COCHEREAU,37120,RAZINES,,,37191,,,,,,,,,,,,,,,,,,,2003-08-31,F,,,,,70.2A,NAFRev1,N,0.373535,46.972276,0.91,street,Lieu Dit Cochereau 37120 Razines,37191_3gfhnt,G,LIEU DIT COCHEREAU,
434655767,00011,43465576700011,O,1999-01-01,NN,,,,true,3,,,,,CHARGE,37120,RAZINES,,,37191,,,,,,,,,,,,,,,,,,,2003-12-31,F,,,,,55.2E,NAFRev1,N,0.398081,46.970107,0.93,street,Chargé 37120 Razines,37191_tf3ltt,G,CHARGE,
438022592,00010,43802259200010,O,2001-06-06,NN,,,2020-10-18T03:37:56,true,4,,,,,LE PONT,37120,RAZINES,,,37191,,,,,,,,,,,,,,,,,,,2020-09-29,F,,,,,47.51Z,NAFRev2,N,0.37467,46.982948,0.93,street,Le Pont 37120 Razines,37191_7ozpku,G,LE PONT,
439672536,00018,43967253600018,O,2000-01-01,NN,,,,true,3,,9,,RUE,DES CAVES,37120,RAZINES,,,37191,,,,,,,,,,,,,,,,,,,2003-11-07,F,,,,,02.0B,NAFRev1,N,0.379863,46.976081,0.93,housenumber,9 Rue des Caves 37120 Razines,37191_0070_00009,G,9 RUE DES CAVES,
442156170,00015,44215617000015,O,2002-05-01,NN,,,2008-01-05T21:13:26,true,3,CHATEAU DE MILLY,,,,MILLY,37120,RAZINES,,,37191,,,,,,,,,,,,,,,,,,,2008-01-01,A,,,,,68.20B,NAFRev2,N,0.393998,46.958044,0.93,street,Milly 37120 Razines,37191_r2l1mh,G,MILLY,
442361382,00025,44236138200025,O,2002-06-03,,,,2006-11-25T17:57:22,false,3,,,,,CHATEAU DE MILLY,37120,RAZINES,,,37191,,,,,,,,,,,,,,,,,,,2004-05-31,F,,,,,22.1A,NAFRev1,O,2.463778,48.4019059,0.9,poi.castle,Château de Milly-la-Forêt Milly-la-Forêt,https://osm.org/node/4865701882,G,,
443342423,00037,44334242300037,O,2003-01-15,NN,,1512ZC,2018-10-02T16:20:37,false,5,,,,,LES RONDINS,37120,RAZINES,,,37191,,,,,,,,,,,,,,,,,,,2018-09-26,F,SELLERIE FLORENT CHAMPIGNY,,,,15.12Z,NAFRev2,N,0.376222,46.966724,0.76,street,Piece des Rondins 37120 Razines,37191_b078,G,PIECE DES RONDINS,
443539382,00012,44353938200012,O,2002-09-27,,,,2009-04-14T15:13:50,true,5,,,,,CHATEAU DE MILLY,37120,RAZINES,,,37191,,,,,,,,,,,,,,,,,,,2008-01-01,F,,,,,73.11Z,NAFRev2,O,2.463778,48.4019059,0.9,poi.castle,Château de Milly-la-Forêt Milly-la-Forêt,https://osm.org/node/4865701882,G,,
445055270,00026,44505527000026,O,2009-01-01,,,,2013-01-07T10:34:49,false,2,,79,,,MILLY,37120,RAZINES,,,37191,,,,,,,,,,,,,,,,,,,2012-08-01,F,,,,,70.22Z,NAFRev2,N,0.393998,46.958044,0.93,housenumber,79 Milly 37120 Razines,37191_r2l1mh_00079,G,79 MILLY,
448023259,00014,44802325900014,O,2003-03-01,NN,,,2015-09-02T08:58:50,true,3,,,,,LE PETIT PONT,37120,RAZINES,,,37191,,,,,,,,,,,,,,,,,,,2008-01-01,A,,,,,68.20B,NAFRev2,N,5.8714361,45.4323601,0.91,poi,Le Petit Pont Saint-Pierre-d'Entremont,https://osm.org/way/277620612,G,,
448473322,00015,44847332200015,O,2002-05-01,NN,,,2006-10-31T05:08:20,false,3,,7,,RUE,DES ECOLES,37120,RAZINES,,,37191,,,,,,,,,,,,,,,,,,,2005-07-01,F,,,,,92.3A,NAFRev1,N,0.37905,46.974896,0.93,housenumber,7 Rue des Ecoles 37120 Razines,37191_0085_00007,G,7 RUE DES ECOLES,
449993849,00016,44999384900016,O,2003-10-01,NN,,,2006-11-25T18:41:45,true,3,,,,,LES PORTES,37120,RAZINES,,,37191,,,,,,,,,,,,,,,,,,,2004-03-31,F,,,,,74.2A,NAFRev1,N,0.404132,46.970438,0.93,street,Les Portes 37120 Razines,37191_gq90qt,G,LES PORTES,
478918097,00013,47891809700013,O,2001-06-06,NN,,,2009-02-26T03:49:01,true,4,LE PONT,,,,,37120,RAZINES,,,37191,,,,,,,,,,,,,,,,,,,2008-01-01,F,,,,,68.20B,NAFRev2,N,0.37467,46.982948,0.93,street,Le Pont 37120 Razines,37191_7ozpku,D,LE PONT,
479724361,00015,47972436100015,O,2005-01-01,,,,2006-11-01T01:46:07,false,2,,,,LD,LES AULNES,37120,RAZINES,,,37191,,,,,,,,,,,,,,,,,,,2006-09-04,F,,,,,01.4B,NAFRev1,N,0.368334,46.986145,0.93,street,Les Aulnes 37120 Razines,37191_gf7gmi,G,LES AULNES,
481577948,00013,48157794800013,O,2005-04-01,NN,,,2015-06-25T03:37:12,true,4,,2,,AV,DE L'ANCIENNE EGLISE,37120,RAZINES,,,37191,,,,,,,,,,,,,,,,,,,2014-09-17,F,,,,,43.12A,NAFRev2,N,0.368999,46.971723,0.86,housenumber,2 Avenue de l'Ancienne Eglise 37120 Razines,37191_0090_00002,G,2 AVENUE DE L ANCIENNE EGLISE,
490526530,00020,49052653000020,O,2006-06-01,NN,,,2021-02-23T13:56:19,false,3,,,,,CHATEAU DE CHARGE,37120,RAZINES,,,37191,,,,,,,,,,,,,,,,,,,2008-01-01,A,,,,,68.20B,NAFRev2,O,0.39802,46.969852,0.93,street,Chateau de Charge 37120 Razines,37191_csgsvc,G,CHATEAU DE CHARGE,
491381075,00010,49138107500010,O,2006-06-01,03,2018,,2020-08-25T10:36:28,true,5,,,,LD,CHATEAU DE CHARGE,37120,RAZINES,,,37191,,,,,,,,,,,,,,,,,,,2014-05-19,A,,,,,82.99Z,NAFRev2,O,0.39802,46.969852,0.93,street,Chateau de Charge 37120 Razines,37191_csgsvc,G,CHATEAU DE CHARGE,
497816918,00013,49781691800013,O,2007-05-07,,,,2015-07-24T10:23:39,false,3,,11,,RUE,DES CAVES,37120,RAZINES,,,37191,,,,,,,,,,,,,,,,,,,2015-06-23,F,,,,,47.81Z,NAFRev2,N,0.378108,46.97556,0.93,housenumber,11 Rue des Caves 37120 Razines,37191_0070_00011,G,11 RUE DES CAVES,
499233765,00019,49923376500019,O,2007-07-02,,,,2012-09-25T04:03:08,true,3,,,,,CHATEAU DE CHARGE,37120,RAZINES,,,37191,,,,,,,,,,,,,,,,,,,2012-06-30,F,,,,,70.22Z,NAFRev2,N,0.39802,46.969852,0.93,street,Chateau de Charge 37120 Razines,37191_csgsvc,G,CHATEAU DE CHARGE,
504687286,00048,50468728600048,O,2014-03-17,,,,2016-05-22T04:37:03,true,2,,,,,LA LOGE,37120,RAZINES,,,37191,,,,,,,,,,,,,,,,,,,2016-05-09,F,,,,RICHOU BLANDINE,95.29Z,NAFRev2,N,0.361574,46.971494,0.93,street,La Loge 37120 Razines,37191_zh6wbn,G,LA LOGE,
508606480,00012,50860648000012,O,2008-10-01,,,4399CZ,2015-03-18T00:19:36,true,2,,5,,PL,DE LA MAIRIE,37120,RAZINES,,,37191,,,,,,,,,,,,,,,,,,,2009-02-01,F,,,,,43.99C,NAFRev2,N,0.377581,46.975647,0.83,housenumber,5 Place de la Mairie 37120 Razines,37191_0128_00005,G,5 PLACE DE LA MAIRIE,
509514048,00016,50951404800016,O,2008-12-02,,,,2008-12-18T11:34:06,true,1,CHEZ MR BERNARD HERAUD,,,,LE PUITS GUIBAUX,37120,RAZINES,,,37191,,,,,,,,,,,,,,,,,,,2008-12-02,A,,,,,94.99Z,NAFRev2,N,0.365315,46.975238,0.82,street,Le Puits Guibaut 37120 Razines,37191_b100,G,LE PUITS GUIBAUT,
509859443,00038,50985944300038,O,2012-08-17,,,,2013-06-28T19:32:07,true,2,,,,,CHANTEGEAU,37120,RAZINES,,,37191,,,,,,,,,,,,,,,,,,,2013-06-30,F,,,,LE PRINCE,70.21Z,NAFRev2,N,0.402372,46.984717,0.91,street,Lieu Dit Chantegeau 37120 Razines,37191_womml4,G,LIEU DIT CHANTEGEAU,
514049295,00017,51404929500017,O,2009-08-01,,,,2013-03-21T04:04:51,true,2,,,,,CHATEAU DE CHARGE,37120,RAZINES,,,37191,,,,,,,,,,,,,,,,,,,2012-12-31,F,,,,,70.22Z,NAFRev2,N,0.39802,46.969852,0.93,street,Chateau de Charge 37120 Razines,37191_csgsvc,G,CHATEAU DE CHARGE,
517592358,00017,51759235800017,O,2009-09-18,,,,2009-10-21T03:52:45,true,1,,9,,RUE,DES CAVES,37120,RAZINES,,,37191,,,,,,,,,,,,,,,,,,,2009-09-18,A,,,,,47.99A,NAFRev2,N,0.379863,46.976081,0.93,housenumber,9 Rue des Caves 37120 Razines,37191_0070_00009,G,9 RUE DES CAVES,