siren,nic,siret,statutDiffusionEtablissement,dateCreationEtablissement,trancheEffectifsEtablissement,anneeEffectifsEtablissement,activitePrincipaleRegistreMetiersEtablissement,dateDernierTraitementEtablissement,etablissementSiege,nombrePeriodesEtablissement,complementAdresseEtablissement,numeroVoieEtablissement,indiceRepetitionEtablissement,typeVoieEtablissement,libelleVoieEtablissement,codePostalEtablissement,libelleCommuneEtablissement,libelleCommuneEtrangerEtablissement,distributionSpecialeEtablissement,codeCommuneEtablissement,codeCedexEtablissement,libelleCedexEtablissement,codePaysEtrangerEtablissement,libellePaysEtrangerEtablissement,complementAdresse2Etablissement,numeroVoie2Etablissement,indiceRepetition2Etablissement,typeVoie2Etablissement,libelleVoie2Etablissement,codePostal2Etablissement,libelleCommune2Etablissement,libelleCommuneEtranger2Etablissement,distributionSpeciale2Etablissement,codeCommune2Etablissement,codeCedex2Etablissement,libelleCedex2Etablissement,codePaysEtranger2Etablissement,libellePaysEtranger2Etablissement,dateDebut,etatAdministratifEtablissement,enseigne1Etablissement,enseigne2Etablissement,enseigne3Etablissement,denominationUsuelleEtablissement,activitePrincipaleEtablissement,nomenclatureActivitePrincipaleEtablissement,caractereEmployeurEtablissement,longitude,latitude,geo_score,geo_type,geo_adresse,geo_id,geo_ligne,geo_l4,geo_l5
215405432,00018,21540543200018,O,1983-03-01,01,2018,,2020-12-07T10:10:33,true,3,,4,,RUE,HAUTE,54830,VALLOIS,,,54543,,,,,,,,,,,,,,,,,,,2008-01-01,A,MAIRIE,,,,84.11Z,NAFRev2,N,6.548343,48.463083,0.93,housenumber,4 Rue Haute 54830 Vallois,54543_0141_00004,G,4 RUE HAUTE,
215405432,00026,21540543200026,O,1983-12-21,00,2018,,2020-12-07T10:16:15,false,4,,4,,RUE,HAUTE,54830,VALLOIS,,,54543,,,,,,,,,,,,,,,,,,,2008-01-01,A,ECOLE ELEMENTAIRE,,,,85.20Z,NAFRev2,N,6.548343,48.463083,0.93,housenumber,4 Rue Haute 54830 Vallois,54543_0141_00004,G,4 RUE HAUTE,
215405432,00034,21540543200034,O,1997-10-01,NN,,,2019-01-16T15:16:07,false,4,,4,,RUE,HAUTE,54830,VALLOIS,,,54543,,,,,,,,,,,,,,,,,,,2019-01-01,F,SCE ASSAINISSEMENT,,,,37.00Z,NAFRev2,N,6.548343,48.463083,0.93,housenumber,4 Rue Haute 54830 Vallois,54543_0141_00004,G,4 RUE HAUTE,
265401596,00019,26540159600019,O,1992-01-01,NN,,,2020-12-07T10:26:39,true,4,MAIRIE,,,,,54830,VALLOIS,,,54543,,,,,,,,,,,,,,,,,,,2020-07-02,F,CCAS,,,,88.99B,NAFRev2,N,,,0,,,,,,
314884560,00017,31488456000017,O,,NN,,,,true,1,,12,,RUE,BIONZON,54830,VALLOIS,,,54543,,,,,,,,,,,,,,,,,,,1995-07-01,F,,,,,02.0B,NAF1993,N,6.546054,48.462655,0.93,housenumber,12 Rue Bionzon 54830 Vallois,54543_0020_00012,G,12 RUE BIONZON,
320483068,00013,32048306800013,O,,,,,,true,1,,14,,RUE,BASSE,54830,VALLOIS,,,54543,,,,,,,,,,,,,,,,,,,1984-12-25,F,,,,,55.73,NAP,N,6.549756,48.463963,0.74,street,Rue Basse 54830 Vallois,54543_0015,G,RUE BASSE,
320505076,00010,32050507600010,O,1980-12-01,NN,,,2017-05-04T03:03:31,true,5,,12,,RUE,DE LA CROIX,54830,VALLOIS,,,54543,,,,,,,,,,,,,,,,,,,2015-12-31,F,,,,,46.23Z,NAFRev2,O,6.547905,48.462314,0.93,housenumber,12 Rue de la Croix 54830 Vallois,54543_0030_00012,G,12 RUE DE LA CROIX,
320933252,00019,32093325200019,O,1981-01-01,,,,,false,3,,60,,RUE,DE LA CROIX,54830,VALLOIS,,,54543,,,,,,,,,,,,,,,,,,,1998-12-31,F,,,,,15.8C,NAF1993,N,6.548004,48.462752,0.8,street,Rue de la Croix 54830 Vallois,54543_0030,G,RUE DE LA CROIX,
322841685,00017,32284168500017,O,1981-01-01,NN,,,2010-09-10T13:55:50,true,4,,,,,,54830,VALLOIS,,,54543,,,,,,,,,,,,,,,,,,,2009-12-25,F,,,,,68.20B,NAFRev2,N,,,0,,,,,,
333791440,00014,33379144000014,O,,NN,,,,true,1,,2,,RUE,LE BREUIL,54830,VALLOIS,,,54543,,,,,,,,,,,,,,,,,,,1995-05-01,F,,,,,01.2A,NAF1993,N,4.4828932,46.7926051,0.83,poi,Rue du Creusot (Pont) Le Breuil,https://osm.org/way/250190655,G,,
335294559,00034,33529455900034,O,1990-09-01,NN,,,2008-01-04T21:09:32,true,4,,5,,RUE,HAUTE,54830,VALLOIS,,,54543,,,,,,,,,,,,,,,,,,,2008-01-01,A,,,,,46.62Z,NAFRev2,N,6.9177067,49.1973527,0.89,poi,Rue Haute (Pont) Stiring-Wendel,https://osm.org/way/237887769,G,,
339195125,00010,33919512500010,O,1986-11-01,NN,,,2008-11-07T00:58:44,true,3,,4,,RUE,DE LA CROIX,54830,VALLOIS,,,54543,,,,,,,,,,,,,,,,,,,2005-09-30,F,,,,,45.2V,NAFRev1,N,6.54751,48.462801,0.93,housenumber,4 Rue de la Croix 54830 Vallois,54543_0030_00004,G,4 RUE DE LA CROIX,
347631624,00017,34763162400017,O,1988-05-01,NN,,,2008-01-04T22:42:48,true,3,,,,,,54830,VALLOIS,,,54543,,,,,,,,,,,,,,,,,,,2008-01-01,A,,,,,01.42Z,NAFRev2,N,,,0,,,,,,
349079756,00012,34907975600012,O,,,,,,true,1,,,,RUE,LACROIX,54830,VALLOIS,,,54543,,,,,,,,,,,,,,,,,,,1997-02-08,F,,,,,15.9A,NAF1993,N,6.548004,48.462752,0.77,street,Rue de la Croix 54830 Vallois,54543_0030,G,RUE DE LA CROIX,
352074249,00017,35207424900017,O,1989-07-01,NN,,,,false,3,,11,,RUE,BIONZON,54830,VALLOIS,,,54543,,,,,,,,,,,,,,,,,,,1994-10-03,F,,,,,85.1C,NAF1993,N,6.545795,48.462436,0.93,housenumber,11 Rue Bionzon 54830 Vallois,54543_0020_00011,G,11 RUE BIONZON,
353208564,00065,35320856400065,O,2015-01-01,,,2051ZZ,2015-07-10T10:34:03,false,1,,11,,RUE,HAUTE,54830,VALLOIS,,,54543,,,,,,,,,,,,,,,,,,,2015-01-01,A,,,,,93.29Z,NAFRev2,N,6.548434,48.463328,0.93,housenumber,11 Rue Haute 54830 Vallois,54543_0141_00011,G,11 RUE HAUTE,
353379613,00014,35337961300014,O,1990-01-01,NN,,,,true,4,,2,,RTE,DE MATTEXEY,54830,VALLOIS,,,54543,,,,,,,,,,,,,,,,,,,2003-05-31,F,,,,,01.3Z,NAFRev1,N,6.548992,48.460751,0.83,housenumber,2 Route de Mattexey 54830 Vallois,54543_0100_00002,G,2 ROUTE DE MATTEXEY,
353762008,00012,35376200800012,O,,NN,,,,true,1,,,,,,54830,VALLOIS,,,54543,,,,,,,,,,,,,,,,,,,1993-12-31,F,,,,,01.3Z,NAF1993,N,,,0,,,,,,
383927969,00014,38392796900014,O,1991-12-16,NN,,,2019-02-13T03:56:17,true,3,,14,,PL,DE LA RIVIERE,54830,VALLOIS,,,54543,,,,,,,,,,,,,,,,,,,2008-01-01,A,,,,,01.11Z,NAFRev2,N,6.551216,48.463341,0.84,housenumber,14 Place de la Rivière 54830 Vallois,54543_0140_00014,G,14 PLACE DE LA RIVIERE,
383927969,00022,38392796900022,O,2018-07-01,,,,2018-08-08T04:14:53,false,1,,,,LD,LA CROCHELLE,54830,VALLOIS,,,54543,,,,,,,,,,,,,,,,,,,2018-07-01,A,,,,,01.11Z,NAFRev2,N,6.548004,48.462752,0.43,street,Rue de la Croix 54830 Vallois,54543_0030,G,RUE DE LA CROIX,
393589064,00038,39358906400038,O,2008-03-01,NN,,,2021-02-23T11:19:20,true,2,G V MULTIACTIVITES,11,,RUE,BIONZON,54830,VALLOIS,,,54543,,,,,,,,,,,,,,,,,,,2015-06-30,A,,,,,93.12Z,NAFRev2,N,6.545795,48.462436,0.93,housenumber,11 Rue Bionzon 54830 Vallois,54543_0020_00011,G,11 RUE BIONZON,
393640404,00017,39364040400017,O,1970-01-01,NN,,,2007-01-18T09:35:04,true,3,,,,,,54830,VALLOIS,,,54543,,,,,,,,,,,,,,,,,,,1994-03-02,F,,,,,01.3Z,NAF1993,N,,,0,,,,,,
393640644,00018,39364064400018,O,1989-03-01,NN,,,2010-12-01T05:35:11,true,5,,25,,RUE,DE LA CROIX,54830,VALLOIS,,,54543,,,,,,,,,,,,,,,,,,,2010-01-01,A,FAMILLE ITARD DUSSAUCY,,,,01.49Z,NAFRev2,N,6.549039,48.461014,0.93,housenumber,25 Rue de la Croix 54830 Vallois,54543_0030_00025,G,25 RUE DE LA CROIX,
394139166,00018,39413916600018,O,1994-02-01,NN,,,2008-01-04T18:00:30,true,3,,25,,RUE,DE LA CROIX,54830,VALLOIS,,,54543,,,,,,,,,,,,,,,,,,,2008-01-01,A,,,,,01.41Z,NAFRev2,N,6.549039,48.461014,0.93,housenumber,25 Rue de la Croix 54830 Vallois,54543_0030_00025,G,25 RUE DE LA CROIX,
395362221,00016,39536222100016,O,1994-04-23,NN,,,2006-10-28T02:21:52,true,3,,,,RUE,DE MATTEXEY,54830,VALLOIS,,,54543,,,,,,,,,,,,,,,,,,,2005-12-02,F,,,,,01.2A,NAFRev1,N,6.54912,48.460596,0.76,street,Route de Mattexey 54830 Vallois,54543_0100,G,ROUTE DE MATTEXEY,
400492161,00015,40049216100015,O,1995-03-01,NN,,,2015-06-23T03:36:24,true,4,,14,,PL,DE LA RIVIERE,54830,VALLOIS,,,54543,,,,,,,,,,,,,,,,,,,2015-03-31,F,,,,,68.20B,NAFRev2,N,6.551216,48.463341,0.84,housenumber,14 Place de la Rivière 54830 Vallois,54543_0140_00014,G,14 PLACE DE LA RIVIERE,
401423629,00013,40142362900013,O,1995-05-01,NN,,,2017-03-20T11:20:24,true,5,,2,,RUE,LE BREUIL,54830,VALLOIS,,,54543,,,,,,,,,,,,,,,,,,,2016-12-31,F,,,,,68.20B,NAFRev2,N,4.4828932,46.7926051,0.83,poi,Rue du Creusot (Pont) Le Breuil,https://osm.org/way/250190655,G,,
403616980,00013,40361698000013,O,1995-11-01,NN,,,2006-10-28T03:16:09,true,3,,24,,RUE,DE LA CROIX,54830,VALLOIS,,,54543,,,,,,,,,,,,,,,,,,,2005-10-31,F,,,,,70.2B,NAFRev1,N,6.548566,48.461499,0.93,housenumber,24 Rue de la Croix 54830 Vallois,54543_0030_00024,G,24 RUE DE LA CROIX,
403622418,00016,40362241800016,O,1995-11-01,NN,,,2006-10-28T03:16:11,true,3,,8,,RUE,DE LA JUS,54830,VALLOIS,,,54543,,,,,,,,,,,,,,,,,,,2005-10-31,F,,,,,70.2B,NAFRev1,N,6.548795,48.462776,0.78,housenumber,8 Rue la Jus 54830 Vallois,54543_0080_00008,G,8 RUE LA JUS,
403877764,00015,40387776400015,O,1996-02-15,NN,,,,true,1,,11,,RUE,BASSE,54830,VALLOIS,,,54543,,,,,,,,,,,,,,,,,,,1999-11-17,F,,,,,51.1R,NAF1993,N,6.550872,48.464046,0.93,housenumber,11 Rue Basse 54830 Vallois,54543_0015_00011,G,11 RUE BASSE,
418813093,00014,41881309300014,O,1998-03-05,NN,,,2017-05-04T06:39:00,false,5,,22,,RUE,LA JUS,54830,VALLOIS,,,54543,,,,,,,,,,,,,,,,,,,2015-08-03,F,,,,,90.01Z,NAFRev2,O,6.549643,48.463322,0.93,housenumber,22 Rue la Jus 54830 Vallois,54543_0080_00022,G,22 RUE LA JUS,
428289623,00012,42828962300012,O,1999-07-01,NN,,,2006-11-25T16:42:43,false,5,,2,,RUE,DE LA JUS,54830,VALLOIS,,,54543,,,,,,,,,,,,,,,,,,,2003-12-25,F,,,,,92.3A,NAFRev1,O,6.54818,48.462584,0.78,housenumber,2 Rue la Jus 54830 Vallois,54543_0080_00002,G,2 RUE LA JUS,
429818271,00018,42981827100018,O,2000-03-09,NN,,,2017-04-20T03:54:16,true,4,,11,,RUE,HAUTE,54830,VALLOIS,,,54543,,,,,,,,,,,,,,,,,,,2011-02-11,F,,,,,47.78C,NAFRev2,O,6.548434,48.463328,0.93,housenumber,11 Rue Haute 54830 Vallois,54543_0141_00011,G,11 RUE HAUTE,
430005306,00013,43000530600013,O,1990-01-01,NN,,,2008-01-05T01:46:56,true,3,,,,,LE VILLAGE,54830,VALLOIS,,,54543,,,,,,,,,,,,,,,,,,,2008-01-01,A,,,,,68.20B,NAFRev2,N,2.2950702,48.9311749,0.9,poi.bar,bar le village Gennevilliers,https://osm.org/node/3287755128,G,,
430116467,00027,43011646700027,O,2013-02-01,,,,2018-11-14T10:17:48,true,2,,11,,RUE,HAUTE,54830,VALLOIS,,,54543,,,,,,,,,,,,,,,,,,,2018-11-01,F,,,,,93.29Z,NAFRev2,N,6.548434,48.463328,0.93,housenumber,11 Rue Haute 54830 Vallois,54543_0141_00011,G,11 RUE HAUTE,
439981184,00013,43998118400013,O,2001-12-01,NN,,,2008-01-04T20:46:43,true,3,,2,,RUE,GERBEVILLER,54830,VALLOIS,,,54543,,,,,,,,,,,,,,,,,,,2008-01-01,A,,,,,77.29Z,NAFRev2,N,6.548833,48.464299,0.81,street,Rue de Gerbéviller 54830 Vallois,54543_0055,G,RUE DE GERBEVILLER,
439981499,00015,43998149900015,O,2001-12-01,NN,,,2008-01-04T20:46:43,true,3,,2,,RUE,GERBEVILLER,54830,VALLOIS,,,54543,,,,,,,,,,,,,,,,,,,2008-01-01,A,,,,,77.29Z,NAFRev2,N,6.548833,48.464299,0.81,street,Rue de Gerbéviller 54830 Vallois,54543_0055,G,RUE DE GERBEVILLER,
440731701,00015,44073170100015,O,2001-07-01,NN,,,2011-12-16T03:59:50,true,4,,14,,PL,DE LA RIVIERE,54830,VALLOIS,,,54543,,,,,,,,,,,,,,,,,,,2010-12-31,F,,,,,68.20B,NAFRev2,N,6.551216,48.463341,0.84,housenumber,14 Place de la Rivière 54830 Vallois,54543_0140_00014,G,14 PLACE DE LA RIVIERE,
442074266,00010,44207426600010,O,2002-04-11,NN,,,2008-01-04T21:33:54,true,3,MASSOT SERGE,2,,RUE,DE GERBEVILLER,54830,VALLOIS,,,54543,,,,,,,,,,,,,,,,,,,2008-01-01,A,,,,,68.20A,NAFRev2,N,6.548833,48.464299,0.85,street,Rue de Gerbéviller 54830 Vallois,54543_0055,G,RUE DE GERBEVILLER,
444187157,00011,44418715700011,O,2002-11-18,NN,,,2012-05-05T08:45:52,true,7,,3,,RUE,HAUTE,54830,VALLOIS,,,54543,,,,,,,,,,,,,,,,,,,2010-12-31,F,,,,,46.19B,NAFRev2,O,6.547521,48.46304,0.93,housenumber,3 Rue Haute 54830 Vallois,54543_0141_00003,G,3 RUE HAUTE,
445177801,00013,44517780100013,O,2003-02-04,NN,,,2008-01-04T22:47:19,true,3,,11,,RUE,HAUTE,54830,VALLOIS,,,54543,,,,,,,,,,,,,,,,,,,2008-01-01,A,,,,,68.20A,NAFRev2,N,6.548434,48.463328,0.93,housenumber,11 Rue Haute 54830 Vallois,54543_0141_00011,G,11 RUE HAUTE,
448867028,00012,44886702800012,O,2003-05-31,NN,,,2020-07-29T03:49:27,true,5,,2,,RTE,DE MATTEXEY,54830,VALLOIS,,,54543,,,,,,,,,,,,,,,,,,,2020-06-30,F,,,,,68.20B,NAFRev2,N,6.548992,48.460751,0.83,housenumber,2 Route de Mattexey 54830 Vallois,54543_0100_00002,G,2 ROUTE DE MATTEXEY,
449486679,00011,44948667900011,O,2003-05-30,NN,,,2008-01-05T21:27:28,true,3,,12,,PL,DE LA RIVIERE,54830,VALLOIS,,,54543,,,,,,,,,,,,,,,,,,,2008-01-01,A,,,,,68.20B,NAFRev2,N,6.550779,48.46328,0.84,housenumber,12 Place de la Rivière 54830 Vallois,54543_0140_00012,G,12 PLACE DE LA RIVIERE,
482405214,00016,48240521400016,O,2005-03-25,,,,2017-11-30T09:42:15,false,3,,11,,RUE,BASSE,54830,VALLOIS,,,54543,,,,,,,,,,,,,,,,,,,2017-10-21,F,,,,,68.20B,NAFRev2,N,6.550872,48.464046,0.93,housenumber,11 Rue Basse 54830 Vallois,54543_0015_00011,G,11 RUE BASSE,
482427275,00011,48242727500011,O,2005-05-19,,,,2017-11-30T09:52:14,false,3,,11,,RUE,BASSE,54830,VALLOIS,,,54543,,,,,,,,,,,,,,,,,,,2017-10-21,F,,,,,68.20B,NAFRev2,N,6.550872,48.464046,0.93,housenumber,11 Rue Basse 54830 Vallois,54543_0015_00011,G,11 RUE BASSE,
489673103,00011,48967310300011,O,2006-01-30,NN,,,2016-04-11T11:24:42,false,3,,2,,RTE,DE MATTEXEY,54830,VALLOIS,,,54543,,,,,,,,,,,,,,,,,,,2016-04-01,F,,,,,01.50Z,NAFRev2,N,6.548992,48.460751,0.83,housenumber,2 Route de Mattexey 54830 Vallois,54543_0100_00002,G,2 ROUTE DE MATTEXEY,
489673103,00029,48967310300029,O,2016-04-01,,,,2021-02-23T13:54:59,true,1,,28,B,RUE,DE LA CROIX,54830,VALLOIS,,,54543,,,,,,,,,,,,,,,,,,,2016-04-01,A,,,,,01.50Z,NAFRev2,N,6.54875,48.461241,0.8,housenumber,28 bis Rue de la Croix 54830 Vallois,54543_0030_00028_bis,G,28 BIS RUE DE LA CROIX,
497757831,00019,49775783100019,O,2007-05-02,,,,2008-02-01T04:19:03,true,3,% MME VIN-KLEITZ VANESSA,4,,RUE,DE LA CROIX,54830,VALLOIS,,,54543,,,,,,,,,,,,,,,,,,,2008-01-30,F,,,,,46.19B,NAFRev2,N,6.54751,48.462801,0.93,housenumber,4 Rue de la Croix 54830 Vallois,54543_0030_00004,G,4 RUE DE LA CROIX,
499133494,00017,49913349400017,O,2007-06-20,,,,2008-01-05T01:12:25,true,2,,24,,RUE,DE LA CROIX,54830,VALLOIS,,,54543,,,,,,,,,,,,,,,,,,,2008-01-01,A,,,,,68.20B,NAFRev2,N,6.548566,48.461499,0.93,housenumber,24 Rue de la Croix 54830 Vallois,54543_0030_00024,G,24 RUE DE LA CROIX,
504464298,00026,50446429800026,O,2010-08-13,,,,2019-11-19T12:27:20,false,2,,4,,RUE,DE GERBEVILLER,54830,VALLOIS,,,54543,,,,,,,,,,,,,,,,,,,2012-08-13,F,,,,,38.31Z,NAFRev2,N,6.54911,48.464261,0.93,housenumber,4 Rue de Gerbéviller 54830 Vallois,54543_0055_00004,G,4 RUE DE GERBEVILLER,
513838672,00014,51383867200014,O,2009-08-01,,,,2015-02-18T09:08:30,true,2,,9,,RUE,LA JUS,54830,VALLOIS,,,54543,,,,,,,,,,,,,,,,,,,2014-12-15,F,,,,,47.99B,NAFRev2,N,6.549044,48.463134,0.93,housenumber,9 Rue la Jus 54830 Vallois,54543_0080_00009,G,9 RUE LA JUS,
518325956,00010,51832595600010,O,2009-11-21,,,,2016-02-24T08:48:17,true,4,,2,,RUE,MATTEXEY,54830,VALLOIS,,,54543,,,,,,,,,,,,,,,,,,,2016-02-15,F,,,,,82.30Z,NAFRev2,N,6.548992,48.460751,0.75,housenumber,2 Route de Mattexey 54830 Vallois,54543_0100_00002,G,2 ROUTE DE MATTEXEY,
518930193,00017,51893019300017,O,2010-01-01,,,,2014-03-28T08:38:03,true,2,,6,,RUE,MATTEXEY,54830,VALLOIS,,,54543,,,,,,,,,,,,,,,,,,,2014-02-28,F,,,,,90.01Z,NAFRev2,N,6.54876,48.460424,0.75,housenumber,6 Route de Mattexey 54830 Vallois,54543_0100_00006,G,6 ROUTE DE MATTEXEY,
527980791,00018,52798079100018,O,2010-11-15,,,,2013-10-01T03:36:01,true,2,,12,,PL,DE LA RIVIERE,54830,VALLOIS,,,54543,,,,,,,,,,,,,,,,,,,2011-11-16,F,,,,,93.29Z,NAFRev2,N,6.550779,48.46328,0.84,housenumber,12 Place de la Rivière 54830 Vallois,54543_0140_00012,G,12 PLACE DE LA RIVIERE,
528334535,00010,52833453500010,O,2010-11-02,,,,2015-05-14T08:44:26,false,3,,1,,RUE,DE LA CROIX,54830,VALLOIS,,,54543,,,,,,,,,,,,,,,,,,,2013-10-02,F,,,,,90.01Z,NAFRev2,O,6.548004,48.462752,0.93,housenumber,1 Rue de la Croix 54830 Vallois,54543_0030_00001,G,1 RUE DE LA CROIX,
528673551,00016,52867355100016,O,2010-01-01,,,,2010-12-01T05:35:09,true,1,,30,,RUE,DE LA CROIX,54830,VALLOIS,,,54543,,,,,,,,,,,,,,,,,,,2010-01-01,A,FAMILLE ITARD DUSSAUCY,,,,01.49Z,NAFRev2,N,6.548787,48.461141,0.93,housenumber,30 Rue de la Croix 54830 Vallois,54543_0030_00030,G,30 RUE DE LA CROIX,
528673569,00018,52867356900018,O,2010-01-01,,,,2010-12-01T05:35:10,true,1,,25,,RUE,DE LA CROIX,54830,VALLOIS,,,54543,,,,,,,,,,,,,,,,,,,2010-01-01,A,FAMILLE ITARD DUSSAUCY,,,,01.49Z,NAFRev2,N,6.549039,48.461014,0.93,housenumber,25 Rue de la Croix 54830 Vallois,54543_0030_00025,G,25 RUE DE LA CROIX,
529493272,00015,52949327200015,O,2011-01-01,,,,2013-03-26T13:30:27,true,1,,12,,RUE,DE LA CROIX,54830,VALLOIS,,,54543,,,,,,,,,,,,,,,,,,,2011-01-01,A,,,,,01.49Z,NAFRev2,N,6.547905,48.462314,0.93,housenumber,12 Rue de la Croix 54830 Vallois,54543_0030_00012,G,12 RUE DE LA CROIX,
538026576,00016,53802657600016,O,2009-03-11,,,,2011-11-22T16:06:40,true,1,MAIRIE,4,,RUE,HAUTE,54830,VALLOIS,,,54543,,,,,,,,,,,,,,,,,,,2009-03-11,A,,,,,94.99Z,NAFRev2,N,6.548343,48.463083,0.93,housenumber,4 Rue Haute 54830 Vallois,54543_0141_00004,G,4 RUE HAUTE,
749963286,00010,74996328600010,O,2012-01-31,,,,2021-02-23T16:04:21,true,1,,17,,RUE,DE LA CROIX,54830,VALLOIS,,,54543,,,,,,,,,,,,,,,,,,,2012-01-31,A,,,,,01.42Z,NAFRev2,N,6.548525,48.461852,0.93,housenumber,17 Rue de la Croix 54830 Vallois,54543_0030_00017,G,17 RUE DE LA CROIX,
771700671,00015,77170067100015,O,,NN,,,,true,1,,,,,,54830,VALLOIS,,,54543,,,,,,,,,,,,,,,,,,,1987-06-30,F,,,,,81.21,NAP,N,,,0,,,,,,
783355696,00064,78335569600064,O,1985-03-07,,,,,true,1,,5,,RUE,BASSE,54830,VALLOIS,,,54543,,,,,,,,,,,,,,,,,,,1997-05-09,F,,,,,45.4A,NAF1993,N,6.550245,48.463856,0.93,housenumber,5 Rue Basse 54830 Vallois,54543_0015_00005,G,5 RUE BASSE,
783368251,00014,78336825100014,O,,NN,,,,true,1,,,,,,54830,VALLOIS,,,54543,,,,,,,,,,,,,,,,,,,1988-12-31,F,,,,,41.02,NAP,N,,,0,,,,,,
790281364,00014,79028136400014,O,2012-12-12,,,,2013-01-08T10:17:52,true,1,,11,,RUE,HAUTE,54830,VALLOIS,,,54543,,,,,,,,,,,,,,,,,,,2012-12-12,A,,,,,68.20B,NAFRev2,N,6.548434,48.463328,0.93,housenumber,11 Rue Haute 54830 Vallois,54543_0141_00011,G,11 RUE HAUTE,
798133757,00012,79813375700012,O,2013-10-11,,,,2019-12-11T04:11:29,true,1,,10,,RUE,DE LA CROIX,54830,VALLOIS,,,54543,,,,,,,,,,,,,,,,,,,2013-10-11,A,,,,,68.20B,NAFRev2,N,6.547724,48.462545,0.93,housenumber,10 Rue de la Croix 54830 Vallois,54543_0030_00010,G,10 RUE DE LA CROIX,
803739929,00013,80373992900013,O,2014-07-11,,,,2018-04-06T18:02:02,true,1,,24,,RUE,DE LA CROIX,54830,VALLOIS,,,54543,,,,,,,,,,,,,,,,,,,2014-07-11,A,,,,,68.20B,NAFRev2,N,6.548566,48.461499,0.93,housenumber,24 Rue de la Croix 54830 Vallois,54543_0030_00024,G,24 RUE DE LA CROIX,
839228947,00017,83922894700017,O,2018-04-20,01,2018,,2020-08-25T11:41:18,true,1,,24,,RUE,DE LA CROIX,54830,VALLOIS,,,54543,,,,,,,,,,,,,,,,,,,2018-04-20,A,,,,,01.11Z,NAFRev2,N,6.548566,48.461499,0.93,housenumber,24 Rue de la Croix 54830 Vallois,54543_0030_00024,G,24 RUE DE LA CROIX,
842048944,00016,84204894400016,O,2018-06-14,,,,2018-09-04T03:41:56,true,1,,24,,RUE,DE LA CROIX,54830,VALLOIS,,,54543,,,,,,,,,,,,,,,,,,,2018-06-14,A,,,,,68.20B,NAFRev2,N,6.548566,48.461499,0.93,housenumber,24 Rue de la Croix 54830 Vallois,54543_0030_00024,G,24 RUE DE LA CROIX,
