siren,nic,siret,statutDiffusionEtablissement,dateCreationEtablissement,trancheEffectifsEtablissement,anneeEffectifsEtablissement,activitePrincipaleRegistreMetiersEtablissement,dateDernierTraitementEtablissement,etablissementSiege,nombrePeriodesEtablissement,complementAdresseEtablissement,numeroVoieEtablissement,indiceRepetitionEtablissement,typeVoieEtablissement,libelleVoieEtablissement,codePostalEtablissement,libelleCommuneEtablissement,libelleCommuneEtrangerEtablissement,distributionSpecialeEtablissement,codeCommuneEtablissement,codeCedexEtablissement,libelleCedexEtablissement,codePaysEtrangerEtablissement,libellePaysEtrangerEtablissement,complementAdresse2Etablissement,numeroVoie2Etablissement,indiceRepetition2Etablissement,typeVoie2Etablissement,libelleVoie2Etablissement,codePostal2Etablissement,libelleCommune2Etablissement,libelleCommuneEtranger2Etablissement,distributionSpeciale2Etablissement,codeCommune2Etablissement,codeCedex2Etablissement,libelleCedex2Etablissement,codePaysEtranger2Etablissement,libellePaysEtranger2Etablissement,dateDebut,etatAdministratifEtablissement,enseigne1Etablissement,enseigne2Etablissement,enseigne3Etablissement,denominationUsuelleEtablissement,activitePrincipaleEtablissement,nomenclatureActivitePrincipaleEtablissement,caractereEmployeurEtablissement,longitude,latitude,geo_score,geo_type,geo_adresse,geo_id,geo_ligne,geo_l4,geo_l5
215903691,00016,21590369100016,O,1983-03-01,21,2018,,2020-08-25T10:18:04,true,4,,5,,RUE,JEAN JAURES,59233,MAING,,,59369,,,,,,,,,,,,,,,,,,,2008-01-01,A,MAIRIE,,,,84.11Z,NAFRev2,O,3.479282,50.306604,0.95,housenumber,5 Rue Jean Jaures 59233 Maing,59369_0380_00005,G,5 RUE JEAN JAURES,
215903691,00024,21590369100024,O,1983-12-21,12,2018,,2020-08-25T10:18:04,false,3,,84,,RUE,JEAN JAURES,59233,MAING,,,59369,,,,,,,,,,,,,,,,,,,2008-01-01,A,ECOLE MATERNELLE DU CENTRE,,,,85.10Z,NAFRev2,N,3.483185,50.307836,0.95,housenumber,84 Rue Jean Jaures 59233 Maing,59369_0380_00084,G,84 RUE JEAN JAURES,
215903691,00032,21590369100032,O,1983-12-21,12,2018,,2020-08-25T10:18:04,false,3,,90,,RUE,JEAN JAURES,59233,MAING,,,59369,,,,,,,,,,,,,,,,,,,2008-01-01,A,ECOLE PRIMAIRE VANDERBECQ,,,,85.20Z,NAFRev2,N,3.483301,50.307855,0.95,housenumber,90 Rue Jean Jaures 59233 Maing,59369_0380_00090,G,90 RUE JEAN JAURES,
215903691,00040,21590369100040,O,1983-12-21,NN,,,2017-05-04T01:27:34,false,3,,,,AV,DES PATURETTES,59233,MAING,,,59369,,,,,,,,,,,,,,,,,,,2008-01-01,A,ECOLE MATERNELLE AIR & LUMIERE,,,,85.10Z,NAFRev2,N,3.490203,50.317261,0.83,street,Avenue des Paturettes 59233 Maing,59369_0480,G,AVENUE DES PATURETTES,
215903691,00065,21590369100065,O,1995-12-25,NN,,,2008-01-04T18:37:37,false,2,MAIRIE,,,RUE,JEAN JAURES,59233,MAING,,,59369,,,,,,,,,,,,,,,,,,,2008-01-01,A,SERVICE ASSAINISSEMENT,,,,37.00Z,NAFRev2,N,3.479313,50.306438,0.95,street,Rue Jean Jaures 59233 Maing,59369_0380,G,RUE JEAN JAURES,
215903691,00073,21590369100073,O,1998-01-01,NN,,,2013-10-05T12:09:48,false,4,MAIRIE,5,,RUE,JEAN JAURES,59233,MAING,,,59369,,,,,,,,,,,,,,,,,,,2012-12-25,F,SERVICE EXTERIEUR DES POMPES FUNEBRES,,,,96.03Z,NAFRev2,N,3.479282,50.306604,0.95,housenumber,5 Rue Jean Jaures 59233 Maing,59369_0380_00005,G,5 RUE JEAN JAURES,
245901160,00110,24590116000110,O,2003-01-01,01,2018,,2020-08-25T10:20:06,false,3,LIEU DIT  CHAMPS DE CAUMONT,,,RTE,DEPARTEMENTALE 958,59233,MAING,,,59369,,,,,,,,,,,,,,,,,,,2009-02-08,A,DECHETTERIE  DE MAING,,,,38.11Z,NAFRev2,O,0.965619,46.6962033,0.77,poi.track,Chemin rural de la Route Départementale 950 à Preuilly Preuilly-la-Ville,https://osm.org/way/161782744,G,,
265903690,00013,26590369000013,O,1983-03-01,03,2018,,2020-08-25T10:21:10,true,3,MAIRIE,5,,RUE,JEAN JAURES,59233,MAING,,,59369,,,,,,,,,,,,,,,,,,,2008-01-01,A,CCAS,,,,88.99B,NAFRev2,N,3.479282,50.306604,0.95,housenumber,5 Rue Jean Jaures 59233 Maing,59369_0380_00005,G,5 RUE JEAN JAURES,
295902514,00021,29590251400021,O,2001-11-08,NN,,,2018-09-29T12:08:58,true,4,MAIRIE,5,,RUE,JEAN JAURES,59233,MAING,,,59369,,,,,,,,,,,,,,,,,,,2008-01-01,A,,,,,42.99Z,NAFRev2,O,3.479282,50.306604,0.95,housenumber,5 Rue Jean Jaures 59233 Maing,59369_0380_00005,G,5 RUE JEAN JAURES,
300928595,00028,30092859500028,O,,,,,,true,1,,2,,RUE,DES FRERES RUCART,59233,MAING,,,59369,,,,,,,,,,,,,,,,,,,1988-09-14,F,,,,,62.11,NAP,N,3.472515,50.307126,0.85,housenumber,2 Residence des Freres Rucart 59233 Maing,59369_ke2xy4_00002,G,2 RESIDENCE DES FRERES RUCART,
301065108,00021,30106510800021,O,1980-04-30,NN,,,2008-01-04T19:13:11,true,3,,144,,RUE,PAUL VAILLANT COUTURIER,59233,MAING,,,59369,,,,,,,,,,,,,,,,,,,2008-01-01,A,,,,,66.22Z,NAFRev2,N,3.48232,50.317677,0.95,housenumber,144 Rue Paul Vaillant-couturier 59233 Maing,59369_0760_00144,G,144 RUE PAUL VAILLANT COUTURIER,
301583183,00019,30158318300019,O,,NN,,,,true,1,,3,,RUE,RUCART,59233,MAING,,,59369,,,,,,,,,,,,,,,,,,,,F,,,,,01.00,NAP,N,3.477451,50.306311,0.86,housenumber,3 Rue Leon Rucart 59233 Maing,59369_0420_00003,G,3 RUE LEON RUCART,
302902101,00013,30290210100013,O,,,,,,true,1,,11,,RUE,DE LA CANNOIRE,59233,MAING,,,59369,,,,,,,,,,,,,,,,,,,1984-12-25,F,,,,,,,N,3.484785,50.30738,0.78,housenumber,11 Rue de la Carroire 59233 Maing,59369_0160_00011,G,11 RUE DE LA CARROIRE,
302902119,00015,30290211900015,O,1900-01-01,NN,,,2008-01-05T19:18:13,true,3,,,,,LE VILLAGE,59233,MAING,,,59369,,,,,,,,,,,,,,,,,,,2008-01-01,A,,,,,68.20B,NAFRev2,N,2.2950702,48.9311749,0.9,poi.bar,bar le village Gennevilliers,https://osm.org/node/3287755128,G,,
303534994,00031,30353499400031,O,2001-02-12,NN,,,2019-05-02T14:50:20,true,4,RESIDENCE JEANNE DE VALOIS,,,RUE,HENRI BANTEGNIES,59233,MAING,,,59369,,,,,,,,,,,,,,,,,,,2015-10-16,F,,,,,68.20A,NAFRev2,N,3.49171,50.31137,0.87,street,Rue Henri Bantegnie 59233 Maing,59369_0335,G,RUE HENRI BANTEGNIE,
303688881,00018,30368888100018,O,1975-01-01,NN,,,,true,1,,36,,RUE,HENRI BANTEGNIES,59233,MAING,,,59369,,,,,,,,,,,,,,,,,,,2000-12-31,F,,,,,51.3A,NAF1993,O,3.491732,50.311539,0.88,housenumber,36 Rue Henri Bantegnie 59233 Maing,59369_0335_00036,G,36 RUE HENRI BANTEGNIE,
303853998,00027,30385399800027,O,2001-02-12,NN,,,2016-10-28T10:21:44,false,3,RESIDENCE JEANNE DE VALOIS,,,RUE,HENRI BANTEGNIES,59233,MAING,,,59369,,,,,,,,,,,,,,,,,,,2008-01-01,A,,,,,68.20A,NAFRev2,N,3.49171,50.31137,0.87,street,Rue Henri Bantegnie 59233 Maing,59369_0335,G,RUE HENRI BANTEGNIE,
303853998,00035,30385399800035,O,2016-01-01,,,,2016-10-28T10:21:44,true,1,RESIDENCE JEANNE DE VALOIS (LOT 69),59,,RUE,HENRI BANTEGNIES,59233,MAING,,,59369,,,,,,,,,,,,,,,,,,,2016-01-01,A,,,,,68.20A,NAFRev2,N,3.49171,50.31137,0.77,street,Rue Henri Bantegnie 59233 Maing,59369_0335,G,RUE HENRI BANTEGNIE,
305042533,00060,30504253300060,O,2001-06-01,NN,,,2016-09-02T17:54:58,true,3,RESIDENCE JEANNNE DE VALOI,,,RUE,HENRI BANTEGNIES,59233,MAING,,,59369,,,,,,,,,,,,,,,,,,,2008-01-01,A,,,,,68.20A,NAFRev2,N,3.49171,50.31137,0.87,street,Rue Henri Bantegnie 59233 Maing,59369_0335,G,RUE HENRI BANTEGNIE,
305458622,00019,30545862200019,O,,,,,,true,1,,52,,RUE,ALPHONSE DANGREAUX,59233,MAING,,,59369,,,,,,,,,,,,,,,,,,,1985-12-25,F,,,,,62.41,NAP,N,3.487712,50.307361,0.95,housenumber,52 Rue Alphonse Dangreaux 59233 Maing,59369_0040_00052,G,52 RUE ALPHONSE DANGREAUX,
305885071,00020,30588507100020,O,,,,,,true,1,,15,,AV,DES PATURETTES,59233,MAING,,,59369,,,,,,,,,,,,,,,,,,,1984-12-25,F,,,,,69.12,NAP,N,3.489937,50.316791,0.85,housenumber,15 Avenue des Paturettes 59233 Maing,59369_0480_00015,G,15 AVENUE DES PATURETTES,
305887960,00014,30588796000014,O,,NN,,,,true,1,,20,,RUE,DE L'ABBE DELBECQUE,59233,MAING,,,59369,,,,,,,,,,,,,,,,,,,1993-09-15,F,,,,,50.1Z,NAF1993,N,3.478411,50.304404,0.95,housenumber,20 Rue de l'Abbe Delbecque 59233 Maing,59369_0020_00020,G,20 RUE DE L ABBE DELBECQUE,
306583840,00013,30658384000013,O,,,,,,true,1,,1,B,RTE,DE MONCHAUX,59233,MAING,,,59369,,,,,,,,,,,,,,,,,,,1997-12-31,F,,,,,93.0N,NAF1993,N,3.516843,50.301949,0.32,street,Rue de Caumont 59233 Maing,59369_0170,G,RUE DE CAUMONT,
306827155,00012,30682715500012,O,1976-01-01,NN,,,2014-07-08T00:13:36,true,4,,41,,RUE,VICTOR HUGO,59233,MAING,,,59369,,,,,,,,,,,,,,,,,,,2013-03-31,F,,,,,43.22A,NAFRev2,N,3.487143,50.309962,0.95,housenumber,41 Rue Victor Hugo 59233 Maing,59369_0780_00041,G,41 RUE VICTOR HUGO,
307307744,00028,30730774400028,O,1900-01-01,NN,,,2011-04-28T00:12:25,false,3,,27,,RUE,PAUL VAILLANT COUTURIER,59233,MAING,,,59369,,,,,,,,,,,,,,,,,,,1992-06-30,F,,,,,45.2A,NAF1993,N,3.483592,50.316492,0.95,housenumber,27 Rue Paul Vaillant-couturier 59233 Maing,59369_0760_00027,G,27 RUE PAUL VAILLANT COUTURIER,
308054998,00015,30805499800015,O,,,,,,true,1,,41,,RUE,VICTOR HUGO,59233,MAING,,,59369,,,,,,,,,,,,,,,,,,,1988-03-31,F,,,,,64.24,NAP,N,3.487143,50.309962,0.95,housenumber,41 Rue Victor Hugo 59233 Maing,59369_0780_00041,G,41 RUE VICTOR HUGO,
309984805,00023,30998480500023,O,,NN,,,,true,1,,18,,RES,SALENGRO,59233,MAING,,,59369,,,,,,,,,,,,,,,,,,,1988-12-25,F,,,,,45.2V,NAF1993,N,3.474105,50.304169,0.82,housenumber,18 Residence Roger Salengro 59233 Maing,59369_3ggvls_00018,G,18 RESIDENCE ROGER SALENGRO,
311019376,00046,31101937600046,O,2001-02-12,NN,,,2017-09-07T09:34:37,true,3,RES JEANNE DE VALOIS,,,RUE,HENRI BANTIGNIES,59233,MAING,,,59369,,,,,,,,,,,,,,,,,,,2008-01-01,A,,,,,66.19A,NAFRev2,N,3.49171,50.31137,0.74,street,Rue Henri Bantegnie 59233 Maing,59369_0335,G,RUE HENRI BANTEGNIE,
311075683,00012,31107568300012,O,1900-01-01,NN,,,2014-09-18T03:52:22,true,4,,68,,RUE,JEAN JAURES,59233,MAING,,,59369,,,,,,,,,,,,,,,,,,,2014-08-14,F,,,,,86.23Z,NAFRev2,N,3.48248,50.307733,0.95,housenumber,68 Rue Jean Jaures 59233 Maing,59369_0380_00068,G,68 RUE JEAN JAURES,
311500045,00019,31150004500019,O,1900-01-01,,,,2013-05-22T09:00:22,false,2,,19,,RUE,PIERRE VANDERBECQ,59233,MAING,,,59369,,,,,,,,,,,,,,,,,,,1984-12-25,F,,,,,77.10,NAP,N,3.486306,50.306075,0.95,housenumber,19 Rue Pierre Vanderbecq 59233 Maing,59369_0560_00019,G,19 RUE PIERRE VANDERBECQ,
311659650,00015,31165965000015,O,,,,,,true,1,,15,B,RUE,DE L ABBE DELBECQUE,59233,MAING,,,59369,,,,,,,,,,,,,,,,,,,1985-12-25,F,,,,,82.06,NAP,N,3.479402,50.30476,0.84,housenumber,15 bis Rue de l'Abbe Delbecque 59233 Maing,59369_0020_00015_bis,G,15 BIS RUE DE L ABBE DELBECQUE,
311987937,00076,31198793700076,O,2001-02-12,NN,,,2018-07-03T03:49:55,true,4,RESIDENCE JEANNE DE VALOIS,,,RUE,HENRI BANTEGNIES,59233,MAING,,,59369,,,,,,,,,,,,,,,,,,,2016-03-24,F,,,,,68.20B,NAFRev2,N,3.49171,50.31137,0.87,street,Rue Henri Bantegnie 59233 Maing,59369_0335,G,RUE HENRI BANTEGNIE,
312511389,00016,31251138900016,O,,NN,,,,true,1,,116,,RUE,JEAN JAURES,59233,MAING,,,59369,,,,,,,,,,,,,,,,,,,1990-03-31,F,,,,,64.42,NAP,N,3.484286,50.308415,0.95,housenumber,116 Rue Jean Jaures 59233 Maing,59369_0380_00116,G,116 RUE JEAN JAURES,
313266314,00043,31326631400043,O,1989-01-09,,,,,false,4,,116,,RUE,JEAN JAURES,59233,MAING,,,59369,,,,,,,,,,,,,,,,,,,1993-12-25,F,R E H,,,,45.2V,NAF1993,N,3.484286,50.308415,0.95,housenumber,116 Rue Jean Jaures 59233 Maing,59369_0380_00116,G,116 RUE JEAN JAURES,
313266314,00068,31326631400068,O,1996-10-01,NN,,,2008-04-25T00:15:05,false,3,,29,A,RUE,DU 11 NOVEMBRE,59233,MAING,,,59369,,,,,,,,,,,,,,,,,,,2006-10-15,F,,,,,92.3A,NAFRev1,N,3.47908,50.307928,0.87,housenumber,29 a Rue du 11 Novembre 59233 Maing,59369_0450_00029_a,G,29 A RUE DU 11 NOVEMBRE,
313266322,00012,31326632200012,O,1978-01-01,NN,,,2013-07-05T03:44:36,true,1,,11,,RUE,JEAN JAURES,59233,MAING,,,59369,,,,,,,,,,,,,,,,,,,1996-03-17,F,,,,,70.2C,NAF1993,N,3.479768,50.306726,0.95,housenumber,11 Rue Jean Jaures 59233 Maing,59369_0380_00011,G,11 RUE JEAN JAURES,
313585432,00021,31358543200021,O,2000-01-02,NN,,,2016-01-20T03:33:28,false,4,,15,B,RUE,DE L ABBE DELBECQUE,59233,MAING,,,59369,,,,,,,,,,,,,,,,,,,2015-12-31,F,,,,,85.53Z,NAFRev2,N,3.479402,50.30476,0.84,housenumber,15 bis Rue de l'Abbe Delbecque 59233 Maing,59369_0020_00015_bis,G,15 BIS RUE DE L ABBE DELBECQUE,
314253592,00039,31425359200039,O,1997-01-01,,,,,true,1,,33,,RUE,DE LA CARROIRE,59233,MAING,,,59369,,,,,,,,,,,,,,,,,,,2000-10-31,F,,,,,70.2A,NAF1993,N,3.486167,50.307051,0.95,housenumber,33 Rue de la Carroire 59233 Maing,59369_0160_00033,G,33 RUE DE LA CARROIRE,
314727991,00015,31472799100015,O,,,,,,true,1,,1,,RUE,VAILLANT COUTURIER,59233,MAING,,,59369,,,,,,,,,,,,,,,,,,,1992-07-01,F,,,,,45.3F,NAF1993,N,3.484341,50.311786,0.9,housenumber,1 Rue Paul Vaillant-couturier 59233 Maing,59369_0760_00001,G,1 RUE PAUL VAILLANT COUTURIER,
314960873,00011,31496087300011,O,1979-01-01,NN,,,,true,1,,619,,RUE,HENRI BANTEGNIES,59233,MAING,,,59369,,,,,,,,,,,,,,,,,,,2000-06-30,F,,,,,52.6E,NAF1993,N,3.494173,50.31659,0.88,housenumber,619 Rue Henri Bantegnie 59233 Maing,59369_0335_00619,G,619 RUE HENRI BANTEGNIE,
316217694,00066,31621769400066,O,2014-03-01,,,4331ZB,2015-10-20T13:19:28,true,2,,2,,RUE,PAUL VAILLANT COUTURIER,59233,MAING,,,59369,,,,,,,,,,,,,,,,,,,2015-10-14,F,,,,,43.31Z,NAFRev2,N,3.484501,50.311681,0.95,housenumber,2 Rue Paul Vaillant-couturier 59233 Maing,59369_0760_00002,G,2 RUE PAUL VAILLANT COUTURIER,
316424654,00028,31642465400028,O,2001-02-12,NN,,,2008-01-04T20:45:59,true,3,JEANNE VALOIS,,,RUE,HENRI BANDIGNIES,59233,MAING,,,59369,,,,,,,,,,,,,,,,,,,2008-01-01,A,,,,,66.19A,NAFRev2,N,3.49171,50.31137,0.69,street,Rue Henri Bantegnie 59233 Maing,59369_0335,G,RUE HENRI BANTEGNIE,
317727386,00011,31772738600011,O,,,,,,true,1,,44,,RES,VICTOR HUGO,59233,MAING,,,59369,,,,,,,,,,,,,,,,,,,1984-12-25,F,,,,,00.20,NAP,N,3.492771,50.309004,0.88,housenumber,44 Voie Communale Res Victor Hugo 59233 Maing,59369_0800_00044,G,44 VOIE C RES VICTOR HUGO,
318422144,00010,31842214400010,O,1980-01-01,NN,,,2011-09-21T10:32:38,false,4,,24,B,RUE,JEAN JAURES,59233,MAING,,,59369,,,,,,,,,,,,,,,,,,,2004-12-31,F,,,,,67.2Z,NAFRev1,O,3.480507,50.306829,0.86,housenumber,24 b Rue Jean Jaures 59233 Maing,59369_0380_00024_b,G,24 B RUE JEAN JAURES,
318422144,00028,31842214400028,O,2011-10-01,,,,2014-11-23T04:24:18,true,2,,1,,PL,CUVELIER,59233,MAING,,,59369,,,,,,,,,,,,,,,,,,,2014-07-01,F,,,,,70.21Z,NAFRev2,N,3.479485,50.306191,0.8,housenumber,1 Place Pierre Cuvelier 59233 Maing,59369_0540_00001,G,1 PLACE PIERRE CUVELIER,
318464567,00011,31846456700011,O,,NN,,,,true,1,,24,,RUE,JEAN JAURES,59233,MAING,,,59369,,,,,,,,,,,,,,,,,,,1988-12-31,F,,,,,87.01,NAP,N,3.480341,50.306805,0.95,housenumber,24 Rue Jean Jaures 59233 Maing,59369_0380_00024,G,24 RUE JEAN JAURES,
318776317,00022,31877631700022,O,1990-05-02,NN,,,,true,1,,42,,AV,DES PAQUERETTES,59233,MAING,,,59369,,,,,,,,,,,,,,,,,,,2002-03-18,F,,,,,60.2M,NAF1993,O,3.489405,50.317673,0.77,housenumber,42 Rue des Paquerettes 59233 Maing,59369_d02t9t_00042,G,42 RUE DES PAQUERETTES,
318806304,00016,31880630400016,O,,NN,,,,true,1,,2,,AV,DES PATURETTES,59233,MAING,,,59369,,,,,,,,,,,,,,,,,,,1989-06-30,F,,,,,64.11,NAP,N,3.490838,50.318744,0.85,housenumber,2 Avenue des Paturettes 59233 Maing,59369_0480_00002,G,2 AVENUE DES PATURETTES,
320062482,00031,32006248200031,O,2001-02-12,NN,,,2020-07-16T09:08:02,true,4,RESIDENCE JEANNE DE VALOIS,,,RUE,HENRI BANTEGNIES,59233,MAING,,,59369,,,,,,,,,,,,,,,,,,,2019-07-01,F,,,,,68.20A,NAFRev2,N,3.49171,50.31137,0.87,street,Rue Henri Bantegnie 59233 Maing,59369_0335,G,RUE HENRI BANTEGNIE,
320153059,00011,32015305900011,O,1980-09-11,NN,,,2008-11-07T00:36:10,true,4,,28,,HAM,DE FONTENELLE,59233,MAING,,BP 23,59369,,,,,,,,,,,,,,,,,,,2005-10-14,F,,,,,71.3C,NAFRev1,O,3.502596,50.32091,0.89,housenumber,28 Rue de Fontenelle 59233 Maing,59369_0300_00028,G,28 RUE DE FONTENELLE,
320207996,00028,32020799600028,O,,NN,,,,true,1,,98,,RUE,DE LA RIE,59233,MAING,,,59369,,,,,,,,,,,,,,,,,,,,F,,,,,55.73,NAP,N,2.4169134,48.6571385,0.82,poi.construction,Rue de la Distillerie (Route en construction) Ris-Orangis,https://osm.org/way/458334230,G,,
320886583,00014,32088658300014,O,,NN,,,,true,1,,1,,RUE,LEON RUCART,59233,MAING,,,59369,,,,,,,,,,,,,,,,,,,1990-08-21,F,,,,,67.04,NAP,N,3.477678,50.30621,0.95,housenumber,1 Rue Leon Rucart 59233 Maing,59369_0420_00001,G,1 RUE LEON RUCART,
320922024,00023,32092202400023,O,1989-01-01,,,,2016-09-16T09:25:48,false,6,LA SABLIERE,28,,HAM,DE FONTENELLE,59233,MAING,,,59369,,,,,,,,,,,,,,,,,,,2014-03-01,F,,,,,77.32Z,NAFRev2,O,3.502596,50.32091,0.89,housenumber,28 Rue de Fontenelle 59233 Maing,59369_0300_00028,G,28 RUE DE FONTENELLE,
321365694,00025,32136569400025,O,1996-07-08,NN,,,2006-12-15T00:20:56,false,3,,71,,RUE,JEAN JAURES,59233,MAING,,,59369,,,,,,,,,,,,,,,,,,,1997-03-31,F,,,,,52.2G,NAF1993,N,3.483321,50.308123,0.95,housenumber,71 Rue Jean Jaures 59233 Maing,59369_0380_00071,G,71 RUE JEAN JAURES,
321913154,00027,32191315400027,O,1900-01-01,,,,2011-05-04T00:11:16,true,4,,1,,RUE,DE L ABBE DELBECQUE,59233,MAING,,,59369,,,,,,,,,,,,,,,,,,,2008-02-01,A,,,,,47.81Z,NAFRev2,N,3.479299,50.305449,0.95,housenumber,1 Rue de l'Abbe Delbecque 59233 Maing,59369_0020_00001,G,1 RUE DE L ABBE DELBECQUE,
322024779,00017,32202477900017,O,,NN,,,,true,1,,11,,RUE,JEAN JAURES,59233,MAING,,,59369,,,,,,,,,,,,,,,,,,,1995-09-22,F,,,,,55.4B,NAF1993,N,3.479768,50.306726,0.95,housenumber,11 Rue Jean Jaures 59233 Maing,59369_0380_00011,G,11 RUE JEAN JAURES,
322754961,00017,32275496100017,O,1981-09-21,NN,,,,true,1,,7,,PL,PIERRE CUVELIER,59233,MAING,,,59369,,,,,,,,,,,,,,,,,,,2000-01-01,F,,,,,01.1A,NAF1993,N,3.479324,50.305683,0.85,housenumber,7 Place Pierre Cuvelier 59233 Maing,59369_0540_00007,G,7 PLACE PIERRE CUVELIER,
322754979,00019,32275497900019,O,1981-10-15,NN,,,,false,4,,116,,RUE,JEAN JAURES,59233,MAING,,,59369,,,,,,,,,,,,,,,,,,,2002-08-08,F,ESPACE COIFFURE,,,,93.0D,NAF1993,O,3.484286,50.308415,0.95,housenumber,116 Rue Jean Jaures 59233 Maing,59369_0380_00116,G,116 RUE JEAN JAURES,
322809070,00012,32280907000012,O,,NN,,,,true,1,,14,,RUE,ALPHONSE DANGREAUX,59233,MAING,,,59369,,,,,,,,,,,,,,,,,,,,F,,,,,55.71,NAP,N,3.486159,50.307846,0.95,housenumber,14 Rue Alphonse Dangreaux 59233 Maing,59369_0040_00014,G,14 RUE ALPHONSE DANGREAUX,
322940784,00083,32294078400083,O,1988-07-01,NN,,,2015-06-19T04:05:45,false,4,,23,,RUE,DES TOURBIERES,59233,MAING,,,59369,,,,,,,,,,,,,,,,,,,2008-01-01,F,L INCROYABLE,,,,47.19B,NAFRev2,N,3.483223,50.312326,0.95,housenumber,23 Rue des Tourbieres 59233 Maing,59369_0741_00023,G,23 RUE DES TOURBIERES,
322975533,00033,32297553300033,O,2001-02-12,NN,,,2008-01-04T18:41:11,false,3,RESIDENCE JEANNE DE VALOIS,,,RUE,HENRI BANTEGNIES,59233,MAING,,,59369,,,,,,,,,,,,,,,,,,,2008-01-01,A,,,,,68.20A,NAFRev2,N,3.49171,50.31137,0.87,street,Rue Henri Bantegnie 59233 Maing,59369_0335,G,RUE HENRI BANTEGNIE,
323011254,00014,32301125400014,O,,,,,,true,1,,120,,RUE,JEAN JAURES,59233,MAING,,,59369,,,,,,,,,,,,,,,,,,,1984-12-25,F,,,,,67.04,NAP,N,3.484517,50.308483,0.95,housenumber,120 Rue Jean Jaures 59233 Maing,59369_0380_00120,G,120 RUE JEAN JAURES,
323338111,00012,32333811100012,O,1981-12-07,NN,,,2010-04-18T04:03:26,true,5,,57,,RUE,PIERRE VANDERBECQ,59233,MAING,,,59369,,,,,,,,,,,,,,,,,,,2008-12-31,F,,,,,46.34Z,NAFRev2,O,3.495019,50.309208,0.95,housenumber,57 Rue Pierre Vanderbecq 59233 Maing,59369_0560_00057,G,57 RUE PIERRE VANDERBECQ,
323641951,00013,32364195100013,O,,,,,,true,1,,24,,RUE,ANATOLE FRANCE,59233,MAING,,,59369,,,,,,,,,,,,,,,,,,,1984-12-25,F,,,,,62.46,NAP,N,3.484545,50.310037,0.95,housenumber,24 Rue Anatole France 59233 Maing,59369_0100_00024,G,24 RUE ANATOLE FRANCE,
323744714,00011,32374471400011,O,,,,,,true,1,,14,,AV,BERGERONNETTES,59233,MAING,,,59369,,,,,,,,,,,,,,,,,,,1984-12-25,F,,,,,62.43,NAP,N,3.489066,50.317001,0.77,housenumber,14 Rue des Bergeronnettes 59233 Maing,59369_0120_00014,G,14 RUE DES BERGERONNETTES,
323870469,00042,32387046900042,O,2003-12-31,NN,,,2018-12-01T13:17:01,false,3,RESIDENCE JEANNE DE VALOIS,,,RUE,HENRI BANTEGNIES,59233,MAING,,,59369,,,,,,,,,,,,,,,,,,,2008-01-01,A,,,,,68.20A,NAFRev2,N,3.49171,50.31137,0.87,street,Rue Henri Bantegnie 59233 Maing,59369_0335,G,RUE HENRI BANTEGNIE,
325389765,00018,32538976500018,O,,NN,,,,true,1,,14,,RES,VICTOR HUGO,59233,MAING,,,59369,,,,,,,,,,,,,,,,,,,,F,,,,,78.02,NAP,N,3.492155,50.309743,0.88,housenumber,14 Voie Communale Res Victor Hugo 59233 Maing,59369_0800_00014,G,14 VOIE C RES VICTOR HUGO,
325475341,00013,32547534100013,O,,,,,,true,1,,10,,RUE,PAUL LANGEVIN,59233,MAING,,,59369,,,,,,,,,,,,,,,,,,,1991-12-19,F,,,,,59.03,NAP,N,3.476699,50.303148,0.95,housenumber,10 Rue Paul Langevin 59233 Maing,59369_0520_00010,G,10 RUE PAUL LANGEVIN,
325670628,00016,32567062800016,O,1982-06-01,NN,,,2019-06-24T13:23:23,true,5,,59,,RUE,VANDERBECQ,59233,MAING,,,59369,,,,,,,,,,,,,,,,,,,2017-12-31,F,,,,,68.20B,NAFRev2,N,3.496646,50.309669,0.93,housenumber,59 Rue Pierre Vanderbecq 59233 Maing,59369_0560_00059,G,59 RUE PIERRE VANDERBECQ,
326238953,00011,32623895300011,O,,NN,,,,true,1,,120,,RUE,JEAN JAURES,59233,MAING,,,59369,,,,,,,,,,,,,,,,,,,1987-11-30,F,,,,,67.01,NAP,N,3.484517,50.308483,0.95,housenumber,120 Rue Jean Jaures 59233 Maing,59369_0380_00120,G,120 RUE JEAN JAURES,
326314358,00010,32631435800010,O,,,,,,true,1,,62,,RUE,DES PATURETTES,59233,MAING,,,59369,,,,,,,,,,,,,,,,,,,1988-07-13,F,,,,,77.04,NAP,N,3.489632,50.316497,0.81,housenumber,62 Avenue des Paturettes 59233 Maing,59369_0480_00062,G,62 AVENUE DES PATURETTES,
327122016,00022,32712201600022,O,2005-01-01,,,,2021-02-23T10:48:51,true,2,,,,,FONDS DE CAUMONT,59233,MAING,,,59369,,,,,,,,,,,,,,,,,,,2008-01-01,A,,,,,68.20B,NAFRev2,N,3.516843,50.301949,0.63,street,Rue de Caumont 59233 Maing,59369_0170,G,RUE DE CAUMONT,
327164398,00023,32716439800023,O,1985-07-16,NN,,,2018-12-07T04:43:07,true,4,,,,RUE,DE L EGLISE,59233,MAING,,,59369,,,,,,,,,,,,,,,,,,,2018-12-31,F,,,,,86.21Z,NAFRev2,N,2.190649,48.5867276,0.9,poi,Rue de l'Église (Pont) Bruyères-le-Châtel,https://osm.org/way/56259060,G,,
327226437,00025,32722643700025,O,1989-01-01,,,,,true,1,,,,,FOND DE CAUMONT,59233,MAING,,,59369,,,,,,,,,,,,,,,,,,,2000-11-15,F,,,,,01.4A,NAF1993,N,3.516843,50.301949,0.66,street,Rue de Caumont 59233 Maing,59369_0170,G,RUE DE CAUMONT,
327278321,00010,32727832100010,O,1982-11-04,NN,,,2010-01-25T11:21:52,true,4,,71,,RUE,JEAN JAURES,59233,MAING,,,59369,,,,,,,,,,,,,,,,,,,2008-01-01,A,,,,,68.20A,NAFRev2,N,3.483321,50.308123,0.95,housenumber,71 Rue Jean Jaures 59233 Maing,59369_0380_00071,G,71 RUE JEAN JAURES,
327486049,00015,32748604900015,O,,,,,,true,1,,11,,RUE,DES PAQUERETTES,59233,MAING,,,59369,,,,,,,,,,,,,,,,,,,1985-12-25,F,,,,,62.41,NAP,N,3.489829,50.318597,0.95,housenumber,11 Rue des Paquerettes 59233 Maing,59369_d02t9t_00011,G,11 RUE DES PAQUERETTES,
328758420,00017,32875842000017,O,1983-10-25,NN,,,2008-11-07T00:46:39,true,3,,15,B,RUE,DE L ABBE DELBECQUE,59233,MAING,,,59369,,,,,,,,,,,,,,,,,,,2004-12-31,F,,,,,52.4X,NAFRev1,N,3.479402,50.30476,0.84,housenumber,15 bis Rue de l'Abbe Delbecque 59233 Maing,59369_0020_00015_bis,G,15 BIS RUE DE L ABBE DELBECQUE,
328835046,00025,32883504600025,O,1984-01-02,NN,,,,false,4,,35,,RUE,ANATOLE FRANCE,59233,MAING,,,59369,,,,,,,,,,,,,,,,,,,1994-12-25,F,MANYFLOR,,,,52.4X,NAF1993,O,3.484411,50.310222,0.95,housenumber,35 Rue Anatole France 59233 Maing,59369_0100_00035,G,35 RUE ANATOLE FRANCE,
329529382,00015,32952938200015,O,1984-03-16,NN,,,,false,4,,23,,RUE,DES TOURBIERES,59233,MAING,,,59369,,,,,,,,,,,,,,,,,,,2002-10-07,F,,,,,70.2C,NAF1993,N,3.483223,50.312326,0.95,housenumber,23 Rue des Tourbieres 59233 Maing,59369_0741_00023,G,23 RUE DES TOURBIERES,
329529382,00023,32952938200023,O,2002-10-07,NN,,,2008-04-05T00:30:44,true,3,,24,,RUE,PIERRE VANDERBECQ,59233,MAING,,,59369,,,,,,,,,,,,,,,,,,,2008-01-01,A,,,,,68.20B,NAFRev2,N,3.488273,50.306924,0.95,housenumber,24 Rue Pierre Vanderbecq 59233 Maing,59369_0560_00024,G,24 RUE PIERRE VANDERBECQ,
329555692,00014,32955569200014,O,1984-04-05,01,2018,,2020-08-25T10:33:53,true,3,,9,,RUE,PIERRE VANDERBECQ,59233,MAING,,,59369,,,,,,,,,,,,,,,,,,,2008-01-01,A,,,,,01.50Z,NAFRev2,N,3.483968,50.304501,0.95,housenumber,9 Rue Pierre Vanderbecq 59233 Maing,59369_0560_00009,G,9 RUE PIERRE VANDERBECQ,
329745285,00026,32974528500026,O,1991-01-01,NN,,,2006-12-11T09:20:27,true,3,,,,,FOND DE CAUMONT,59233,MAING,,,59369,,,,,,,,,,,,,,,,,,,2006-12-06,F,,,,,01.3Z,NAFRev1,N,3.516843,50.301949,0.66,street,Rue de Caumont 59233 Maing,59369_0170,G,RUE DE CAUMONT,