siren,nic,siret,statutDiffusionEtablissement,dateCreationEtablissement,trancheEffectifsEtablissement,anneeEffectifsEtablissement,activitePrincipaleRegistreMetiersEtablissement,dateDernierTraitementEtablissement,etablissementSiege,nombrePeriodesEtablissement,complementAdresseEtablissement,numeroVoieEtablissement,indiceRepetitionEtablissement,typeVoieEtablissement,libelleVoieEtablissement,codePostalEtablissement,libelleCommuneEtablissement,libelleCommuneEtrangerEtablissement,distributionSpecialeEtablissement,codeCommuneEtablissement,codeCedexEtablissement,libelleCedexEtablissement,codePaysEtrangerEtablissement,libellePaysEtrangerEtablissement,complementAdresse2Etablissement,numeroVoie2Etablissement,indiceRepetition2Etablissement,typeVoie2Etablissement,libelleVoie2Etablissement,codePostal2Etablissement,libelleCommune2Etablissement,libelleCommuneEtranger2Etablissement,distributionSpeciale2Etablissement,codeCommune2Etablissement,codeCedex2Etablissement,libelleCedex2Etablissement,codePaysEtranger2Etablissement,libellePaysEtranger2Etablissement,dateDebut,etatAdministratifEtablissement,enseigne1Etablissement,enseigne2Etablissement,enseigne3Etablissement,denominationUsuelleEtablissement,activitePrincipaleEtablissement,nomenclatureActivitePrincipaleEtablissement,caractereEmployeurEtablissement,longitude,latitude,geo_score,geo_type,geo_adresse,geo_id,geo_ligne,geo_l4,geo_l5
216204446,00019,21620444600019,O,1983-03-01,03,2018,,2020-08-25T10:18:17,true,3,,455,,RUE,PRINCIPALE,62179,HERVELINGHEN,,,62444,,,,,,,,,,,,,,,,,,,2008-01-01,A,MAIRIE,,,,84.11Z,NAFRev2,N,1.715322,50.881717,0.93,housenumber,455 Rue Principale 62179 Hervelinghen,62444_ejx5rj_00455,G,455 RUE PRINCIPALE,
216204446,00027,21620444600027,O,1983-12-21,02,2018,,2020-08-25T10:18:17,false,3,,,,RUE,PRINCIPALE,62179,HERVELINGHEN,,,62444,,,,,,,,,,,,,,,,,,,2008-01-01,A,ECOLE PRIMAIRE PUBLIQUE,,,,85.20Z,NAFRev2,N,1.720003,50.879858,0.93,street,Rue Principale 62179 Hervelinghen,62444_ejx5rj,G,RUE PRINCIPALE,
216204446,00035,21620444600035,O,1995-12-25,NN,,,2019-09-09T14:21:27,false,3,MAIRIE,455,,RUE,PRINCIPALE,62179,HERVELINGHEN,,,62444,,,,,,,,,,,,,,,,,,,2018-12-31,F,SERVICE DES EAUX,,,,36.00Z,NAFRev2,N,1.715322,50.881717,0.93,housenumber,455 Rue Principale 62179 Hervelinghen,62444_ejx5rj_00455,G,455 RUE PRINCIPALE,
266204445,00016,26620444500016,O,1983-03-01,NN,,,2008-01-04T19:01:43,true,3,MAIRIE,,,,,62179,HERVELINGHEN,,,62444,,,,,,,,,,,,,,,,,,,2008-01-01,A,CCAS,,,,88.99B,NAFRev2,N,,,0,,,,,,
311750145,00022,31175014500022,O,1998-10-01,,,,2006-11-25T09:29:09,true,1,,2083,,,RAMSAULT,62179,HERVELINGHEN,,,62444,,,,,,,,,,,,,,,,,,,1999-03-31,F,,,,,74.1J,NAF1993,N,1.735754,50.891146,0.85,housenumber,2083 Lieu Dit Ramsault 62179 Hervelinghen,62444_8u634b_02083,G,2083 LIEU DIT RAMSAULT,
312545650,00011,31254565000011,O,1978-01-01,NN,,,2016-01-28T03:49:20,true,4,,760,,RUE,PRINCIPALE,62179,HERVELINGHEN,,,62444,,,,,,,,,,,,,,,,,,,2015-12-31,F,,,,,71.11Z,NAFRev2,N,1.710951,50.882406,0.93,housenumber,760 Rue Principale 62179 Hervelinghen,62444_ejx5rj_00760,G,760 RUE PRINCIPALE,
317230050,00039,31723005000039,O,2020-11-01,,,,2021-02-23T10:42:16,true,1,,560,,RUE,PRINCIPALE,62179,HERVELINGHEN,,,62444,,,,,,,,,,,,,,,,,,,2020-11-01,A,,,,,86.90E,NAFRev2,N,1.713817,50.881991,0.93,housenumber,560 Rue Principale 62179 Hervelinghen,62444_ejx5rj_00560,G,560 RUE PRINCIPALE,
317610004,00010,31761000400010,O,1979-01-01,NN,,4322AZ,2018-07-27T10:19:52,false,5,,834,,RTE,NATIONALE,62179,HERVELINGHEN,,,62444,,,,,,,,,,,,,,,,,,,2018-06-30,F,,,,,43.22A,NAFRev2,O,1.71013,50.882947,0.38,housenumber,834 Rue Principale (cd 244) 62179 Hervelinghen,62444_0015_00834,G,834 RUE PRINCIPALE,CD 244
317610004,00028,31761000400028,O,2002-01-02,,,,2021-02-23T10:42:30,true,1,,853,,RUE,PRINCIPALE,62179,HERVELINGHEN,,,62444,,,,,,,,,,,,,,,,,,,2002-01-02,A,,,,,55.20Z,NAFRev2,N,1.709732,50.882775,0.93,housenumber,853 Rue Principale 62179 Hervelinghen,62444_ejx5rj_00853,G,853 RUE PRINCIPALE,
317610004,00036,31761000400036,O,2018-07-01,,,,2021-02-23T10:42:30,false,1,CD 244,834,,RUE,PRINCIPALE,62179,HERVELINGHEN,,,62444,,,,,,,,,,,,,,,,,,,2018-07-01,A,,,,,68.20A,NAFRev2,N,1.709959,50.882948,0.93,housenumber,834 Rue Principale 62179 Hervelinghen,62444_ejx5rj_00834,G,834 RUE PRINCIPALE,
319561684,00048,31956168400048,O,,,,,,true,1,,,,RUE,DES MONTS,62179,HERVELINGHEN,,,62444,,,,,,,,,,,,,,,,,,,1988-06-30,F,,,,,55.60,NAP,N,1.713463,50.882457,0.93,street,Rue des Monts 62179 Hervelinghen,62444_0020,G,RUE DES MONTS,
323977694,00013,32397769400013,O,,,,,,true,1,,,,HAM,RAMSAULT,62179,HERVELINGHEN,,,62444,,,,,,,,,,,,,,,,,,,1984-12-25,F,,,,,62.42,NAP,N,1.734291,50.890515,0.91,street,Lieu Dit Ramsault 62179 Hervelinghen,62444_8u634b,G,LIEU DIT RAMSAULT,
324450766,00013,32445076600013,O,,,,,,true,1,,9,,RUE,FERNAND PLOUVIER,62179,HERVELINGHEN,,,62444,,,,,,,,,,,,,,,,,,,1985-12-25,F,,,,,62.46,NAP,N,1.718248,50.880598,0.86,street,Rue Fernand Plouvier 62179 Hervelinghen,62444_0005,G,RUE FERNAND PLOUVIER,
328214887,00015,32821488700015,O,,NN,,,,true,1,,,,HAM,DE RAMSAULT,62179,HERVELINGHEN,,,62444,,,,,,,,,,,,,,,,,,,1996-10-31,F,,,,,01.1A,NAF1993,N,1.734291,50.890515,0.69,street,Lieu Dit Ramsault 62179 Hervelinghen,62444_8u634b,G,LIEU DIT RAMSAULT,
331019307,00023,33101930700023,O,1992-01-01,NN,,,2011-05-02T15:25:25,false,4,,179,,RUE,PASTEUR,62179,HERVELINGHEN,,,62444,,,,,,,,,,,,,,,,,,,2011-04-01,F,,,,,01.11Z,NAFRev2,N,1.717796,50.879159,0.93,housenumber,179 Rue Pasteur 62179 Hervelinghen,62444_0013_00179,G,179 RUE PASTEUR,
331019307,00031,33101930700031,O,2011-04-01,,,,2019-09-18T03:37:35,true,2,,380,,RUE,PRINCIPALE,62179,HERVELINGHEN,,,62444,,,,,,,,,,,,,,,,,,,2017-12-31,F,,,,,01.11Z,NAFRev2,N,1.716228,50.881649,0.93,housenumber,380 Rue Principale 62179 Hervelinghen,62444_ejx5rj_00380,G,380 RUE PRINCIPALE,
338207343,00017,33820734300017,O,,NN,,,,true,1,,,,,HAMEAU DE RAMSAULT,62179,HERVELINGHEN,,,62444,,,,,,,,,,,,,,,,,,,1990-12-31,F,,,,,93.0N,NAF1993,N,1.734291,50.890515,0.5,street,Lieu Dit Ramsault 62179 Hervelinghen,62444_8u634b,G,LIEU DIT RAMSAULT,
341363315,00076,34136331500076,O,2017-05-08,,,,2019-12-09T14:43:36,true,3,LOGEMENT 3,990,,RUE,PRINCIPALE (CD 244),62179,HERVELINGHEN,,,62444,,,,,,,,,,,,,,,,,,,2017-12-01,A,,,,,46.19B,NAFRev2,N,1.708645,50.884007,0.93,housenumber,990 Rue Principale (cd 244) 62179 Hervelinghen,62444_0015_00990,G,990 RUE PRINCIPALE,CD 244
342517844,00029,34251784400029,O,1995-01-01,01,2018,4312BA,2020-08-25T10:40:40,true,6,,730,,RUE,PRINCIPALE,62179,HERVELINGHEN,,,62444,,,,,,,,,,,,,,,,,,,2012-01-01,A,,,,,01.43Z,NAFRev2,O,1.711278,50.882282,0.93,housenumber,730 Rue Principale 62179 Hervelinghen,62444_ejx5rj_00730,G,730 RUE PRINCIPALE,
352956080,00019,35295608000019,O,,NN,,,,true,1,,,,,,62179,HERVELINGHEN,,,62444,,,,,,,,,,,,,,,,,,,1993-12-31,F,,,,,01.3Z,NAF1993,N,,,0,,,,,,
378405807,00017,37840580700017,O,1990-01-01,NN,,,2017-09-14T15:58:00,true,5,,,,,,62179,HERVELINGHEN,,,62444,,,,,,,,,,,,,,,,,,,2015-12-31,F,,,,,68.20B,NAFRev2,N,,,0,,,,,,
380603464,00013,38060346400013,O,1991-01-01,NN,,,2014-12-23T04:51:36,true,5,,,,,HAMEAU DE RAMESAULT,62179,HERVELINGHEN,,,62444,,,,,,,,,,,,,,,,,,,2014-12-31,F,,,,,96.09Z,NAFRev2,O,1.734015,50.889975,0.7,street,Hameau de Rameseau 62179 Hervelinghen,62444_0040,G,HAMEAU DE RAMESEAU,
397429259,00013,39742925900013,O,1989-02-19,NN,,,,true,1,,990,,RUE,PRINCIPALE,62179,HERVELINGHEN,,,62444,,,,,,,,,,,,,,,,,,,2001-12-15,F,,,,,55.2E,NAF1993,N,1.708349,50.88364,0.93,housenumber,990 Rue Principale 62179 Hervelinghen,62444_ejx5rj_00990,G,990 RUE PRINCIPALE,
397730797,00016,39773079700016,O,1978-01-01,NN,,,2017-05-04T04:34:06,true,4,,50,,RUE,PRINCIPALE,62179,HERVELINGHEN,,,62444,,,,,,,,,,,,,,,,,,,2016-09-06,F,,,,,01.50Z,NAFRev2,N,1.720219,50.879924,0.93,housenumber,50 Rue Principale 62179 Hervelinghen,62444_ejx5rj_00050,G,50 RUE PRINCIPALE,
400048195,00012,40004819500012,O,1995-01-01,NN,,,2008-01-04T19:21:29,true,3,,990,,RUE,PRINCIPALE,62179,HERVELINGHEN,,,62444,,,,,,,,,,,,,,,,,,,2008-01-01,A,,,,,01.11Z,NAFRev2,N,1.708349,50.88364,0.93,housenumber,990 Rue Principale 62179 Hervelinghen,62444_ejx5rj_00990,G,990 RUE PRINCIPALE,
400049334,00016,40004933400016,O,1995-01-01,NN,,,2008-01-04T19:21:30,true,3,,13,,RUE,PASTEUR,62179,HERVELINGHEN,,,62444,,,,,,,,,,,,,,,,,,,2008-01-01,A,,,,,01.11Z,NAFRev2,N,1.718877,50.880298,0.93,housenumber,13 Rue Pasteur 62179 Hervelinghen,62444_0013_00013,G,13 RUE PASTEUR,
400400503,00035,40040050300035,O,2017-02-13,,,,2021-02-23T11:24:17,false,1,,70,,,LES JARDINS DE MIL ANS,62179,HERVELINGHEN,,,62444,,,,,,,,,,,,,,,,,,,2017-02-13,A,,,,,46.19B,NAFRev2,N,1.71773,50.88148,0.93,housenumber,70 Les Jardins de Mil Ans 62179 Hervelinghen,62444_s83gv3_00070,G,70 LES JARDINS DE MIL ANS,
402216105,00021,40221610500021,O,1999-07-01,00,2018,,2020-11-06T09:35:35,false,5,,901,,RUE,PRINCIPALE,62179,HERVELINGHEN,,,62444,,,,,,,,,,,,,,,,,,,2020-01-01,F,,,,,55.30Z,NAFRev2,N,1.709192,50.882991,0.93,housenumber,901 Rue Principale 62179 Hervelinghen,62444_ejx5rj_00901,G,901 RUE PRINCIPALE,
411537053,00018,41153705300018,O,1996-11-01,NN,,,2007-05-19T12:37:53,true,3,,,,HAM,DE RAMSAULT,62179,HERVELINGHEN,,,62444,,,,,,,,,,,,,,,,,,,2005-05-31,F,,,,,01.1A,NAFRev1,N,1.734291,50.890515,0.69,street,Lieu Dit Ramsault 62179 Hervelinghen,62444_8u634b,G,LIEU DIT RAMSAULT,
412279978,00016,41227997800016,O,1997-03-04,NN,,,2008-04-20T05:11:22,true,4,,,,RUE,PRINCIPALE,62179,HERVELINGHEN,,,62444,,,,,,,,,,,,,,,,,,,2008-01-01,F,,,,,01.11Z,NAFRev2,N,1.720003,50.879858,0.93,street,Rue Principale 62179 Hervelinghen,62444_ejx5rj,G,RUE PRINCIPALE,
419081252,00019,41908125200019,O,1998-05-04,,,,,true,1,,40,,RUE,FERNAND PLOUVIER,62179,HERVELINGHEN,,,62444,,,,,,,,,,,,,,,,,,,1999-06-30,F,,,,,45.2J,NAF1993,N,1.717994,50.880341,0.93,housenumber,40 Rue Fernand Plouvier 62179 Hervelinghen,62444_0005_00040,G,40 RUE FERNAND PLOUVIER,
419802731,00010,41980273100010,O,1998-08-10,,,,,true,1,,2083,,HAM,DE RAMSAULT,62179,HERVELINGHEN,,,62444,,,,,,,,,,,,,,,,,,,1999-03-31,F,,,,,60.2L,NAF1993,N,1.735754,50.891146,0.71,housenumber,2083 Lieu Dit Ramsault 62179 Hervelinghen,62444_8u634b_02083,G,2083 LIEU DIT RAMSAULT,
424136562,00032,42413656200032,O,2019-09-02,,,,2021-02-23T11:46:17,true,1,LES JARDINS DE MILANS,112,,RUE,PRINCIPALE,62179,HERVELINGHEN,,,62444,,,,,,,,,,,,,,,,,,,2019-09-02,A,,,,,46.18Z,NAFRev2,N,1.720003,50.879858,0.76,street,Rue Principale 62179 Hervelinghen,62444_ejx5rj,G,RUE PRINCIPALE,
430748434,00015,43074843400015,O,1976-02-01,NN,,,2016-02-29T11:22:13,true,5,,,,,,62179,HERVELINGHEN,,,62444,,,,,,,,,,,,,,,,,,,2015-12-31,F,,,,,01.11Z,NAFRev2,N,,,0,,,,,,
435029277,00017,43502927700017,O,2001-01-01,NN,,,2007-08-09T08:16:20,false,3,,715,,RUE,PRINCIPALE,62179,HERVELINGHEN,,,62444,,,,,,,,,,,,,,,,,,,2007-06-01,F,,,,,01.1A,NAFRev1,N,1.711493,50.882188,0.93,housenumber,715 Rue Principale 62179 Hervelinghen,62444_ejx5rj_00715,G,715 RUE PRINCIPALE,
442798625,00038,44279862500038,O,2013-05-02,,,,2015-11-13T08:31:15,false,2,,97,,IMP,DU CHATEAU D EAU,62179,HERVELINGHEN,,,62444,,,,,,,,,,,,,,,,,,,2013-06-25,F,,,,,47.81Z,NAFRev2,N,1.715673,50.882498,0.85,housenumber,97 Impasse du Château d'Eau 62179 Hervelinghen,62444_0003_00097,G,97 IMPASSE DU CHATEAU D EAU,
466407921,00058,46640792100058,O,2014-12-16,,,,2021-02-23T13:38:50,true,1,18 LES JARDINS DE MIL ANS,280,,RUE,PRINCIPALE,62179,HERVELINGHEN,,,62444,,,,,,,,,,,,,,,,,,,2014-12-16,A,,,,,70.22Z,NAFRev2,N,1.720003,50.879858,0.76,street,Rue Principale 62179 Hervelinghen,62444_ejx5rj,G,RUE PRINCIPALE,
477933998,00023,47793399800023,O,2014-02-26,,,,2021-02-23T13:39:33,true,1,LE CLOS DU PUITS,381,,RUE,PRINCIPALE,62179,HERVELINGHEN,,,62444,,,,,,,,,,,,,,,,,,,2014-02-26,A,,,,,68.20B,NAFRev2,N,1.716513,50.881511,0.93,housenumber,381 Rue Principale 62179 Hervelinghen,62444_ejx5rj_00381,G,381 RUE PRINCIPALE,
480442516,00013,48044251600013,O,2005-01-01,,,,2016-06-16T03:41:39,true,3,LES JARDINS DE MIL ANS,,,,,62179,HERVELINGHEN,,,62444,,,,,,,,,,,,,,,,,,,2014-09-17,F,,,,,64.20Z,NAFRev2,N,1.717109,50.881815,0.93,street,Les Jardins de Mil Ans 62179 Hervelinghen,62444_s83gv3,D,LES JARDINS DE MIL ANS,
483412516,00013,48341251600013,O,2005-06-01,NN,,,2010-04-18T11:25:11,true,2,,,,HAM,DE RAMSAULT,62179,HERVELINGHEN,,,62444,,,,,,,,,,,,,,,,,,,2008-01-01,A,,,,,01.11Z,NAFRev2,O,1.734291,50.890515,0.69,street,Lieu Dit Ramsault 62179 Hervelinghen,62444_8u634b,G,LIEU DIT RAMSAULT,
483840880,00015,48384088000015,O,2005-07-27,,,,2008-01-05T01:18:43,false,2,LE CLOS DU PUITS,,,RUE,PRINCIPALE,62179,HERVELINGHEN,,,62444,,,,,,,,,,,,,,,,,,,2008-01-01,A,,,,,68.20A,NAFRev2,N,1.720003,50.879858,0.93,street,Rue Principale 62179 Hervelinghen,62444_ejx5rj,G,RUE PRINCIPALE,
485224919,00038,48522491900038,O,2015-11-10,,,,2016-10-10T03:31:53,true,2,,130,,,LES JARDINS DE MIL ANS,62179,HERVELINGHEN,,,62444,,,,,,,,,,,,,,,,,,,2016-08-01,F,,,,,46.19B,NAFRev2,N,1.718582,50.881351,0.93,housenumber,130 Les Jardins de Mil Ans 62179 Hervelinghen,62444_s83gv3_00130,G,130 LES JARDINS DE MIL ANS,
488173261,00014,48817326100014,O,2006-02-13,NN,,,2014-07-10T00:23:13,false,4,,70,,,LES JARDINS DE MIL ANS,62179,HERVELINGHEN,,,62444,,,,,,,,,,,,,,,,,,,2012-08-01,F,IJC,,,,43.22B,NAFRev2,O,1.71773,50.88148,0.93,housenumber,70 Les Jardins de Mil Ans 62179 Hervelinghen,62444_s83gv3_00070,G,70 LES JARDINS DE MIL ANS,
498126804,00026,49812680400026,O,2008-04-30,NN,,,2012-05-05T12:44:17,false,2,,720,,RUE,PRINCIPALE (CD 244),62179,HERVELINGHEN,,,62444,,,,,,,,,,,,,,,,,,,2010-03-15,F,,,,,03.11Z,NAFRev2,O,1.711673,50.882514,0.93,housenumber,720 Rue Principale (cd 244) 62179 Hervelinghen,62444_0015_00720,G,720 RUE PRINCIPALE,CD 244
499026128,00037,49902612800037,O,2009-11-25,NN,,,2017-05-04T07:18:35,false,4,,708,,RUE,PRINCIPALE,62179,HERVELINGHEN,,,62444,,,,,,,,,,,,,,,,,,,2015-11-09,F,,,,,46.69B,NAFRev2,O,1.711988,50.882242,0.93,housenumber,708 Rue Principale 62179 Hervelinghen,62444_ejx5rj_00708,G,708 RUE PRINCIPALE,
510217862,00026,51021786200026,O,2012-11-09,,,,2021-02-23T15:17:25,true,1,LE CLOS DU PUITS,381,,RUE,PRINCIPALE,62179,HERVELINGHEN,,,62444,,,,,,,,,,,,,,,,,,,2012-11-09,A,,,,,68.20B,NAFRev2,N,1.716513,50.881511,0.93,housenumber,381 Rue Principale 62179 Hervelinghen,62444_ejx5rj_00381,G,381 RUE PRINCIPALE,
510313554,00014,51031355400014,O,2009-02-09,,,,2014-02-26T10:07:04,false,2,,261,,RUE,LES JARDINS DE MIL ANS,62179,HERVELINGHEN,,,62444,,,,,,,,,,,,,,,,,,,2014-02-01,F,DECANORD CONSULTING,,,,70.22Z,NAFRev2,N,1.717292,50.881933,0.83,street,Rue les Jardins de Mil Ans 62179 Hervelinghen,62444_0011,G,RUE LES JARDINS DE MIL ANS,
519542831,00036,51954283100036,O,2021-01-01,,,,2021-02-23T15:32:03,true,1,,990,B,RUE,PRINCIPALE,62179,HERVELINGHEN,,,62444,,,,,,,,,,,,,,,,,,,2021-01-01,A,,,,,85.59B,NAFRev2,N,1.720003,50.879858,0.73,street,Rue Principale 62179 Hervelinghen,62444_ejx5rj,G,RUE PRINCIPALE,
520442831,00019,52044283100019,O,2010-02-22,,,,2010-02-23T09:17:18,true,1,,730,,RUE,PRINCIPALE,62179,HERVELINGHEN,,,62444,,,,,,,,,,,,,,,,,,,2010-02-22,A,,,,,68.20B,NAFRev2,N,1.711278,50.882282,0.93,housenumber,730 Rue Principale 62179 Hervelinghen,62444_ejx5rj_00730,G,730 RUE PRINCIPALE,
522729078,00017,52272907800017,O,2010-06-01,NN,,,2014-01-22T04:21:26,true,2,,708,,RUE,PRINCIPALE,62179,HERVELINGHEN,,,62444,,,,,,,,,,,,,,,,,,,2011-01-01,F,,,,,43.22A,NAFRev2,O,1.711988,50.882242,0.93,housenumber,708 Rue Principale 62179 Hervelinghen,62444_ejx5rj_00708,G,708 RUE PRINCIPALE,
524229176,00028,52422917600028,O,2014-01-01,,,,2021-02-23T15:40:58,true,1,,57,,RUE,DES MONTS,62179,HERVELINGHEN,,,62444,,,,,,,,,,,,,,,,,,,2014-01-01,A,,,,,68.20A,NAFRev2,N,1.71359,50.882638,0.93,housenumber,57 Rue des Monts 62179 Hervelinghen,62444_0020_00057,G,57 RUE DES MONTS,
524229952,00014,52422995200014,O,2010-09-01,03,2018,4331ZA,2020-08-25T10:38:39,false,2,,57,,RUE,DES MONTS,62179,HERVELINGHEN,,,62444,,,,,,,,,,,,,,,,,,,2019-05-25,F,,,,,41.20A,NAFRev2,O,1.71359,50.882638,0.93,housenumber,57 Rue des Monts 62179 Hervelinghen,62444_0020_00057,G,57 RUE DES MONTS,
532031622,00014,53203162200014,O,2011-04-14,,,,2012-07-05T09:53:22,false,2,,381,,RUE,PRINCIPALE,62179,HERVELINGHEN,,,62444,,,,,,,,,,,,,,,,,,,2012-05-09,F,,,,,68.20B,NAFRev2,N,1.716513,50.881511,0.93,housenumber,381 Rue Principale 62179 Hervelinghen,62444_ejx5rj_00381,G,381 RUE PRINCIPALE,
532228434,00017,53222843400017,O,2011-06-01,,,,2011-05-11T08:56:30,true,1,,740,,RUE,PRINCIPALE,62179,HERVELINGHEN,,,62444,,,,,,,,,,,,,,,,,,,2011-06-01,A,,,,,68.20B,NAFRev2,N,1.711199,50.882302,0.93,housenumber,740 Rue Principale 62179 Hervelinghen,62444_ejx5rj_00740,G,740 RUE PRINCIPALE,
532729084,00014,53272908400014,O,2011-06-01,,,,2011-06-03T05:33:07,true,1,,261,,RUE,LES JARDINS DE MIL ANS,62179,HERVELINGHEN,,,62444,,,,,,,,,,,,,,,,,,,2011-06-01,A,,,,,68.20B,NAFRev2,N,1.717292,50.881933,0.83,street,Rue les Jardins de Mil Ans 62179 Hervelinghen,62444_0011,G,RUE LES JARDINS DE MIL ANS,
538342882,00031,53834288200031,O,2019-02-01,,,1419ZE,2020-06-04T04:17:29,true,1,LES JARDINS DE MIL ANS,280,,RUE,PRINCIPALE,62179,HERVELINGHEN,,,62444,,,,,,,,,,,,,,,,,,,2019-02-01,A,,,,DU VENT DANS MES VALISES,14.19Z,NAFRev2,N,1.720003,50.879858,0.76,street,Rue Principale 62179 Hervelinghen,62444_ejx5rj,G,RUE PRINCIPALE,
571750546,00020,57175054600020,O,1990-04-13,NN,,,2008-01-05T22:23:22,true,3,LE RIETZ QUETZ,,,RTE,PRINCIPALE,62179,HERVELINGHEN,,,62444,,,,,,,,,,,,,,,,,,,2008-01-01,A,,,,,68.20B,NAFRev2,N,1.720003,50.879858,0.75,street,Rue Principale 62179 Hervelinghen,62444_ejx5rj,G,RUE PRINCIPALE,
591742127,00010,59174212700010,O,,,,,,true,1,,,,,,62179,HERVELINGHEN,,,62444,,,,,,,,,,,,,,,,,,,1984-12-25,F,,,,,67.07,NAP,N,,,0,,,,,,
750166332,00015,75016633200015,O,2012-03-01,,,,2012-03-11T05:53:50,true,1,,730,,RUE,PRINCIPALE (CD 244),62179,HERVELINGHEN,,,62444,,,,,,,,,,,,,,,,,,,2012-03-01,A,,,,,81.30Z,NAFRev2,N,1.711477,50.882554,0.93,housenumber,730 Rue Principale (cd 244) 62179 Hervelinghen,62444_0015_00730,G,730 RUE PRINCIPALE,CD 244
753785096,00011,75378509600011,O,2012-09-03,,,,2012-09-14T07:50:45,true,1,,,,,LES JARDINS DE MILS ANS,62179,HERVELINGHEN,,,62444,,,,,,,,,,,,,,,,,,,2012-09-03,A,,,,,64.20Z,NAFRev2,N,1.717109,50.881815,0.82,street,Les Jardins de Mil Ans 62179 Hervelinghen,62444_s83gv3,G,LES JARDINS DE MIL ANS,
753793009,00014,75379300900014,O,2012-09-03,,,,2012-09-14T07:50:13,true,1,,,,,LES JARDINS DE MIL ANS,62179,HERVELINGHEN,,,62444,,,,,,,,,,,,,,,,,,,2012-09-03,A,,,,,64.20Z,NAFRev2,N,1.717109,50.881815,0.93,street,Les Jardins de Mil Ans 62179 Hervelinghen,62444_s83gv3,G,LES JARDINS DE MIL ANS,
753810456,00016,75381045600016,O,2012-09-03,,,,2012-09-16T04:43:21,true,1,,,,,LES JARDINS DE MILS ANS,62179,HERVELINGHEN,,,62444,,,,,,,,,,,,,,,,,,,2012-09-03,A,,,,,68.20B,NAFRev2,N,1.717109,50.881815,0.82,street,Les Jardins de Mil Ans 62179 Hervelinghen,62444_s83gv3,G,LES JARDINS DE MIL ANS,
784014243,00017,78401424300017,O,,NN,,,,true,1,,450,,RUE,PRINCIPALE,62179,HERVELINGHEN,,,62444,,,,,,,,,,,,,,,,,,,1994-12-31,F,,,,,55.4A,NAF1993,N,1.715501,50.881793,0.93,housenumber,450 Rue Principale 62179 Hervelinghen,62444_ejx5rj_00450,G,450 RUE PRINCIPALE,
789383197,00017,78938319700017,O,2012-11-02,,,,2015-04-15T08:33:11,false,2,,760,,RUE,PRINCIPALE,62179,HERVELINGHEN,,,62444,,,,,,,,,,,,,,,,,,,2015-04-02,F,,,,,86.90D,NAFRev2,N,1.710951,50.882406,0.93,housenumber,760 Rue Principale 62179 Hervelinghen,62444_ejx5rj_00760,G,760 RUE PRINCIPALE,
794870576,00012,79487057600012,O,2013-09-01,,,,2016-01-26T04:02:26,true,2,,1946,,HAM,DE RAMSAULT,62179,HERVELINGHEN,,,62444,,,,,,,,,,,,,,,,,,,2015-12-31,F,,,,,74.20Z,NAFRev2,N,1.73438,50.890558,0.71,housenumber,1946 Lieu Dit Ramsault 62179 Hervelinghen,62444_8u634b_01946,G,1946 LIEU DIT RAMSAULT,
798543377,00039,79854337700039,O,2015-07-08,,,,2018-08-16T08:57:27,false,4,CD 244,990,,RUE,PRINCIPALE,62179,HERVELINGHEN,,,62444,,,,,,,,,,,,,,,,,,,2017-05-15,F,,,,,46.19B,NAFRev2,N,1.708349,50.88364,0.93,housenumber,990 Rue Principale 62179 Hervelinghen,62444_ejx5rj_00990,G,990 RUE PRINCIPALE,
808048490,00011,80804849000011,O,2014-12-01,,,4322AZ,2018-04-20T10:00:36,true,1,,40,,RUE,FERNAND PLOUVIER,62179,HERVELINGHEN,,,62444,,,,,,,,,,,,,,,,,,,2014-12-01,A,,,,,43.22A,NAFRev2,N,1.717994,50.880341,0.93,housenumber,40 Rue Fernand Plouvier 62179 Hervelinghen,62444_0005_00040,G,40 RUE FERNAND PLOUVIER,
811879949,00014,81187994900014,O,2013-05-26,,,,2015-06-09T10:48:15,true,1,,2090,,HAM,RAMSAULT,62179,HERVELINGHEN,,,62444,,,,,,,,,,,,,,,,,,,2013-05-26,A,,,,,47.99A,NAFRev2,N,1.736125,50.890847,0.85,housenumber,2090 Lieu Dit Ramsault 62179 Hervelinghen,62444_8u634b_02090,G,2090 LIEU DIT RAMSAULT,
813137346,00017,81313734600017,O,2015-08-12,,,,2019-06-04T04:05:18,true,2,,130,,RUE,LES JARDINS DE MIL ANS,62179,HERVELINGHEN,,,62444,,,,,,,,,,,,,,,,,,,2017-11-02,F,,,,,86.21Z,NAFRev2,N,1.717292,50.881933,0.83,street,Rue les Jardins de Mil Ans 62179 Hervelinghen,62444_0011,G,RUE LES JARDINS DE MIL ANS,
814114799,00012,81411479900012,O,2015-10-01,,,,2015-10-15T09:39:42,true,1,,261,,RUE,LES JARDINS DE MIL ANS,62179,HERVELINGHEN,,,62444,,,,,,,,,,,,,,,,,,,2015-10-01,A,,,,,68.20B,NAFRev2,N,1.717292,50.881933,0.83,street,Rue les Jardins de Mil Ans 62179 Hervelinghen,62444_0011,G,RUE LES JARDINS DE MIL ANS,
815282108,00019,81528210800019,O,2015-12-03,,,,2015-12-17T04:47:19,true,1,,,,,LES JARDINS DE MIL ANS,62179,HERVELINGHEN,,,62444,,,,,,,,,,,,,,,,,,,2015-12-03,A,,,,,68.20B,NAFRev2,N,1.717109,50.881815,0.93,street,Les Jardins de Mil Ans 62179 Hervelinghen,62444_s83gv3,G,LES JARDINS DE MIL ANS,
817980741,00018,81798074100018,O,2016-02-01,,,7420ZR,2016-01-26T04:02:25,true,1,,1946,,HAM,DE RAMSAULT,62179,HERVELINGHEN,,,62444,,,,,,,,,,,,,,,,,,,2016-02-01,A,,,,STEPHANIE ET MICKAEL LOOTENS,74.20Z,NAFRev2,N,1.73438,50.890558,0.71,housenumber,1946 Lieu Dit Ramsault 62179 Hervelinghen,62444_8u634b_01946,G,1946 LIEU DIT RAMSAULT,
824193130,00013,82419313000013,O,2017-01-01,,,4322AZ,2019-11-25T09:17:26,false,2,,180,,,LES JARDINS DE MIL ANS,62179,HERVELINGHEN,,,62444,,,,,,,,,,,,,,,,,,,2019-08-01,F,,,,FIEVET.R,43.22A,NAFRev2,N,1.718815,50.881758,0.93,housenumber,180 Les Jardins de Mil Ans 62179 Hervelinghen,62444_s83gv3_00180,G,180 LES JARDINS DE MIL ANS,
828359968,00017,82835996800017,O,2013-03-30,,,,2017-03-16T03:50:48,true,1,,381,,RUE,PRINCIPALE,62179,HERVELINGHEN,,,62444,,,,,,,,,,,,,,,,,,,2013-03-30,A,,,,,68.20A,NAFRev2,N,1.716513,50.881511,0.93,housenumber,381 Rue Principale 62179 Hervelinghen,62444_ejx5rj_00381,G,381 RUE PRINCIPALE,
828649566,00019,82864956600019,O,2016-09-07,,,,2017-03-31T03:04:02,true,2,,50,,RUE,PRINCIPALE,62179,HERVELINGHEN,,,62444,,,,,,,,,,,,,,,,,,,2017-03-26,F,,,,,01.50Z,NAFRev2,N,1.720219,50.879924,0.93,housenumber,50 Rue Principale 62179 Hervelinghen,62444_ejx5rj_00050,G,50 RUE PRINCIPALE,
828705251,00019,82870525100019,O,2017-03-27,01,2018,,2020-08-25T11:34:39,true,1,,50,,RUE,PRINCIPALE,62179,HERVELINGHEN,,,62444,,,,,,,,,,,,,,,,,,,2017-03-27,A,,,,,01.50Z,NAFRev2,N,1.720219,50.879924,0.93,housenumber,50 Rue Principale 62179 Hervelinghen,62444_ejx5rj_00050,G,50 RUE PRINCIPALE,
830174686,00014,83017468600014,O,2017-04-08,,,,2021-02-23T17:49:37,true,1,,2113,,HAM,DE RAMSAULT,62179,HERVELINGHEN,,,62444,,,,,,,,,,,,,,,,,,,2017-04-08,A,,,,,86.21Z,NAFRev2,N,1.735528,50.89136,0.71,housenumber,2113 Lieu Dit Ramsault 62179 Hervelinghen,62444_8u634b_02113,G,2113 LIEU DIT RAMSAULT,
831320197,00013,83132019700013,O,2017-08-04,,,8121ZZ,2017-08-07T19:21:39,true,1,,450,B,RUE,PRINCIPALE,62179,HERVELINGHEN,,,62444,,,,,,,,,,,,,,,,,,,2017-08-04,A,,,,MARCELINE AIDE ET SERVICE,81.21Z,NAFRev2,N,1.720003,50.879858,0.73,street,Rue Principale 62179 Hervelinghen,62444_ejx5rj,G,RUE PRINCIPALE,
831590013,00015,83159001300015,O,2017-09-01,,,4331ZB,2017-08-24T03:05:54,true,1,,2040,,HAM,DE RAMSAULT,62179,HERVELINGHEN,,,62444,,,,,,,,,,,,,,,,,,,2017-09-01,A,,,,SB RENOVATION,43.31Z,NAFRev2,N,1.735278,50.890914,0.71,housenumber,2040 Lieu Dit Ramsault 62179 Hervelinghen,62444_8u634b_02040,G,2040 LIEU DIT RAMSAULT,