siren,nic,siret,statutDiffusionEtablissement,dateCreationEtablissement,trancheEffectifsEtablissement,anneeEffectifsEtablissement,activitePrincipaleRegistreMetiersEtablissement,dateDernierTraitementEtablissement,etablissementSiege,nombrePeriodesEtablissement,complementAdresseEtablissement,numeroVoieEtablissement,indiceRepetitionEtablissement,typeVoieEtablissement,libelleVoieEtablissement,codePostalEtablissement,libelleCommuneEtablissement,libelleCommuneEtrangerEtablissement,distributionSpecialeEtablissement,codeCommuneEtablissement,codeCedexEtablissement,libelleCedexEtablissement,codePaysEtrangerEtablissement,libellePaysEtrangerEtablissement,complementAdresse2Etablissement,numeroVoie2Etablissement,indiceRepetition2Etablissement,typeVoie2Etablissement,libelleVoie2Etablissement,codePostal2Etablissement,libelleCommune2Etablissement,libelleCommuneEtranger2Etablissement,distributionSpeciale2Etablissement,codeCommune2Etablissement,codeCedex2Etablissement,libelleCedex2Etablissement,codePaysEtranger2Etablissement,libellePaysEtranger2Etablissement,dateDebut,etatAdministratifEtablissement,enseigne1Etablissement,enseigne2Etablissement,enseigne3Etablissement,denominationUsuelleEtablissement,activitePrincipaleEtablissement,nomenclatureActivitePrincipaleEtablissement,caractereEmployeurEtablissement,longitude,latitude,geo_score,geo_type,geo_adresse,geo_id,geo_ligne,geo_l4,geo_l5
216208397,00010,21620839700010,O,1983-03-01,11,2018,,2020-08-25T10:18:21,true,4,,2,,RUE,CAGIN PENEL,62159,VAULX-VRAUCOURT,,,62839,,,,,,,,,,,,,,,,,,,2008-01-01,A,MAIRIE,,,,84.11Z,NAFRev2,O,2.905041,50.147405,0.94,housenumber,2 Rue Cagin Penel 62159 Vaulx-Vraucourt,62839_0180_00002,G,2 RUE CAGIN PENEL,
216208397,00028,21620839700028,O,1983-12-21,03,2018,,2020-08-25T10:18:21,false,3,,,,RUE,CAGIN PENEL,62159,VAULX-VRAUCOURT,,,62839,,,,,,,,,,,,,,,,,,,2008-01-01,A,ECOLE PRIMAIRE PUBLIQUE,,,,85.20Z,NAFRev2,N,2.905041,50.147405,0.94,street,Rue Cagin Penel 62159 Vaulx-Vraucourt,62839_0180,G,RUE CAGIN PENEL,
216208397,00036,21620839700036,O,1985-09-01,NN,,,2019-11-14T14:00:50,false,4,,,,RUE,CAGIN PENEL,62159,VAULX-VRAUCOURT,,,62839,,,,,,,,,,,,,,,,,,,1997-12-31,F,ECOLE MATERNELLE COMMUNALE,,,,80.1Z,NAF1993,N,2.905041,50.147405,0.94,street,Rue Cagin Penel 62159 Vaulx-Vraucourt,62839_0180,G,RUE CAGIN PENEL,
216208397,00044,21620839700044,O,1995-12-25,NN,,,2019-11-14T14:00:50,false,2,MAIRIE,2,,RUE,CAGIN PENEL,62159,VAULX-VRAUCOURT,,,62839,,,,,,,,,,,,,,,,,,,2008-01-01,A,SERVICE DES EAUX,,,,36.00Z,NAFRev2,N,2.905041,50.147405,0.94,housenumber,2 Rue Cagin Penel 62159 Vaulx-Vraucourt,62839_0180_00002,G,2 RUE CAGIN PENEL,
266208396,00017,26620839600017,O,1983-03-01,NN,,,2019-11-14T14:00:50,true,3,,2,,RUE,CAGIN PENEL,62159,VAULX-VRAUCOURT,,,62839,,,,,,,,,,,,,,,,,,,2008-01-01,A,CCAS,,,,88.99B,NAFRev2,N,2.905041,50.147405,0.94,housenumber,2 Rue Cagin Penel 62159 Vaulx-Vraucourt,62839_0180_00002,G,2 RUE CAGIN PENEL,
276201944,00010,27620194400010,O,,NN,,,2019-11-14T14:00:50,true,1,,2,,RUE,CAGIN PENEL,62159,VAULX-VRAUCOURT,,,62839,,,,,,,,,,,,,,,,,,,1995-12-25,F,,,,,41.0Z,NAF1993,N,2.905041,50.147405,0.94,housenumber,2 Rue Cagin Penel 62159 Vaulx-Vraucourt,62839_0180_00002,G,2 RUE CAGIN PENEL,
296201064,00015,29620106400015,O,1984-01-30,NN,,,2019-11-14T14:00:50,true,3,MAIRIE,2,,RUE,CAGIN PENEL,62159,VAULX-VRAUCOURT,,,62839,,,,,,,,,,,,,,,,,,,2008-01-01,A,,,,,42.99Z,NAFRev2,N,2.905041,50.147405,0.94,housenumber,2 Rue Cagin Penel 62159 Vaulx-Vraucourt,62839_0180_00002,G,2 RUE CAGIN PENEL,
300121720,00027,30012172000027,O,,NN,,,2019-11-14T14:00:50,true,1,,35,,FG,DE PARIS,62159,VAULX-VRAUCOURT,,,62839,,,,,,,,,,,,,,,,,,,1994-03-31,F,,,,,52.6D,NAF1993,N,2.908718,50.142977,0.81,housenumber,35 Faubourg de Paris 62159 Vaulx-Vraucourt,62839_wc9b08_00035,G,35 FAUBOURG DE PARIS,
305236226,00018,30523622600018,O,,NN,,,2019-11-14T14:00:50,true,1,,16,,,GRAND RUE,62159,VAULX-VRAUCOURT,,,62839,,,,,,,,,,,,,,,,,,,1999-06-30,F,,,,,93.0D,NAF1993,N,2.907607,50.149313,0.94,housenumber,16 Grand'Rue 62159 Vaulx-Vraucourt,62839_0385_00016,G,16 GRAND RUE,
306829318,00014,30682931800014,O,,,,,2019-11-14T14:00:50,true,1,,,,RUE,DE L EGLISE,62159,VAULX-VRAUCOURT,,,62839,,,,,,,,,,,,,,,,,,,1984-12-25,F,,,,,81.21,NAP,N,2.910346,50.148223,0.94,street,Rue de l'Eglise 62159 Vaulx-Vraucourt,62839_0280,G,RUE DE L EGLISE,
309584241,00025,30958424100025,O,1989-05-01,NN,,,2019-11-14T14:00:50,true,4,,3,,RUE,DE BEUGNY,62159,VAULX-VRAUCOURT,,,62839,,,,,,,,,,,,,,,,,,,2016-12-31,F,,,,,01.11Z,NAFRev2,N,2.911425,50.148209,0.94,housenumber,3 Rue de Beugny 62159 Vaulx-Vraucourt,62839_0140_00003,G,3 RUE DE BEUGNY,
311784268,00022,31178426800022,O,,,,,2019-11-14T14:00:50,true,1,,9,,RUE,DE BAPAUME,62159,VAULX-VRAUCOURT,,,62839,,,,,,,,,,,,,,,,,,,1984-12-25,F,,,,,84.12,NAP,N,2.90637,50.146626,0.94,housenumber,9 Rue de Bapaume 62159 Vaulx-Vraucourt,62839_0060_00009,G,9 RUE DE BAPAUME,
312244106,00018,31224410600018,O,,NN,,,2019-11-14T14:00:50,true,1,,6,,RUE,DE BAPAUME,62159,VAULX-VRAUCOURT,,,62839,,,,,,,,,,,,,,,,,,,1996-12-31,F,,,,,52.2C,NAF1993,N,2.908623,50.147897,0.94,housenumber,6 Rue de Bapaume 62159 Vaulx-Vraucourt,62839_0060_00006,G,6 RUE DE BAPAUME,
314329509,00017,31432950900017,O,,NN,,,2019-11-14T14:00:50,true,1,,14,,RUE,DU FAUBOURG DE PARIS,62159,VAULX-VRAUCOURT,,,62839,,,,,,,,,,,,,,,,,,,,F,,,,,01.00,NAP,N,2.908936,50.143442,0.71,housenumber,14 Faubourg de Paris 62159 Vaulx-Vraucourt,62839_wc9b08_00014,G,14 FAUBOURG DE PARIS,
314685348,00018,31468534800018,O,,,,,2019-11-14T14:00:50,true,1,,4,,RTE,DE DOUAI,62159,VAULX-VRAUCOURT,,,62839,,,,,,,,,,,,,,,,,,,1993-10-30,F,,,,,15.3E,NAF1993,N,2.889679,50.153865,0.81,housenumber,4 Route de Douai 62159 Vaulx-Vraucourt,62839_0220_00004,G,4 ROUTE DE DOUAI,
315255448,00013,31525544800013,O,1979-01-01,NN,,,2019-11-14T14:00:50,true,3,,,,RUE,DE LAGNICOURT,62159,VAULX-VRAUCOURT,,,62839,,,,,,,,,,,,,,,,,,,2008-01-01,A,,,,,85.20Z,NAFRev2,N,2.912235,50.1485,0.94,street,Rue de Lagnicourt 62159 Vaulx-Vraucourt,62839_0440,G,RUE DE LAGNICOURT,
315851949,00018,31585194900018,O,1979-01-01,NN,,,2019-11-14T14:00:50,true,1,,20,,RUE,DE LA CHAPELLE,62159,VAULX-VRAUCOURT,,,62839,,,,,,,,,,,,,,,,,,,1998-01-30,F,,,,,01.4A,NAF1993,N,2.900253,50.15372,0.94,housenumber,20 Rue de la Chapelle 62159 Vaulx-Vraucourt,62839_0185_00020,G,20 RUE DE LA CHAPELLE,
316936194,00018,31693619400018,O,,,,,2019-11-14T14:00:50,true,1,,1,,PL,DU MONUMENT,62159,VAULX-VRAUCOURT,,,62839,,,,,,,,,,,,,,,,,,,1985-12-25,F,,,,,62.11,NAP,N,2.902419,50.146006,0.36,housenumber,1 Rue du Moulin 62159 Vaulx-Vraucourt,62839_0560_00001,G,1 RUE DU MOULIN,
317316867,00017,31731686700017,O,1979-01-01,NN,,,2019-11-14T14:00:50,true,4,,1,,RUE,DE L EGALITE,62159,VAULX-VRAUCOURT,,,62839,,,,,,,,,,,,,,,,,,,2004-12-29,F,,,,,01.4A,NAFRev1,N,2.905209,50.146969,0.94,housenumber,1 Rue de l'Egalité 62159 Vaulx-Vraucourt,62839_0270_00001,G,1 RUE DE L EGALITE,
318260304,00031,31826030400031,O,,NN,,,2019-11-14T14:00:50,true,1,,8,,RTE,DE DOUAI,62159,VAULX-VRAUCOURT,,,62839,,,,,,,,,,,,,,,,,,,1987-01-05,F,,,,,67.01,NAP,N,2.889267,50.152758,0.81,housenumber,8 Route de Douai 62159 Vaulx-Vraucourt,62839_0220_00008,G,8 ROUTE DE DOUAI,
318703618,00013,31870361800013,O,1980-01-01,NN,,,2019-11-14T14:00:50,true,3,,30,,RUE,DE BAPAUME,62159,VAULX-VRAUCOURT,,,62839,,,,,,,,,,,,,,,,,,,2008-01-01,A,,,,,56.30Z,NAFRev2,N,2.905687,50.146411,0.94,housenumber,30 Rue de Bapaume 62159 Vaulx-Vraucourt,62839_0060_00030,G,30 RUE DE BAPAUME,
318703618,00021,31870361800021,O,1976-01-01,NN,,,2019-11-14T14:00:50,false,4,,30,,RUE,DE BAPAUME,62159,VAULX-VRAUCOURT,,,62839,,,,,,,,,,,,,,,,,,,2010-12-31,F,,,,,01.11Z,NAFRev2,N,2.905687,50.146411,0.94,housenumber,30 Rue de Bapaume 62159 Vaulx-Vraucourt,62839_0060_00030,G,30 RUE DE BAPAUME,
318858578,00012,31885857800012,O,,,,,2019-11-14T14:00:50,true,1,,67,,,GRAND RUE,62159,VAULX-VRAUCOURT,,,62839,,,,,,,,,,,,,,,,,,,1990-05-11,F,,,,,38.40,NAP,N,2.900867,50.152507,0.94,housenumber,67 Grand'Rue 62159 Vaulx-Vraucourt,62839_0385_00067,G,67 GRAND RUE,
320069826,00016,32006982600016,O,,NN,,,2019-11-14T14:00:50,true,1,,44,,,GRAND RUE,62159,VAULX-VRAUCOURT,,,62839,,,,,,,,,,,,,,,,,,,1991-09-30,F,,,,,62.41,NAP,N,2.904858,50.151466,0.94,housenumber,44 Grand'Rue 62159 Vaulx-Vraucourt,62839_0385_00044,G,44 GRAND RUE,
320497480,00048,32049748000048,O,1998-03-31,,,,2019-11-14T14:00:50,false,3,,4,,RTE,DE DOUAI,62159,VAULX-VRAUCOURT,,,62839,,,,,,,,,,,,,,,,,,,1999-11-02,F,,,,,51.3T,NAF1993,N,2.889679,50.153865,0.81,housenumber,4 Route de Douai 62159 Vaulx-Vraucourt,62839_0220_00004,G,4 ROUTE DE DOUAI,
320601032,00040,32060103200040,O,1999-03-04,NN,,,2019-11-14T14:00:50,true,4,,16,,RUE,DE LA CHAPELLE,62159,VAULX-VRAUCOURT,,,62839,,,,,,,,,,,,,,,,,,,2014-12-31,F,,,,,45.32Z,NAFRev2,N,2.901651,50.153729,0.94,housenumber,16 Rue de la Chapelle 62159 Vaulx-Vraucourt,62839_0185_00016,G,16 RUE DE LA CHAPELLE,
322392325,00013,32239232500013,O,,,,,2019-11-14T14:00:50,true,1,,5,,RUE,DU PAPE,62159,VAULX-VRAUCOURT,,,62839,,,,,,,,,,,,,,,,,,,1984-12-25,F,,,,,58.09,NAP,N,2.907727,50.146639,0.94,housenumber,5 Rue du Pape 62159 Vaulx-Vraucourt,62839_0600_00005,G,5 RUE DU PAPE,
323685925,00022,32368592500022,O,,,,,2019-11-14T14:00:50,true,1,,,,RTE,DE DOUAI,62159,VAULX-VRAUCOURT,,,62839,,,,,,,,,,,,,,,,,,,1993-10-30,F,,,,,15.3E,NAF1993,N,2.890654,50.156088,0.78,street,Route de Douai 62159 Vaulx-Vraucourt,62839_0220,G,ROUTE DE DOUAI,
323908566,00025,32390856600025,O,1987-10-01,NN,,,2019-11-14T14:00:50,false,3,,1,,RUE,DU STADE,62159,VAULX-VRAUCOURT,,,62839,,,,,,,,,,,,,,,,,,,1992-12-31,F,,,,,60.2L,NAF1993,N,2.905598,50.149578,0.94,housenumber,1 Rue du Stade 62159 Vaulx-Vraucourt,62839_0690_00001,G,1 RUE DU STADE,
324407782,00089,32440778200089,O,2013-01-01,,,,2019-11-14T14:00:50,true,1,,4,,RUE,NEUVE,62159,VAULX-VRAUCOURT,,,62839,,,,,,,,,,,,,,,,,,,2013-01-01,F,,,,,86.21Z,NAFRev2,N,2.905748,50.14802,0.94,housenumber,4 Rue Neuve 62159 Vaulx-Vraucourt,62839_0568_00004,G,4 RUE NEUVE,
325074730,00020,32507473000020,O,1993-11-01,NN,,,2021-02-23T10:47:44,true,3,,27,,RUE,DE BAPAUME,62159,VAULX-VRAUCOURT,,,62839,,,,,,,,,,,,,,,,,,,2008-01-01,A,,,,,01.11Z,NAFRev2,N,2.904802,50.145223,0.94,housenumber,27 Rue de Bapaume 62159 Vaulx-Vraucourt,62839_0060_00027,G,27 RUE DE BAPAUME,
325701845,00027,32570184500027,O,,NN,,,2019-11-14T14:00:50,true,1,,8,,RUE,DE L EGLISE,62159,VAULX-VRAUCOURT,,,62839,,,,,,,,,,,,,,,,,,,1994-02-04,F,,,,,45.3A,NAF1993,N,2.909082,50.146585,0.94,housenumber,8 Rue de l'Eglise 62159 Vaulx-Vraucourt,62839_0280_00008,G,8 RUE DE L EGLISE,
326731841,00028,32673184100028,O,,NN,,,2019-11-14T14:00:50,true,1,,8,,RTE,DE DOUAI,62159,VAULX-VRAUCOURT,,,62839,,,,,,,,,,,,,,,,,,,1992-06-30,F,,,,,55.4B,NAF1993,N,2.889267,50.152758,0.81,housenumber,8 Route de Douai 62159 Vaulx-Vraucourt,62839_0220_00008,G,8 ROUTE DE DOUAI,
327278610,00016,32727861000016,O,,NN,,,2019-11-14T14:00:50,true,1,,8,,RUE,DU STADE,62159,VAULX-VRAUCOURT,,,62839,,,,,,,,,,,,,,,,,,,,F,,,,,62.45,NAP,N,2.905524,50.149594,0.94,housenumber,8 Rue du Stade 62159 Vaulx-Vraucourt,62839_0690_00008,G,8 RUE DU STADE,
327636551,00019,32763655100019,O,,,,,2019-11-14T14:00:50,true,1,,64,,,GRAND PLACE,62159,VAULX-VRAUCOURT,,,62839,,,,,,,,,,,,,,,,,,,1985-12-25,F,,,,,62.11,NAP,N,4.6143353,45.3222219,0.9,poi.bar,Grand Place (Bar) Saint-Julien-Molin-Molette,https://osm.org/node/2869829429,G,,
330177197,00010,33017719700010,O,1984-04-02,,,,2019-11-14T14:00:50,true,1,,12,,RUE,DES HAIES,62159,VAULX-VRAUCOURT,,,62839,,,,,,,,,,,,,,,,,,,2001-03-02,F,,,,,01.4A,NAF1993,N,2.900137,50.151677,0.94,housenumber,12 Rue des Haies 62159 Vaulx-Vraucourt,62839_0388_00012,G,12 RUE DES HAIES,
330274556,00035,33027455600035,O,1997-07-01,NN,,,2019-11-14T14:00:50,false,4,,,,,GRAND RUE,62159,VAULX-VRAUCOURT,,,62839,,,,,,,,,,,,,,,,,,,2017-06-30,F,,,,,46.21Z,NAFRev2,N,2.908437,50.148693,0.94,street,Grand'Rue 62159 Vaulx-Vraucourt,62839_0385,G,GRAND RUE,
330968181,00017,33096818100017,O,1984-10-27,NN,,,2019-11-14T14:00:50,true,6,,14,B,GR,GRAND RUE,62159,VAULX-VRAUCOURT,,,62839,,,,,,,,,,,,,,,,,,,2011-12-31,F,,,,,45.20A,NAFRev2,N,2.908024,50.14914,0.83,interpolation,14 Grand'Rue 62159 Vaulx-Vraucourt,,G,12 GRAND RUE,
332622406,00012,33262240600012,O,,,,,2019-11-14T14:00:50,true,1,,13,,RUE,DES HAIES,62159,VAULX-VRAUCOURT,,,62839,,,,,,,,,,,,,,,,,,,,F,,,,,55.60,NAP,N,2.904142,50.150608,0.94,housenumber,13 Rue des Haies 62159 Vaulx-Vraucourt,62839_0388_00013,G,13 RUE DES HAIES,
333270809,00010,33327080900010,O,1985-06-01,02,2018,,2020-08-25T10:36:03,false,4,,7,,RUE,DE LA CHAPELLE,62159,VAULX-VRAUCOURT,,,62839,,,,,,,,,,,,,,,,,,,2012-12-31,A,,,,,01.50Z,NAFRev2,O,2.901402,50.153789,0.94,housenumber,7 Rue de la Chapelle 62159 Vaulx-Vraucourt,62839_0185_00007,G,7 RUE DE LA CHAPELLE,
333270809,00036,33327080900036,O,2001-05-01,NN,,,2019-11-14T14:00:50,true,3,,56,,,GRAND'RUE,62159,VAULX-VRAUCOURT,,,62839,,,,,,,,,,,,,,,,,,,2008-01-01,A,,,,,49.41B,NAFRev2,N,2.902625,50.152381,0.94,housenumber,56 Grand'Rue 62159 Vaulx-Vraucourt,62839_0385_00056,G,56 GRAND RUE,
333758803,00014,33375880300014,O,1985-10-01,,,,2019-11-14T14:00:50,false,4,,1,,RUE,DE BAPAUME,62159,VAULX-VRAUCOURT,,,62839,,,,,,,,,,,,,,,,,,,1992-12-25,F,,,,,52.3A,NAF1993,N,2.909522,50.1478,0.94,housenumber,1 Rue de Bapaume 62159 Vaulx-Vraucourt,62839_0060_00001,G,1 RUE DE BAPAUME,
334510732,00012,33451073200012,O,,NN,,,2019-11-14T14:00:50,true,1,,17,,RUE,D'ESCOUT ST MEIN,62159,VAULX-VRAUCOURT,,,62839,,,,,,,,,,,,,,,,,,,,F,,,,,57.01,NAP,N,2.911315,50.150886,0.71,housenumber,17 Rue d'Ecoust-saint-mein 62159 Vaulx-Vraucourt,62839_0260_00017,G,17 RUE D ECOUST SAINT MEIN,
337839450,00018,33783945000018,O,1986-04-18,NN,,,2019-11-14T14:00:50,true,3,,11,,,FAUBOURG DE PARIS,62159,VAULX-VRAUCOURT,,,62839,,,,,,,,,,,,,,,,,,,2008-01-01,A,,,,,01.11Z,NAFRev2,N,2.912016,50.146467,0.94,housenumber,11 Faubourg de Paris 62159 Vaulx-Vraucourt,62839_wc9b08_00011,G,11 FAUBOURG DE PARIS,
339022857,00017,33902285700017,O,1986-10-01,NN,,,2019-11-14T14:00:50,true,3,,,,,,62159,VAULX-VRAUCOURT,,,62839,,,,,,,,,,,,,,,,,,,2008-01-01,A,,,,,01.11Z,NAFRev2,N,,,0,,,,,,
340034941,00021,34003494100021,O,1997-02-28,NN,,4722ZB,2019-11-14T14:00:50,false,5,,5,,,GRAND RUE,62159,VAULX-VRAUCOURT,,,62839,,,,,,,,,,,,,,,,,,,2015-03-31,F,,,,,47.11B,NAFRev2,N,2.908005,50.148953,0.94,housenumber,5 Grand'Rue 62159 Vaulx-Vraucourt,62839_0385_00005,G,5 GRAND RUE,
340232354,00019,34023235400019,O,1987-01-01,NN,,,2019-11-14T14:00:50,true,3,,16,,,GRAND RUE,62159,VAULX-VRAUCOURT,,,62839,,,,,,,,,,,,,,,,,,,2008-01-01,A,,,,,86.90D,NAFRev2,N,2.907607,50.149313,0.94,housenumber,16 Grand'Rue 62159 Vaulx-Vraucourt,62839_0385_00016,G,16 GRAND RUE,
340647247,00014,34064724700014,O,1987-03-15,NN,,,2019-11-14T14:00:50,true,1,,16,,,GRAND RUE,62159,VAULX-VRAUCOURT,,,62839,,,,,,,,,,,,,,,,,,,2001-12-31,F,,,,,28.6F,NAF1993,O,2.907607,50.149313,0.94,housenumber,16 Grand'Rue 62159 Vaulx-Vraucourt,62839_0385_00016,G,16 GRAND RUE,
340963453,00014,34096345300014,O,,NN,,,2019-11-14T14:00:50,true,1,,12,,RUE,DES HAIES,62159,VAULX-VRAUCOURT,,,62839,,,,,,,,,,,,,,,,,,,1990-03-31,F,,,,,01.1A,NAF1993,N,2.900137,50.151677,0.94,housenumber,12 Rue des Haies 62159 Vaulx-Vraucourt,62839_0388_00012,G,12 RUE DES HAIES,
341019396,00017,34101939600017,O,1987-04-16,NN,,,2019-11-14T14:00:50,true,4,,12,,,GRAND RUE,62159,VAULX-VRAUCOURT,,,62839,,,,,,,,,,,,,,,,,,,2008-01-01,A,,,,,01.11Z,NAFRev2,N,2.908441,50.148967,0.94,housenumber,12 Grand'Rue 62159 Vaulx-Vraucourt,62839_0385_00012,G,12 GRAND RUE,
341260644,00016,34126064400016,O,1987-05-01,NN,,,2019-11-14T14:00:50,true,4,,77,,,GRAND RUE,62159,VAULX-VRAUCOURT,,,62839,,,,,,,,,,,,,,,,,,,2000-12-31,F,,,,,01.1A,NAF1993,N,2.900133,50.152852,0.94,housenumber,77 Grand'Rue 62159 Vaulx-Vraucourt,62839_0385_00077,G,77 GRAND RUE,
342095353,00278,34209535300278,O,1990-07-01,,,,2019-11-14T14:00:50,false,4,,3,,RTE,DE DOUAI,62159,VAULX-VRAUCOURT,,,62839,,,,,,,,,,,,,,,,,,,1992-12-25,F,,,,,51.2A,NAF1993,N,2.890654,50.156088,0.81,housenumber,3 Route de Douai 62159 Vaulx-Vraucourt,62839_0220_00003,G,3 ROUTE DE DOUAI,
342258043,00070,34225804300070,O,2000-04-27,NN,,,2019-11-14T14:00:50,true,4,,4,,RTE,DE DOUAI,62159,VAULX-VRAUCOURT,,,62839,,,,,,,,,,,,,,,,,,,2005-12-31,F,,,,,15.3E,NAFRev1,O,2.889679,50.153865,0.81,housenumber,4 Route de Douai 62159 Vaulx-Vraucourt,62839_0220_00004,G,4 ROUTE DE DOUAI,
342269255,00010,34226925500010,O,1987-10-01,NN,,,2019-11-14T14:00:50,true,5,,2,,RUE,DE BAPAUME,62159,VAULX-VRAUCOURT,,,62839,,,,,,,,,,,,,,,,,,,2008-01-01,A,,,,,56.30Z,NAFRev2,N,2.909309,50.148094,0.94,housenumber,2 Rue de Bapaume 62159 Vaulx-Vraucourt,62839_0060_00002,G,2 RUE DE BAPAUME,
342801073,00012,34280107300012,O,,NN,,,2019-11-14T14:00:50,true,1,,1,,RUE,BELLOTTE,62159,VAULX-VRAUCOURT,,,62839,,,,,,,,,,,,,,,,,,,1988-12-31,F,,,,,77.14,NAP,N,2.907007,50.145878,0.94,housenumber,1 Rue Bellotte 62159 Vaulx-Vraucourt,62839_0120_00001,G,1 RUE BELLOTTE,
342864626,00011,34286462600011,O,,NN,,,2019-11-14T14:00:50,true,1,,38,,RUE,DE BAPAUME,62159,VAULX-VRAUCOURT,,,62839,,,,,,,,,,,,,,,,,,,1989-05-31,F,,,,,01.1A,NAF1993,N,2.904591,50.145145,0.94,housenumber,38 Rue de Bapaume 62159 Vaulx-Vraucourt,62839_0060_00038,G,38 RUE DE BAPAUME,
344930557,00014,34493055700014,O,,NN,,,2019-11-14T14:00:50,true,1,,5,,,GRAND RUE,62159,VAULX-VRAUCOURT,,,62839,,,,,,,,,,,,,,,,,,,1996-12-31,F,,,,,52.1B,NAF1993,N,2.908005,50.148953,0.94,housenumber,5 Grand'Rue 62159 Vaulx-Vraucourt,62839_0385_00005,G,5 GRAND RUE,
345093918,00018,34509391800018,O,1988-05-18,NN,,,2019-11-14T14:00:50,true,4,VAULX VRAUCOURT,7,,RUE,DU STADE,62159,VAULX-VRAUCOURT,,,62839,,,,,,,,,,,,,,,,,,,2018-03-28,F,,,,,68.20B,NAFRev2,N,2.904969,50.148952,0.94,housenumber,7 Rue du Stade 62159 Vaulx-Vraucourt,62839_0690_00007,G,7 RUE DU STADE,
345341739,00018,34534173900018,O,,NN,,,2019-11-14T14:00:50,true,1,,18,,FG,DE PARIS,62159,VAULX-VRAUCOURT,,,62839,,,,,,,,,,,,,,,,,,,1989-05-22,F,,,,,55.73,NAP,N,2.90852,50.142765,0.81,housenumber,18 Faubourg de Paris 62159 Vaulx-Vraucourt,62839_wc9b08_00018,G,18 FAUBOURG DE PARIS,
351617576,00027,35161757600027,O,,NN,,,2019-11-14T14:00:50,true,1,,16,,,RTE DE DOUAI,62159,VAULX-VRAUCOURT,,,62839,,,,,,,,,,,,,,,,,,,1990-08-31,F,,,,,77.03,NAP,N,2.892624,50.156581,0.82,housenumber,16 Route de Douai 62159 Vaulx-Vraucourt,62839_0220_00016,G,16 ROUTE DE DOUAI,
353815848,00018,35381584800018,O,,NN,,,2019-11-14T14:00:50,true,1,,5,,RUE,DE LA CHAPELLE,62159,VAULX-VRAUCOURT,,,62839,,,,,,,,,,,,,,,,,,,2001-07-04,F,,,,,52.6E,NAF1993,N,2.902342,50.153163,0.94,housenumber,5 Rue de la Chapelle 62159 Vaulx-Vraucourt,62839_0185_00005,G,5 RUE DE LA CHAPELLE,
353876006,00019,35387600600019,O,1989-10-01,NN,,,2019-12-06T13:08:49,true,4,,12,,RUE,DE HAIES,62159,VAULX-VRAUCOURT,,,62839,,,,,,,,,,,,,,,,,,,2019-02-28,F,,,,,01.11Z,NAFRev2,N,2.900137,50.151677,0.83,housenumber,12 Rue des Haies 62159 Vaulx-Vraucourt,62839_0388_00012,G,12 RUE DES HAIES,
356000000,30134,35600000030134,O,2012-01-01,,,,2019-11-14T14:00:50,false,3,,9,,RUE,DE L EGLISE,62159,VAULX-VRAUCOURT,,,62839,,,,,,,,,,,,,,,,,,,2015-12-31,F,LA POSTE,,,,53.10Z,NAFRev2,N,2.909667,50.147293,0.94,housenumber,9 Rue de l'Eglise 62159 Vaulx-Vraucourt,62839_0280_00009,G,9 RUE DE L EGLISE,
356000315,03689,35600031503689,O,1991-01-01,NN,,,2019-11-14T14:00:50,false,4,,9,,RUE,DE L'EGLISE,62159,VAULX-VRAUCOURT,,,62839,,,,,,,,,,,,,,,,,,,2009-03-18,F,BUREAU DE POSTE,,,,53.10Z,NAFRev2,O,2.909667,50.147293,0.94,housenumber,9 Rue de l'Eglise 62159 Vaulx-Vraucourt,62839_0280_00009,G,9 RUE DE L EGLISE,
375780541,00070,37578054100070,O,1993-10-30,,,,2019-11-14T14:00:50,true,4,,4,,RTE,DE DOUAI,62159,VAULX-VRAUCOURT,,,62839,,,,,,,,,,,,,,,,,,,2000-12-25,F,,,,,15.3E,NAF1993,N,2.889679,50.153865,0.81,housenumber,4 Route de Douai 62159 Vaulx-Vraucourt,62839_0220_00004,G,4 ROUTE DE DOUAI,
377815949,00013,37781594900013,O,,NN,,,2019-11-14T14:00:50,true,1,,5,,RUE,DE L EGLISE,62159,VAULX-VRAUCOURT,,,62839,,,,,,,,,,,,,,,,,,,1993-01-01,F,,,,,01.1A,NAF1993,N,2.910001,50.147827,0.94,housenumber,5 Rue de l'Eglise 62159 Vaulx-Vraucourt,62839_0280_00005,G,5 RUE DE L EGLISE,
379307820,00017,37930782000017,O,1990-09-01,,,,2020-10-07T04:14:02,true,4,,16,,RTE,DE DOUAI,62159,VAULX-VRAUCOURT,,,62839,,,,,,,,,,,,,,,,,,,1993-01-16,F,,,,,52.6E,NAF1993,N,2.892624,50.156581,0.82,housenumber,16 Route de Douai 62159 Vaulx-Vraucourt,62839_0220_00016,G,16 ROUTE DE DOUAI,
381290493,00018,38129049300018,O,1991-04-02,NN,,,2019-11-14T14:00:50,true,1,,,,RUE,DES HAIES,62159,VAULX-VRAUCOURT,,,62839,,,,,,,,,,,,,,,,,,,1999-11-17,F,,,,,60.2M,NAF1993,O,2.905385,50.150258,0.94,street,Rue des Haies 62159 Vaulx-Vraucourt,62839_0388,G,RUE DES HAIES,
382340099,00011,38234009900011,O,,NN,,,2019-11-14T14:00:50,true,1,,40,,,GRAND RUE,62159,VAULX-VRAUCOURT,,,62839,,,,,,,,,,,,,,,,,,,1991-09-30,F,,,,,62.46,NAP,N,2.905277,50.151254,0.94,housenumber,40 Grand'Rue 62159 Vaulx-Vraucourt,62839_0385_00040,G,40 GRAND RUE,
383112737,00010,38311273700010,O,1991-10-01,NN,,,2019-11-14T14:00:50,true,6,,44,,,GRAND RUE,62159,VAULX-VRAUCOURT,,,62839,,,,,,,,,,,,,,,,,,,2017-12-31,F,,,,,47.81Z,NAFRev2,N,2.904858,50.151466,0.94,housenumber,44 Grand'Rue 62159 Vaulx-Vraucourt,62839_0385_00044,G,44 GRAND RUE,
383224300,00012,38322430000012,O,,NN,,,2019-11-14T14:00:50,true,1,,,,RUE,DE DOUAI,62159,VAULX-VRAUCOURT,,,62839,,,,,,,,,,,,,,,,,,,1994-09-30,F,,,,,70.2A,NAF1993,N,2.890654,50.156088,0.71,street,Route de Douai 62159 Vaulx-Vraucourt,62839_0220,G,ROUTE DE DOUAI,
383647286,00012,38364728600012,O,1991-10-01,NN,,,2019-11-14T14:00:50,true,1,,4,,RUE,DE L EGLISE,62159,VAULX-VRAUCOURT,,,62839,,,,,,,,,,,,,,,,,,,1999-03-31,F,,,,,55.4B,NAF1993,N,2.909322,50.146943,0.94,housenumber,4 Rue de l'Eglise 62159 Vaulx-Vraucourt,62839_0280_00004,G,4 RUE DE L EGLISE,
385110234,00544,38511023400544,O,1992-11-13,,,,2019-11-14T14:00:50,false,3,,,,RTE,D'ECOUST ST MEIN,62159,VAULX-VRAUCOURT,,,62839,,,,,,,,,,,,,,,,,,,1997-05-01,F,,,,,51.2A,NAF1993,N,2.910599,50.148475,0.76,street,Rue d'Ecoust-saint-mein 62159 Vaulx-Vraucourt,62839_0260,G,RUE D ECOUST SAINT MEIN,
385110234,01054,38511023401054,O,1992-11-13,,,,2019-11-14T14:00:50,false,4,,3,,RTE,DE DOUAI,62159,VAULX-VRAUCOURT,,,62839,,,,,,,,,,,,,,,,,,,1997-05-01,F,,,,,51.2A,NAF1993,N,2.890654,50.156088,0.81,housenumber,3 Route de Douai 62159 Vaulx-Vraucourt,62839_0220_00003,G,3 ROUTE DE DOUAI,
385262902,00013,38526290200013,O,1992-04-02,NN,,,2019-11-14T14:00:50,true,5,,7,,GR,GRAND RUE,62159,VAULX-VRAUCOURT,,,62839,,,,,,,,,,,,,,,,,,,2007-10-15,F,,,,,45.4D,NAFRev1,N,2.907186,50.149447,0.82,housenumber,7 Grand'Rue 62159 Vaulx-Vraucourt,62839_0385_00007,G,7 GRAND RUE,
385262902,00054,38526290200054,O,1997-04-01,NN,,,2019-11-14T14:00:50,false,3,,17,,RUE,D'ECOUST ST MEIN,62159,VAULX-VRAUCOURT,,,62839,,,,,,,,,,,,,,,,,,,2007-10-15,F,,,,,63.1E,NAFRev1,O,2.911315,50.150886,0.89,housenumber,17 Rue d'Ecoust-saint-mein 62159 Vaulx-Vraucourt,62839_0260_00017,G,17 RUE D ECOUST SAINT MEIN,
388054116,00016,38805411600016,O,1992-07-01,02,2018,,2020-08-25T10:23:09,true,4,,1,,RUE,DE BAPAUME,62159,VAULX-VRAUCOURT,,,62839,,,,,,,,,,,,,,,,,,,2008-01-01,A,,,,,47.73Z,NAFRev2,O,2.909522,50.1478,0.94,housenumber,1 Rue de Bapaume 62159 Vaulx-Vraucourt,62839_0060_00001,G,1 RUE DE BAPAUME,
388615338,00018,38861533800018,O,,NN,,,2019-11-14T14:00:50,true,1,,,,RTE,DE DOUAI,62159,VAULX-VRAUCOURT,,,62839,,,,,,,,,,,,,,,,,,,1995-12-01,F,,,,,51.3T,NAF1993,O,2.890654,50.156088,0.78,street,Route de Douai 62159 Vaulx-Vraucourt,62839_0220,G,ROUTE DE DOUAI,
388755357,00026,38875535700026,O,,,,,2019-11-14T14:00:50,true,1,,23,,,GRAND RUE,62159,VAULX-VRAUCOURT,,,62839,,,,,,,,,,,,,,,,,,,1994-06-17,F,,,,,52.6G,NAF1993,N,2.905634,50.150731,0.94,housenumber,23 Grand'Rue 62159 Vaulx-Vraucourt,62839_0385_00023,G,23 GRAND RUE,
389679978,00012,38967997800012,O,1900-01-01,NN,,,2019-11-14T14:00:50,false,4,,9,,,CLOS DU PARADIS,62159,VAULX-VRAUCOURT,,,62839,,,,,,,,,,,,,,,,,,,1996-05-03,F,,,,,60.2M,NAF1993,O,2.906695,50.153022,0.94,housenumber,9 Clos du Paradis 62159 Vaulx-Vraucourt,62839_0070_00009,G,9 CLOS DU PARADIS,