siren,nic,siret,statutDiffusionEtablissement,dateCreationEtablissement,trancheEffectifsEtablissement,anneeEffectifsEtablissement,activitePrincipaleRegistreMetiersEtablissement,dateDernierTraitementEtablissement,etablissementSiege,nombrePeriodesEtablissement,complementAdresseEtablissement,numeroVoieEtablissement,indiceRepetitionEtablissement,typeVoieEtablissement,libelleVoieEtablissement,codePostalEtablissement,libelleCommuneEtablissement,libelleCommuneEtrangerEtablissement,distributionSpecialeEtablissement,codeCommuneEtablissement,codeCedexEtablissement,libelleCedexEtablissement,codePaysEtrangerEtablissement,libellePaysEtrangerEtablissement,complementAdresse2Etablissement,numeroVoie2Etablissement,indiceRepetition2Etablissement,typeVoie2Etablissement,libelleVoie2Etablissement,codePostal2Etablissement,libelleCommune2Etablissement,libelleCommuneEtranger2Etablissement,distributionSpeciale2Etablissement,codeCommune2Etablissement,codeCedex2Etablissement,libelleCedex2Etablissement,codePaysEtranger2Etablissement,libellePaysEtranger2Etablissement,dateDebut,etatAdministratifEtablissement,enseigne1Etablissement,enseigne2Etablissement,enseigne3Etablissement,denominationUsuelleEtablissement,activitePrincipaleEtablissement,nomenclatureActivitePrincipaleEtablissement,caractereEmployeurEtablissement,longitude,latitude,geo_score,geo_type,geo_adresse,geo_id,geo_ligne,geo_l4,geo_l5
217701937,00013,21770193700013,O,1983-03-01,02,2018,,2020-08-25T10:19:07,true,4,,,,RUE,DES FRANCS BOURGEOIS,77165,FORFRY,,,77193,,,,,,,,,,,,,,,,,,,2008-01-01,A,MAIRIE,,,,84.11Z,NAFRev2,O,2.848263,49.057687,0.93,street,Rue des Francs Bourgeois 77165 Forfry,77193_0060,G,RUE DES FRANCS BOURGEOIS,
217701937,00021,21770193700021,O,1983-12-21,NN,,,2016-04-26T01:26:40,false,3,,,,RUE,DES FRANCS BOURGEOIS,77165,FORFRY,,,77193,,,,,,,,,,,,,,,,,,,2008-01-01,A,ECOLE ELEMENTAIRE PUBLIQUE,,,,85.20Z,NAFRev2,N,2.848263,49.057687,0.93,street,Rue des Francs Bourgeois 77165 Forfry,77193_0060,G,RUE DES FRANCS BOURGEOIS,
257704320,00023,25770432000023,O,1993-07-01,NN,,,2010-04-18T03:17:16,false,5,MAIRIE,,,RUE,FRANCS BOURGEOIS,77165,FORFRY,,,77193,,,,,,,,,,,,,,,,,,,2008-09-30,F,,,,,84.12Z,NAFRev2,O,2.848263,49.057687,0.88,street,Rue des Francs Bourgeois 77165 Forfry,77193_0060,G,RUE DES FRANCS BOURGEOIS,
267703999,00016,26770399900016,O,1983-03-01,NN,,,2010-06-26T03:15:56,true,3,,,,,MAIRIE,77165,FORFRY,,,77193,,,,,,,,,,,,,,,,,,,2008-01-01,A,CCAS,,,,88.99B,NAFRev2,N,3.0709671,50.6304695,0.92,poi.townhall,Hôtel de Ville Lille,https://osm.org/way/40917078,G,,
297704843,00012,29770484300012,O,1997-01-01,NN,,,2008-01-04T19:07:59,true,3,,,,RUE,FRANCS BOURGEOIS,77165,FORFRY,,,77193,,,,,,,,,,,,,,,,,,,2008-01-01,A,,,,,42.99Z,NAFRev2,O,2.848263,49.057687,0.88,street,Rue des Francs Bourgeois 77165 Forfry,77193_0060,G,RUE DES FRANCS BOURGEOIS,
313373573,00044,31337357300044,O,1998-01-19,NN,,4932ZA,2015-06-11T04:18:04,true,4,,6,,RUE,DE CONDE,77165,FORFRY,,,77193,,,,,,,,,,,,,,,,,,,2015-05-31,F,,,,,49.32Z,NAFRev2,N,2.847118,49.058724,0.93,housenumber,6 Rue de Condé 77165 Forfry,77193_0020_00006,G,6 RUE DE CONDE,
325503019,00037,32550301900037,O,2005-10-24,NN,,,2014-07-08T00:30:02,false,5,,6,,RUE,D EN HAUT,77165,FORFRY,,,77193,,,,,,,,,,,,,,,,,,,2008-12-15,F,,,,,43.22A,NAFRev2,N,2.846133,49.056272,0.93,housenumber,6 Rue d'En Haut 77165 Forfry,77193_b037_00006,G,6 RUE D EN HAUT,
328081252,00038,32808125200038,O,1997-12-01,,,,,false,3,,30,,RUE,DE CONDE,77165,FORFRY,,,77193,,,,,,,,,,,,,,,,,,,1999-03-31,F,TRANSPORTS GOELE EXPRESS,,,,60.2L,NAF1993,N,2.850797,49.061739,0.93,housenumber,30 Rue de Condé 77165 Forfry,77193_0020_00030,G,30 RUE DE CONDE,
328317581,00010,32831758100010,O,,NN,,,,true,1,,6,,RUE,DE CONDE,77165,FORFRY,,,77193,,,,,,,,,,,,,,,,,,,1987-03-31,F,,,,,55.10,NAP,N,2.847118,49.058724,0.93,housenumber,6 Rue de Condé 77165 Forfry,77193_0020_00006,G,6 RUE DE CONDE,
331348987,00016,33134898700016,O,1984-12-01,,,,,true,3,,,,CHE,DEPARTEMENTAL N 9,77165,FORFRY,,BP 12,77193,,,,,,,,,,,,,,,,,,,1992-07-21,F,,,,,29.5E,NAF1993,N,4.7528422,47.0703301,0.74,poi.track,Route Départementale N 970 (Chemin) Bessey-en-Chaume,https://osm.org/way/584476777,G,,
335233490,00036,33523349000036,O,1990-12-01,,,,2008-11-07T00:55:50,true,4,LIEU DIT LA GRANDE PIECE,,,CHE,DEPARTEMENTAL 9,77165,FORFRY,,,77193,,,,,,,,,,,,,,,,,,,1993-12-25,F,,,,,25.2G,NAF1993,N,2.854796,49.055593,0.39,locality,La Grande Piece Nord 77165 Forfry,77193_b018,D,LA GRANDE PIECE NORD,
340909340,00010,34090934000010,O,,NN,,,,true,1,,6,,RUE,D OISSERY,77165,FORFRY,,,77193,,,,,,,,,,,,,,,,,,,1987-12-29,F,,,,,64.49,NAP,N,2.844882,49.058374,0.93,housenumber,6 Rue d'Oissery 77165 Forfry,77193_0100_00006,G,6 RUE D OISSERY,
343285888,00032,34328588800032,O,2006-03-13,,,,2021-02-23T10:58:34,true,3,,12,,RUE,DE OISSERY,77165,FORFRY,,,77193,,,,,,,,,,,,,,,,,,,2010-01-01,A,,,,,47.82Z,NAFRev2,N,2.844447,49.0582,0.79,housenumber,12 Rue d'Oissery 77165 Forfry,77193_0100_00012,G,12 RUE D OISSERY,
352152805,00011,35215280500011,O,1900-01-01,NN,,,2011-04-28T00:42:16,false,3,,6,,RUE,DE L EGLISE,77165,FORFRY,,,77193,,,,,,,,,,,,,,,,,,,1995-12-30,F,,,,,45.3C,NAF1993,N,2.847872,49.057377,0.93,housenumber,6 Rue de l'Eglise 77165 Forfry,77193_0045_00006,G,6 RUE DE L EGLISE,
379954035,00018,37995403500018,O,1990-10-10,NN,,,2016-10-13T04:12:13,true,4,,1,,RUE,D EN HAUT,77165,FORFRY,,,77193,,,,,,,,,,,,,,,,,,,2016-06-30,F,,,,,68.20B,NAFRev2,N,2.847563,49.056195,0.93,housenumber,1 Rue d'En Haut 77165 Forfry,77193_b037_00001,G,1 RUE D EN HAUT,
384547337,00012,38454733700012,O,1983-07-01,,,,2016-06-26T04:27:29,true,4,,10,,RUE,DES FRANCS BOURGEOIS,77165,FORFRY,,,77193,,,,,,,,,,,,,,,,,,,2016-01-01,A,,,,,68.20B,NAFRev2,N,2.849688,49.05696,0.93,housenumber,10 Rue des Francs Bourgeois 77165 Forfry,77193_0060_00010,G,10 RUE DES FRANCS BOURGEOIS,
390950392,00014,39095039200014,O,1993-03-16,,,,,true,3,CD 9,,,LD,LA GRANDE PIECE,77165,FORFRY,,,77193,,,,,,,,,,,,,,,,,,,1993-12-25,F,,,,,25.2G,NAF1993,N,2.854796,49.055593,0.92,locality,La Grande Piece Nord 77165 Forfry,77193_b018,G,LA GRANDE PIECE NORD,
391998457,00017,39199845700017,O,1980-07-01,NN,,,2010-04-18T06:25:11,true,4,FERME DE L EGLISE,2,,RUE,DES FRANCS BOURGEOIS,77165,FORFRY,,,77193,,,,,,,,,,,,,,,,,,,2009-01-31,F,,,,,01.11Z,NAFRev2,N,2.848641,49.05763,0.93,housenumber,2 Rue des Francs Bourgeois 77165 Forfry,77193_0060_00002,G,2 RUE DES FRANCS BOURGEOIS,
392296349,00013,39229634900013,O,,,,,2007-06-26T06:17:47,true,1,,10,,RUE,DES FRANCS BOURGEOIS,77165,FORFRY,,,77193,,,,,,,,,,,,,,,,,,,1978-12-25,F,,,,,01.1A,NAF1993,N,2.849688,49.05696,0.93,housenumber,10 Rue des Francs Bourgeois 77165 Forfry,77193_0060_00010,G,10 RUE DES FRANCS BOURGEOIS,
392677274,00012,39267727400012,O,1993-10-04,01,2018,4312BA,2020-08-25T10:27:30,true,4,,17,,RUE,DES FRANCS BOURGEOIS,77165,FORFRY,,,77193,,,,,,,,,,,,,,,,,,,2015-09-16,A,,,,,43.99C,NAFRev2,N,2.849297,49.057408,0.93,housenumber,17 Rue des Francs Bourgeois 77165 Forfry,77193_0060_00017,G,17 RUE DES FRANCS BOURGEOIS,
394044572,00011,39404457200011,O,1994-01-02,,,,,false,3,,21,,RUE,DE CONDE,77165,FORFRY,,,77193,,,,,,,,,,,,,,,,,,,1998-01-01,F,,,,,01.4B,NAF1993,N,2.84699,49.059418,0.93,housenumber,21 Rue de Condé 77165 Forfry,77193_0020_00021,G,21 RUE DE CONDE,
394213862,00011,39421386200011,O,1993-02-03,NN,,,2014-06-14T02:16:49,true,5,FERME DES BUREAUX,1,,RUE,D EN HAUT,77165,FORFRY,,,77193,,,,,,,,,,,,,,,,,,,2012-01-15,F,,,,,01.11Z,NAFRev2,O,2.847563,49.056195,0.93,housenumber,1 Rue d'En Haut 77165 Forfry,77193_b037_00001,G,1 RUE D EN HAUT,
395085954,00059,39508595400059,O,1999-07-01,,,,2011-03-18T11:19:44,true,4,,17,,RUE,DE CONDE,77165,FORFRY,,,77193,,,,,,,,,,,,,,,,,,,2010-12-01,F,,,,,81.30Z,NAFRev2,N,2.846595,49.059264,0.93,housenumber,17 Rue de Condé 77165 Forfry,77193_0020_00017,G,17 RUE DE CONDE,
395297617,00015,39529761700015,O,1994-02-04,NN,,,2008-11-08T01:02:24,true,3,C.D.9,,,LD,LA GRANDE PIECE,77165,FORFRY,,,77193,,,,,,,,,,,,,,,,,,,1995-12-25,F,,,,,28.5A,NAF1993,O,2.854796,49.055593,0.92,locality,La Grande Piece Nord 77165 Forfry,77193_b018,G,LA GRANDE PIECE NORD,
399748557,00010,39974855700010,O,,NN,,,,true,1,,6,,RUE,DE L EGLISE,77165,FORFRY,,,77193,,,,,,,,,,,,,,,,,,,1995-03-31,F,,,,,45.3A,NAF1993,O,2.847872,49.057377,0.93,housenumber,6 Rue de l'Eglise 77165 Forfry,77193_0045_00006,G,6 RUE DE L EGLISE,
401039656,00012,40103965600012,O,,NN,,,2006-11-25T14:42:19,true,1,,6,,RUE,DE L'EGLISE,77165,FORFRY,,,77193,,,,,,,,,,,,,,,,,,,1995-04-30,F,,,,,45.3A,NAF1993,N,2.847872,49.057377,0.93,housenumber,6 Rue de l'Eglise 77165 Forfry,77193_0045_00006,G,6 RUE DE L EGLISE,
401435219,00035,40143521900035,O,2004-10-07,NN,,4932ZA,2015-03-17T00:44:40,true,4,,24,,RUE,DU HAUT,77165,FORFRY,,,77193,,,,,,,,,,,,,,,,,,,2008-01-29,A,,,,,49.32Z,NAFRev2,O,2.845456,49.056149,0.75,housenumber,24 Rue d'En Haut 77165 Forfry,77193_b037_00024,G,24 RUE D EN HAUT,
402555650,00025,40255565000025,O,2004-12-06,NN,,,2012-10-05T15:26:02,false,4,,22,T,RUE,D EN HAUT,77165,FORFRY,,,77193,,,,,,,,,,,,,,,,,,,2012-10-01,F,,,,,49.32Z,NAFRev2,N,2.845633,49.056216,0.78,housenumber,22 ter Rue d'En Haut 77165 Forfry,77193_b037_00022_ter,G,22 TER RUE D EN HAUT,
403517527,00012,40351752700012,O,1996-01-16,NN,,,2018-10-12T10:18:14,false,4,,1,,RUE,D'EN HAUT,77165,FORFRY,,,77193,,,,,,,,,,,,,,,,,,,2018-09-26,F,,,,,01.11Z,NAFRev2,N,2.847563,49.056195,0.93,housenumber,1 Rue d'En Haut 77165 Forfry,77193_b037_00001,G,1 RUE D EN HAUT,
403697642,00011,40369764200011,O,1995-12-27,NN,,,2016-09-09T03:56:10,true,4,CD 9,,,LD,LA GRANDE PIERRE,77165,FORFRY,,,77193,,,,,,,,,,,,,,,,,,,2012-06-18,F,,,,,25.61Z,NAFRev2,O,2.854796,49.055593,0.71,locality,La Grande Piece Nord 77165 Forfry,77193_b018,G,LA GRANDE PIECE NORD,
408027043,00012,40802704300012,O,1996-01-01,NN,,,2006-10-28T03:31:27,true,3,,,,,LA GRANDE PIECE,77165,FORFRY,,,77193,,,,,,,,,,,,,,,,,,,2005-11-05,F,,,,,70.2C,NAFRev1,N,2.854796,49.055593,0.92,locality,La Grande Piece Nord 77165 Forfry,77193_b018,G,LA GRANDE PIECE NORD,
411133028,00018,41113302800018,O,,,,,2009-02-04T00:29:20,true,1,,,,,CD NÂ°9,77165,FORFRY,,,77193,,,,,,,,,,,,,,,,,,,1997-02-28,F,,,,,60.2L,NAF1993,N,,,0,,,,,,
419157748,00015,41915774800015,O,1998-06-11,NN,,,2016-06-02T04:29:35,true,4,,12,,RUE,D'EN HAUT,77165,FORFRY,,,77193,,,,,,,,,,,,,,,,,,,2008-01-01,F,,,,,47.89Z,NAFRev2,N,2.846148,49.056747,0.93,housenumber,12 Rue d'En Haut 77165 Forfry,77193_b037_00012,G,12 RUE D EN HAUT,
419632732,00030,41963273200030,O,2016-06-30,,,,2019-05-25T03:57:54,true,2,,2,,RUE,OISSERY,77165,FORFRY,,,77193,,,,,,,,,,,,,,,,,,,2018-10-01,F,,,,,47.89Z,NAFRev2,N,2.845436,49.058602,0.86,housenumber,2 Rue d'Oissery 77165 Forfry,77193_0100_00002,G,2 RUE D OISSERY,
428550271,00012,42855027100012,O,1965-03-15,NN,,,2015-08-09T03:04:42,true,4,,1,,RUE,D'EN HAUT,77165,FORFRY,,,77193,,,,,,,,,,,,,,,,,,,2015-05-31,F,,,,,68.20B,NAFRev2,N,2.847563,49.056195,0.93,housenumber,1 Rue d'En Haut 77165 Forfry,77193_b037_00001,G,1 RUE D EN HAUT,
430334649,00026,43033464900026,O,2003-06-15,NN,,,2006-11-25T16:54:15,false,3,,19,,RUE,DES FRANCS BOURGEOIS,77165,FORFRY,,,77193,,,,,,,,,,,,,,,,,,,2004-09-01,F,MIGRATEUR,,,,51.1R,NAFRev1,N,2.849602,49.057138,0.93,housenumber,19 Rue des Francs Bourgeois 77165 Forfry,77193_0060_00019,G,19 RUE DES FRANCS BOURGEOIS,
452796097,00015,45279609700015,O,2004-04-01,NN,,,2015-12-09T04:57:27,true,5,,6,,RUE,DE OISSERY,77165,FORFRY,,,77193,,,,,,,,,,,,,,,,,,,2015-12-07,F,,,,,47.89Z,NAFRev2,N,2.844882,49.058374,0.78,housenumber,6 Rue d'Oissery 77165 Forfry,77193_0100_00006,G,6 RUE D OISSERY,
477500631,00023,47750063100023,O,2009-05-14,,,4333ZZ,2021-02-23T13:38:53,true,1,,30,,RUE,D EN HAUT,77165,FORFRY,,,77193,,,,,,,,,,,,,,,,,,,2009-05-14,A,,,,,43.34Z,NAFRev2,N,2.845002,49.055823,0.93,housenumber,30 Rue d'En Haut 77165 Forfry,77193_b037_00030,G,30 RUE D EN HAUT,
477675847,00016,47767584700016,O,2004-07-10,NN,,,2009-10-09T04:47:07,false,4,,5,,IMP,CHARLES HILDEVERT,77165,FORFRY,,,77193,,,,,,,,,,,,,,,,,,,2009-06-17,F,,,,,86.90D,NAFRev2,N,2.848264,49.059534,0.85,housenumber,5 Impasse Charles Hildevert 77165 Forfry,77193_0015_00005,G,5 IMPASSE CHARLES HILDEVERT,
488465253,00018,48846525300018,O,2005-11-05,,,,2008-01-05T02:37:33,true,2,LA GRANDE PIECE NORD,,,,,77165,FORFRY,,,77193,,,,,,,,,,,,,,,,,,,2008-01-01,A,,,,,68.20B,NAFRev2,N,2.854796,49.055593,0.93,locality,La Grande Piece Nord 77165 Forfry,77193_b018,D,LA GRANDE PIECE NORD,
488735630,00011,48873563000011,O,2006-03-01,,,,2009-08-30T04:17:34,true,3,,2,,RUE,DE CONDE,77165,FORFRY,,,77193,,,,,,,,,,,,,,,,,,,2009-08-31,F,,,,,46.19B,NAFRev2,N,2.845762,49.058719,0.93,housenumber,2 Rue de Condé 77165 Forfry,77193_0020_00002,G,2 RUE DE CONDE,
489817486,00017,48981748600017,O,2006-04-01,NN,,,2017-07-06T04:16:48,true,2,,10,,RUE,DES FRANCS BOURGEOIS,77165,FORFRY,,,77193,,,,,,,,,,,,,,,,,,,2008-01-01,A,,,,,01.11Z,NAFRev2,O,2.849688,49.05696,0.93,housenumber,10 Rue des Francs Bourgeois 77165 Forfry,77193_0060_00010,G,10 RUE DES FRANCS BOURGEOIS,
491734943,00013,49173494300013,O,2006-09-06,,,,2021-03-19T08:47:08,true,5,FERME DE BOISSY,10,,RUE,DES FRANCS BOURGEOIS,77165,FORFRY,,,77193,,,,,,,,,,,,,,,,,,,2021-03-17,F,,,,,01.61Z,NAFRev2,N,2.849688,49.05696,0.93,housenumber,10 Rue des Francs Bourgeois 77165 Forfry,77193_0060_00010,G,10 RUE DES FRANCS BOURGEOIS,
493985204,00020,49398520400020,O,1900-01-01,,,,2018-10-16T03:55:13,true,2,,5,,RUE,DES FRANCS BOURGEOIS,77165,FORFRY,,,77193,,,,,,,,,,,,,,,,,,,2015-06-01,A,,,,,70.10Z,NAFRev2,N,2.848969,49.058651,0.93,housenumber,5 Rue des Francs Bourgeois 77165 Forfry,77193_0060_00005,G,5 RUE DES FRANCS BOURGEOIS,
498049774,00017,49804977400017,O,2004-11-02,NN,,,2010-04-18T12:55:12,true,3,ECOLE PRIMAIRE,,,RUE,FRANCS BOURGEOIS,77165,FORFRY,,,77193,,,,,,,,,,,,,,,,,,,2008-01-01,A,,,,,94.99Z,NAFRev2,O,2.848263,49.057687,0.88,street,Rue des Francs Bourgeois 77165 Forfry,77193_0060,G,RUE DES FRANCS BOURGEOIS,
500126297,00018,50012629700018,O,2007-10-01,,,,2020-01-28T04:11:58,true,2,,23,,RUE,DE CONDE,77165,FORFRY,,,77193,,,,,,,,,,,,,,,,,,,2008-01-01,A,,,,,73.12Z,NAFRev2,N,2.847185,49.059548,0.93,housenumber,23 Rue de Condé 77165 Forfry,77193_0020_00023,G,23 RUE DE CONDE,
504524737,00013,50452473700013,O,2008-05-26,,,,2015-10-02T04:28:39,true,2,,6,B,RUE,DES FRANCS BOURGEOIS,77165,FORFRY,,,77193,,,,,,,,,,,,,,,,,,,2011-03-31,F,,,,,43.22B,NAFRev2,N,2.3653999,48.8530036,0.8,poi.school,École des Francs-Bourgeois Paris,https://osm.org/way/56207648,G,,
509119004,00018,50911900400018,O,2008-10-30,01,2018,,2020-08-25T10:22:30,true,2,FERME DE L'EGLISE,2,,RUE,DES FRANCS BOURGEOIS,77165,FORFRY,,,77193,,,,,,,,,,,,,,,,,,,2019-07-16,A,FERME ECURIE DES AVERNES,,,,01.62Z,NAFRev2,O,2.848641,49.05763,0.93,housenumber,2 Rue des Francs Bourgeois 77165 Forfry,77193_0060_00002,G,2 RUE DES FRANCS BOURGEOIS,
511643397,00017,51164339700017,O,2009-03-11,,,,2012-11-10T00:43:46,true,1,,22,B,RUE,D EN HAUT,77165,FORFRY,,,77193,,,,,,,,,,,,,,,,,,,2009-03-11,A,,,,,96.02A,NAFRev2,N,2.845633,49.056216,0.78,housenumber,22 bis Rue d'En Haut 77165 Forfry,77193_b037_00022_bis,G,22 BIS RUE D EN HAUT,
511743114,00015,51174311400015,O,2009-03-03,,,,2018-02-19T08:33:44,true,2,,17,,RUE,DE CONDE,77165,FORFRY,,,77193,,,,,,,,,,,,,,,,,,,2018-02-13,F,,,,,96.02A,NAFRev2,N,2.846595,49.059264,0.93,housenumber,17 Rue de Condé 77165 Forfry,77193_0020_00017,G,17 RUE DE CONDE,
513105718,00011,51310571800011,O,2009-06-01,,,,2021-02-23T15:23:13,true,1,,32,,RUE,DE CONDE,77165,FORFRY,,,77193,,,,,,,,,,,,,,,,,,,2009-06-01,A,,,,,47.89Z,NAFRev2,N,2.851064,49.062088,0.93,housenumber,32 Rue de Condé 77165 Forfry,77193_0020_00032,G,32 RUE DE CONDE,
517980173,00028,51798017300028,O,2015-12-01,,,0162ZP,2016-12-07T03:48:46,true,2,,6,,RUE,DE L'EGLISE,77165,FORFRY,,,77193,,,,,,,,,,,,,,,,,,,2016-12-01,F,,,,,01.62Z,NAFRev2,N,2.847872,49.057377,0.93,housenumber,6 Rue de l'Eglise 77165 Forfry,77193_0045_00006,G,6 RUE DE L EGLISE,
518524715,00019,51852471500019,O,2009-12-15,,,,2010-10-08T05:59:45,true,2,,5,,IMP,DU LIEUTENANT TAYLOR,77165,FORFRY,,,77193,,,,,,,,,,,,,,,,,,,2010-09-30,F,,,,,45.20A,NAFRev2,N,2.84983,49.057739,0.86,housenumber,5 Impasse du Lieutenant Taylor 77165 Forfry,77193_0090_00005,G,5 IMPASSE DU LIEUTENANT TAYLOR,
518570296,00021,51857029600021,O,2011-07-01,,,,2011-08-02T05:21:22,false,1,LA DISTILLERIE,,,,,77165,FORFRY,,,77193,,,,,,,,,,,,,,,,,,,2011-07-01,A,,,,,35.11Z,NAFRev2,N,,,0,,,,,,
519326557,00013,51932655700013,O,2010-01-25,,,,2010-04-19T09:48:05,false,2,,10,,RUE,DES FRANCS BOURGEOIS,77165,FORFRY,,,77193,,,,,,,,,,,,,,,,,,,2010-04-13,F,,,,,66.19B,NAFRev2,N,2.849688,49.05696,0.93,housenumber,10 Rue des Francs Bourgeois 77165 Forfry,77193_0060_00010,G,10 RUE DES FRANCS BOURGEOIS,
519365670,00016,51936567000016,O,2010-01-07,,,,2014-01-08T10:49:54,false,2,,5,B,RUE,CONDE,77165,FORFRY,,,77193,,,,,,,,,,,,,,,,,,,2013-02-08,F,,,,,43.34Z,NAFRev2,N,2.845763,49.058812,0.72,housenumber,5 bis Rue de Condé 77165 Forfry,77193_0020_00005_bis,G,5 BIS RUE DE CONDE,
519958862,00012,51995886200012,O,2010-01-01,,,,2014-01-09T09:25:14,false,2,,22,B,RUE,D EN HAUT,77165,FORFRY,,,77193,,,,,,,,,,,,,,,,,,,2014-01-10,F,,,,,35.11Z,NAFRev2,N,2.845633,49.056216,0.78,housenumber,22 bis Rue d'En Haut 77165 Forfry,77193_b037_00022_bis,G,22 BIS RUE D EN HAUT,
521365627,00012,52136562700012,O,2010-03-22,,,,2012-11-10T01:58:31,true,1,,4,,RUE,DE L EGLISE,77165,FORFRY,,,77193,,,,,,,,,,,,,,,,,,,2010-03-22,A,,,,,96.09Z,NAFRev2,N,2.847822,49.057435,0.93,housenumber,4 Rue de l'Eglise 77165 Forfry,77193_0045_00004,G,4 RUE DE L EGLISE,
522556752,00015,52255675200015,O,2010-05-19,,,9602AB,2015-11-18T03:46:56,true,1,,6,T,RUE,DE CONDE,77165,FORFRY,,,77193,,,,,,,,,,,,,,,,,,,2010-05-19,A,,,,,96.02A,NAFRev2,N,2.84696,49.058935,0.77,housenumber,6 ter Rue de Condé 77165 Forfry,77193_0020_00006_ter,G,6 TER RUE DE CONDE,
528005515,00010,52800551500010,O,2010-10-27,,,,2019-12-09T10:21:36,true,2,,17,,RUE,DE CONDE,77165,FORFRY,,,77193,,,,,,,,,,,,,,,,,,,2019-11-07,F,,,,,68.20B,NAFRev2,N,2.846595,49.059264,0.93,housenumber,17 Rue de Condé 77165 Forfry,77193_0020_00017,G,17 RUE DE CONDE,
529328684,00012,52932868400012,O,2010-11-25,,,,2015-01-14T04:45:10,true,1,,23,,RUE,DE CONDE,77165,FORFRY,,,77193,,,,,,,,,,,,,,,,,,,2010-11-25,A,,,,,68.20B,NAFRev2,N,2.847185,49.059548,0.93,housenumber,23 Rue de Condé 77165 Forfry,77193_0020_00023,G,23 RUE DE CONDE,
532106259,00023,53210625900023,O,2016-03-01,,,,2016-04-26T04:33:20,true,2,,4,,RUE,DE CONDE,77165,FORFRY,,,77193,,,,,,,,,,,,,,,,,,,2016-03-31,F,,,,,47.72B,NAFRev2,N,2.846076,49.058869,0.93,housenumber,4 Rue de Condé 77165 Forfry,77193_0020_00004,G,4 RUE DE CONDE,
533320412,00026,53332041200026,O,2019-09-01,,,4540ZP,2021-02-23T15:54:01,true,1,,,,,CD 9 LIEUDIT LA GRANDE PIECE,77165,FORFRY,,,77193,,,,,,,,,,,,,,,,,,,2019-09-01,A,,,,J.L MOTOS,45.20A,NAFRev2,O,,,0,,,,,,
745744177,00015,74574417700015,O,,,,,,true,1,,,,,FORFRY,77165,FORFRY,,,77193,,,,,,,,,,,,,,,,,,,1984-12-25,F,,,,,22.02,NAP,N,2.847023,49.058891,0.93,municipality,Forfry,77193,G,FORFRY,
745841916,00018,74584191600018,O,,NN,,,,true,1,,,,,,77165,FORFRY,,,77193,,,,,,,,,,,,,,,,,,,1987-12-31,F,,,,,64.49,NAP,N,,,0,,,,,,
745940726,00011,74594072600011,O,,,,,,true,1,,,,,,77165,FORFRY,,,77193,,,,,,,,,,,,,,,,,,,,F,,,,,67.05,NAP,N,,,0,,,,,,
746050707,00015,74605070700015,O,,,,,,true,1,,,,,FORFRY,77165,FORFRY,,,77193,,,,,,,,,,,,,,,,,,,1984-12-25,F,,,,,,,N,2.847023,49.058891,0.93,municipality,Forfry,77193,G,FORFRY,
746743830,00018,74674383000018,O,1967-01-01,NN,,,2006-11-25T22:05:16,true,3,,,,,FORFRY,77165,FORFRY,,,77193,,,,,,,,,,,,,,,,,,,2004-02-29,F,,,,,52.6E,NAFRev1,N,2.847023,49.058891,0.93,municipality,Forfry,77193,G,FORFRY,
747150910,00012,74715091000012,O,1900-01-01,NN,,,2006-12-15T01:29:17,false,4,,4,,RUE,DE CONDI,77165,FORFRY,,,77193,,,,,,,,,,,,,,,,,,,1997-11-10,F,,,,,51.6N,NAF1993,O,2.846076,49.058869,0.81,housenumber,4 Rue de Condé 77165 Forfry,77193_0020_00004,G,4 RUE DE CONDE,
751126822,00012,75112682200012,O,2012-01-15,NN,,,2019-06-24T13:41:18,true,1,,1,,RUE,D'EN HAUT,77165,FORFRY,,,77193,,,,,,,,,,,,,,,,,,,2012-01-15,A,,,,,01.11Z,NAFRev2,O,2.847563,49.056195,0.93,housenumber,1 Rue d'En Haut 77165 Forfry,77193_b037_00001,G,1 RUE D EN HAUT,
753920818,00014,75392081800014,O,2012-09-24,03,2018,2561ZB,2020-08-25T10:56:28,true,1,LIEUDIT LA GRANDE PIECE,,,,CD NO 9,77165,FORFRY,,,77193,,,,,,,,,,,,,,,,,,,2012-09-24,A,,,,,25.61Z,NAFRev2,O,,,0,,,,,,
784943722,00016,78494372200016,O,,,,,,true,1,,,,,,77165,FORFRY,,,77193,,,,,,,,,,,,,,,,,,,,F,,,,,41.01,NAP,N,,,0,,,,,,
784943730,00027,78494373000027,O,,NN,,,,true,1,,8,,RUE,DE CONDE,77165,FORFRY,,,77193,,,,,,,,,,,,,,,,,,,1995-09-30,F,,,,,52.6E,NAF1993,N,2.84681,49.059234,0.93,housenumber,8 Rue de Condé 77165 Forfry,77193_0020_00008,G,8 RUE DE CONDE,
789602653,00014,78960265300014,O,2012-12-01,,,,2020-12-29T03:42:21,true,2,,13,,RUE,DES FRANCS BOURGEOIS,77165,FORFRY,,,77193,,,,,,,,,,,,,,,,,,,2020-07-01,A,,,,,64.20Z,NAFRev2,O,2.849562,49.057671,0.93,housenumber,13 Rue des Francs Bourgeois 77165 Forfry,77193_0060_00013,G,13 RUE DES FRANCS BOURGEOIS,
789843513,00027,78984351300027,O,2018-07-07,,,,2021-02-23T16:15:43,true,1,,5,,RUE,DES FRANCS BOURGEOIS,77165,FORFRY,,,77193,,,,,,,,,,,,,,,,,,,2018-07-07,A,,,,,68.20B,NAFRev2,N,2.848969,49.058651,0.93,housenumber,5 Rue des Francs Bourgeois 77165 Forfry,77193_0060_00005,G,5 RUE DES FRANCS BOURGEOIS,
790342679,00012,79034267900012,O,2012-12-27,,,,2020-09-29T03:43:24,true,1,FERME DE BOISSY,10,,RUE,DES FRANCS BOURGEOIS,77165,FORFRY,,,77193,,,,,,,,,,,,,,,,,,,2012-12-27,A,,,,,68.20B,NAFRev2,N,2.849688,49.05696,0.93,housenumber,10 Rue des Francs Bourgeois 77165 Forfry,77193_0060_00010,G,10 RUE DES FRANCS BOURGEOIS,
791322126,00024,79132212600024,O,2013-03-02,,,,2013-11-06T10:54:31,false,2,,1,,RUE,DES FRANCS BOURGEOIS,77165,FORFRY,,,77193,,,,,,,,,,,,,,,,,,,2013-11-07,F,,,,,85.51Z,NAFRev2,N,2.848263,49.057687,0.93,housenumber,1 Rue des Francs Bourgeois 77165 Forfry,77193_0060_00001,G,1 RUE DES FRANCS BOURGEOIS,
792136020,00015,79213602000015,O,2013-04-26,,,,2017-09-18T08:40:23,true,2,,11,,RTE,DE CONDE FORFRY,77165,FORFRY,,,77193,,,,,,,,,,,,,,,,,,,2017-09-30,F,,,,,43.22B,NAFRev2,N,2.846107,49.059014,0.81,housenumber,11 Rue de Condé 77165 Forfry,77193_0020_00011,G,11 RUE DE CONDE,
792582397,00024,79258239700024,O,2018-01-03,,,,2021-02-23T16:20:23,true,1,,5,,IMP,CHARLES HILDEVERT,77165,FORFRY,,,77193,,,,,,,,,,,,,,,,,,,2018-01-03,A,,,,CAPITALE SPA,47.52A,NAFRev2,N,2.848264,49.059534,0.85,housenumber,5 Impasse Charles Hildevert 77165 Forfry,77193_0015_00005,G,5 IMPASSE CHARLES HILDEVERT,
793789256,00013,79378925600013,O,2013-05-27,01,2018,,2020-08-25T11:04:40,true,2,,17,,RUE,DE CONDE,77165,FORFRY,,,77193,,,,,,,,,,,,,,,,,,,2015-06-01,A,,,,,64.20Z,NAFRev2,O,2.846595,49.059264,0.93,housenumber,17 Rue de Condé 77165 Forfry,77193_0020_00017,G,17 RUE DE CONDE,
793812900,00017,79381290000017,O,2013-06-19,,,,2013-06-24T09:37:29,true,1,,22,B,RUE,D'EN HAUT,77165,FORFRY,,,77193,,,,,,,,,,,,,,,,,,,2013-06-19,A,,,,,33.20D,NAFRev2,N,2.845633,49.056216,0.78,housenumber,22 bis Rue d'En Haut 77165 Forfry,77193_b037_00022_bis,G,22 BIS RUE D EN HAUT,
795258581,00011,79525858100011,O,2013-09-10,,,,2018-04-06T18:00:20,true,1,,17,,RUE,DE CONDE,77165,FORFRY,,,77193,,,,,,,,,,,,,,,,,,,2013-09-10,A,,,,,68.20B,NAFRev2,N,2.846595,49.059264,0.93,housenumber,17 Rue de Condé 77165 Forfry,77193_0020_00017,G,17 RUE DE CONDE,
799818133,00016,79981813300016,O,2014-01-20,,,,2014-01-22T08:25:24,true,1,,2,,RUE,DES FRANCS BOURGEOIS,77165,FORFRY,,,77193,,,,,,,,,,,,,,,,,,,2014-01-20,A,EMP,,,EMP,43.22B,NAFRev2,N,2.848641,49.05763,0.93,housenumber,2 Rue des Francs Bourgeois 77165 Forfry,77193_0060_00002,G,2 RUE DES FRANCS BOURGEOIS,
802184218,00013,80218421800013,O,2014-04-09,,,,2018-04-10T15:06:32,true,1,,10,,RUE,D'EN HAUT,77165,FORFRY,,,77193,,,,,,,,,,,,,,,,,,,2014-04-09,A,,,,,68.20B,NAFRev2,N,2.846256,49.05677,0.93,housenumber,10 Rue d'En Haut 77165 Forfry,77193_b037_00010,G,10 RUE D EN HAUT,