siren,nic,siret,statutDiffusionEtablissement,dateCreationEtablissement,trancheEffectifsEtablissement,anneeEffectifsEtablissement,activitePrincipaleRegistreMetiersEtablissement,dateDernierTraitementEtablissement,etablissementSiege,nombrePeriodesEtablissement,complementAdresseEtablissement,numeroVoieEtablissement,indiceRepetitionEtablissement,typeVoieEtablissement,libelleVoieEtablissement,codePostalEtablissement,libelleCommuneEtablissement,libelleCommuneEtrangerEtablissement,distributionSpecialeEtablissement,codeCommuneEtablissement,codeCedexEtablissement,libelleCedexEtablissement,codePaysEtrangerEtablissement,libellePaysEtrangerEtablissement,complementAdresse2Etablissement,numeroVoie2Etablissement,indiceRepetition2Etablissement,typeVoie2Etablissement,libelleVoie2Etablissement,codePostal2Etablissement,libelleCommune2Etablissement,libelleCommuneEtranger2Etablissement,distributionSpeciale2Etablissement,codeCommune2Etablissement,codeCedex2Etablissement,libelleCedex2Etablissement,codePaysEtranger2Etablissement,libellePaysEtranger2Etablissement,dateDebut,etatAdministratifEtablissement,enseigne1Etablissement,enseigne2Etablissement,enseigne3Etablissement,denominationUsuelleEtablissement,activitePrincipaleEtablissement,nomenclatureActivitePrincipaleEtablissement,caractereEmployeurEtablissement,longitude,latitude,geo_score,geo_type,geo_adresse,geo_id,geo_ligne,geo_l4,geo_l5
213601537,00011,21360153700011,O,1983-03-01,11,2018,,2020-08-25T10:16:59,true,4,,3,,RUE,GEORGES CLEMENCEAU,36290,PAULNAY,,,36153,,,,,,,,,,,,,,,,,,,2008-01-01,A,MAIRIE,,,,84.11Z,NAFRev2,O,1.147376,46.850521,0.93,housenumber,3 Rue Georges Clémenceau 36290 Paulnay,36153_0041_00003,G,3 RUE GEORGES CLEMENCEAU,
213601537,00029,21360153700029,O,1983-12-21,NN,,,2015-05-14T03:34:53,false,3,,3,,RUE,GEORGES CLEMENCEAU,36290,PAULNAY,,,36153,,,,,,,,,,,,,,,,,,,2008-01-01,A,ECOLE MATERNELLE PUBLIQUE,,,,85.10Z,NAFRev2,N,1.147376,46.850521,0.93,housenumber,3 Rue Georges Clémenceau 36290 Paulnay,36153_0041_00003,G,3 RUE GEORGES CLEMENCEAU,
213601537,00037,21360153700037,O,2001-12-25,NN,,,2007-11-06T10:06:43,false,2,,3,,RUE,GEORGES CLEMENCEAU,36290,PAULNAY,,,36153,,,,,,,,,,,,,,,,,,,2007-11-05,F,REHABILITATION LOGEMENT,,,,70.2A,NAFRev1,N,1.147376,46.850521,0.93,housenumber,3 Rue Georges Clémenceau 36290 Paulnay,36153_0041_00003,G,3 RUE GEORGES CLEMENCEAU,
213601537,00045,21360153700045,O,2002-09-28,NN,,,2008-01-04T18:32:20,false,3,MAIRIE,3,,RUE,GEORGES CLEMENCEAU,36290,PAULNAY,,,36153,,,,,,,,,,,,,,,,,,,2008-01-01,A,SERVICE D'ASSAINISSEMENT,,,,37.00Z,NAFRev2,N,1.147376,46.850521,0.93,housenumber,3 Rue Georges Clémenceau 36290 Paulnay,36153_0041_00003,G,3 RUE GEORGES CLEMENCEAU,
253601413,00011,25360141300011,O,1984-08-06,NN,,,2006-02-14T10:10:36,true,3,MAIRIE,3,,RUE,GEORGES CLEMENCEAU,36290,PAULNAY,,,36153,,,,,,,,,,,,,,,,,,,2003-06-28,F,PAULNAY ST MICHEL EN BRENNE,,,,60.2B,NAFRev1,N,1.147376,46.850521,0.93,housenumber,3 Rue Georges Clémenceau 36290 Paulnay,36153_0041_00003,G,3 RUE GEORGES CLEMENCEAU,
253601561,00017,25360156100017,O,1986-02-04,NN,,,2006-02-14T09:53:05,true,4,MAIRIE,3,,RUE,GEORGES CLEMENCEAU,36290,PAULNAY,,,36153,,,,,,,,,,,,,,,,,,,2003-06-28,F,,,,,75.1C,NAFRev1,O,1.147376,46.850521,0.93,housenumber,3 Rue Georges Clémenceau 36290 Paulnay,36153_0041_00003,G,3 RUE GEORGES CLEMENCEAU,
253601561,00025,25360156100025,O,1985-09-09,NN,,,2006-02-14T09:53:05,false,3,,,,,,36290,PAULNAY,,,36153,,,,,,,,,,,,,,,,,,,2003-06-28,F,CLASSE MATERNELLE,,,,80.1Z,NAFRev1,N,,,0,,,,,,
263601411,00014,26360141100014,O,1992-01-01,NN,,,2010-06-26T03:09:00,true,3,MAIRIE,3,,RUE,GEORGES CLEMENCEAU,36290,PAULNAY,,,36153,,,,,,,,,,,,,,,,,,,2008-01-01,A,CCAS,,,,88.99B,NAFRev2,N,1.147376,46.850521,0.93,housenumber,3 Rue Georges Clémenceau 36290 Paulnay,36153_0041_00003,G,3 RUE GEORGES CLEMENCEAU,
293600151,00014,29360015100014,O,1983-09-27,NN,,,2009-04-10T05:22:33,true,3,MAIRIE,,,,,36290,PAULNAY,,,36153,,,,,,,,,,,,,,,,,,,2008-01-01,A,,,,,42.99Z,NAFRev2,N,1.154066,46.859068,0.37,locality,La Tuilerie des Bordes 36290 Paulnay,36153_b473,D,LA TUILERIE DES BORDES,
301646949,00018,30164694900018,O,,,,,,true,1,,,,RTE,DE MURS,36290,PAULNAY,,,36153,,,,,,,,,,,,,,,,,,,1984-12-25,F,,,,,21.08,NAP,N,1.150598,46.846964,0.47,street,Route de la Carterie 36290 Paulnay,36153_0015,G,ROUTE DE LA CARTERIE,
309941979,00051,30994197900051,O,2001-03-13,NN,,,2008-01-04T19:58:06,true,3,,1,,RUE,DES AFN,36290,PAULNAY,,,36153,,,,,,,,,,,,,,,,,,,2008-01-01,A,,,,,82.99Z,NAFRev2,N,1.151238,46.847907,0.93,housenumber,1 Rue des Afn 36290 Paulnay,36153_egpuyb_00001,G,1 RUE DES AFN,
311777973,00018,31177797300018,O,1900-01-01,NN,,,2016-12-16T04:16:39,true,4,,,,,LE BOURG,36290,PAULNAY,,,36153,,,,,,,,,,,,,,,,,,,2016-12-31,F,,,,,56.30Z,NAFRev2,N,2.212915,47.9910304,0.9,poi.bar,Le Bourg (Bar) Ingrannes,https://osm.org/node/1718543174,G,,
313955650,00012,31395565000012,O,1900-01-01,,,,2006-04-13T03:54:35,true,4,,,,,BEAUVAIS,36290,PAULNAY,,,36153,,,,,,,,,,,,,,,,,,,1994-12-25,F,,,,,01.2A,NAF1993,N,2.0899092,49.4288339,0.9,poi.park,(Parc) Beauvais,https://osm.org/way/556458817,G,,
314017401,00014,31401740100014,O,1978-01-01,01,2018,,2020-08-25T10:25:56,true,5,,,,,LE CLAVEAU,36290,PAULNAY,,,36153,,,,,,,,,,,,,,,,,,,2008-01-01,A,,,,,01.11Z,NAFRev2,N,1.1736763,46.8316028,0.88,poi.guest_house,Le Claveau (Maison d'hôte) Paulnay,https://osm.org/node/4232378394,G,,
314139718,00014,31413971800014,O,,,,,,true,1,,,,,LE BOURG,36290,PAULNAY,,,36153,,,,,,,,,,,,,,,,,,,1984-12-25,F,,,,,55.10,NAP,N,2.212915,47.9910304,0.9,poi.bar,Le Bourg (Bar) Ingrannes,https://osm.org/node/1718543174,G,,
314454646,00063,31445464600063,O,2015-08-06,,,,2021-02-23T10:40:39,true,1,,2,,RUE,GEORGES CLEMENCEAU,36290,PAULNAY,,,36153,,,,,,,,,,,,,,,,,,,2015-08-06,A,,,,,90.03A,NAFRev2,N,1.147684,46.850534,0.93,housenumber,2 Rue Georges Clémenceau 36290 Paulnay,36153_0041_00002,G,2 RUE GEORGES CLEMENCEAU,
317149607,00010,31714960700010,O,,,,,,true,1,,,,,BEAUVAIS,36290,PAULNAY,,,36153,,,,,,,,,,,,,,,,,,,1984-12-25,F,,,,,77.14,NAP,N,2.0899092,49.4288339,0.9,poi.park,(Parc) Beauvais,https://osm.org/way/556458817,G,,
317712198,00017,31771219800017,O,1980-01-01,NN,,,2017-06-30T17:14:26,true,7,,,,HAM,DE L OUGERIE,36290,PAULNAY,,,36153,,,,,,,,,,,,,,,,,,,2015-06-30,F,,,,,01.50Z,NAFRev2,O,1.1658239,46.8753772,0.88,poi.track,Chemin Rural de l'Ougerie au Rosai Paulnay,https://osm.org/way/231618391,G,,
318133535,00068,31813353500068,O,2000-05-15,NN,,,2007-08-01T09:26:48,false,4,,,,,LES PRES DU CHAPITRE,36290,PAULNAY,,,36153,,,,,,,,,,,,,,,,,,,2007-07-01,F,,,,,51.8N,NAFRev1,N,1.14716,46.849125,0.93,locality,Les Pres du Chapitre 36290 Paulnay,36153_b414,G,LES PRES DU CHAPITRE,
320813074,00012,32081307400012,O,,NN,,,,true,1,,,,LD,LA CARTERIE,36290,PAULNAY,,,36153,,,,,,,,,,,,,,,,,,,1992-06-30,F,,,,,45.4J,NAF1993,N,1.150598,46.846964,0.91,street,Route de la Carterie 36290 Paulnay,36153_0015,G,ROUTE DE LA CARTERIE,
320980451,00019,32098045100019,O,,NN,,,,true,1,,,,RTE,DE MEZIERES,36290,PAULNAY,,,36153,,,,,,,,,,,,,,,,,,,1992-02-05,F,,,,,70.1D,NAF1993,N,2.4952856,48.0284398,0.78,poi,Route de Montargis (Pont) Mézières-en-Gâtinais,https://osm.org/way/240992744,G,,
323163808,00021,32316380800021,O,2004-01-01,,,,2014-07-25T03:20:55,true,4,,,,,L OASIS,36290,PAULNAY,,,36153,,,,,,,,,,,,,,,,,,,2011-06-20,F,,,,,03.22Z,NAFRev2,N,3.846203,45.914509,0.89,poi.bar,L'Oasis (Bar) Saint-Just-en-Chevalet,https://osm.org/way/407968431,G,,
325973485,00015,32597348500015,O,1982-11-15,NN,,,2008-01-04T19:12:28,true,3,,,,,LA BARAUDIERE,36290,PAULNAY,,,36153,,,,,,,,,,,,,,,,,,,2008-01-01,A,,,,,01.61Z,NAFRev2,N,3.9366988,46.0037501,0.89,poi.track,Chemin de la Baraudière Saint-Alban-les-Eaux,https://osm.org/way/364347388,G,,
329106165,00015,32910616500015,O,1984-01-16,NN,,,2008-11-07T00:47:08,false,4,,,,,LUCHET,36290,PAULNAY,,,36153,,,,,,,,,,,,,,,,,,,1998-04-01,F,,,,,45.1A,NAF1993,N,0.2567256,44.2325151,0.88,poi.residential,Luchet (Zone résidentielle) Ambrus,https://osm.org/way/418335918,G,,
329563498,00024,32956349800024,O,1976-07-01,NN,,,2006-10-27T01:56:37,true,3,,,,,LA BECAVINIERE,36290,PAULNAY,,,36153,,,,,,,,,,,,,,,,,,,2004-11-15,F,,,,,01.1A,NAFRev1,N,1.14367,46.875887,0.39,locality,La Piece des Bernardieres 36290 Paulnay,36153_b339,G,LA PIECE DES BERNARDIERES,
332039601,00015,33203960100015,O,1985-04-01,NN,,,,true,1,,,,RTE,DE CHATELLERAULT,36290,PAULNAY,,,36153,,,,,,,,,,,,,,,,,,,1998-05-15,F,,,,,41.0Z,NAF1993,O,0.5295809,46.805257,0.81,poi.car_repair,Côté Route (Garage de réparation automobile) Châtellerault,https://osm.org/node/2202294016,G,,
332282839,00015,33228283900015,O,1985-01-01,NN,,,2006-10-27T02:19:11,true,5,,16,,CHE,DU GUE,36290,PAULNAY,,,36153,,,,,,,,,,,,,,,,,,,2006-05-31,F,,,,,70.2C,NAFRev1,N,1.150811,46.849844,0.8,housenumber,16 Chemin du Gué 36290 Paulnay,36153_0045_00016,G,16 CHEMIN DU GUE,
332543594,00011,33254359400011,O,1984-10-01,NN,,,2006-12-15T00:26:28,false,4,,,,,L'ARBRE SEC,36290,PAULNAY,,,36153,,,,,,,,,,,,,,,,,,,1998-04-29,F,,,,,01.1A,NAF1993,N,1.148823,46.864745,0.93,locality,L'Arbre Sec 36290 Paulnay,36153_b001,G,L ARBRE SEC,
332656214,00019,33265621400019,O,1985-04-29,NN,,,,true,1,,,,LD,LES LIGNIERES,36290,PAULNAY,,,36153,,,,,,,,,,,,,,,,,,,2002-06-01,F,,,,,01.1A,NAF1993,N,5.5620233,43.2948336,0.89,poi.platform,Les Lignieres (Plateforme) Aubagne,https://osm.org/way/438032856,G,,
332693878,00032,33269387800032,O,1996-01-01,NN,,,2008-01-04T20:29:14,true,3,,,,,LUCHET,36290,PAULNAY,,,36153,,,,,,,,,,,,,,,,,,,2008-01-01,A,,,,,01.47Z,NAFRev2,N,0.2567256,44.2325151,0.88,poi.residential,Luchet (Zone résidentielle) Ambrus,https://osm.org/way/418335918,G,,
333289668,00019,33328966800019,O,1985-07-04,NN,,,,true,1,,,,LD,LA BARAUDIERE,36290,PAULNAY,,,36153,,,,,,,,,,,,,,,,,,,1999-12-31,F,,,,,01.3Z,NAF1993,N,3.9366988,46.0037501,0.89,poi.track,Chemin de la Baraudière Saint-Alban-les-Eaux,https://osm.org/way/364347388,G,,
335067443,00010,33506744300010,O,1986-01-01,NN,,,,true,1,,,,,HAMEAU DE L OUGERIE,36290,PAULNAY,,,36153,,,,,,,,,,,,,,,,,,,1999-11-30,F,,,,,01.3Z,NAF1993,N,1.150598,46.846964,0.34,street,Route de la Carterie 36290 Paulnay,36153_0015,G,ROUTE DE LA CARTERIE,
338218233,00017,33821823300017,O,1986-07-07,,,4399CZ,2020-02-01T04:07:09,true,5,,,,LD,CARCOT,36290,PAULNAY,,,36153,,,,,,,,,,,,,,,,,,,2019-12-31,F,,,,,43.99C,NAFRev2,N,1.137219,46.850394,0.9,locality,La Piece de Carcot 36290 Paulnay,36153_b322,G,LA PIECE DE CARCOT,
339469025,00029,33946902500029,O,2015-12-02,,,,2019-04-04T03:42:34,true,2,LES BAS AVINEAUX,,,RTE,DE MURS,36290,PAULNAY,,,36153,,,,,,,,,,,,,,,,,,,2019-03-30,F,,,,,47.91B,NAFRev2,N,1.150598,46.846964,0.47,street,Route de la Carterie 36290 Paulnay,36153_0015,G,ROUTE DE LA CARTERIE,
339579922,00024,33957992200024,O,,NN,,,,true,1,,,,,LA MOTTE,36290,PAULNAY,,,36153,,,,,,,,,,,,,,,,,,,1996-09-14,F,,,,,92.3A,NAF1993,N,2.9613853,45.4137242,0.9,poi.peak,La Motte (Pic) Compains,https://osm.org/node/673843336,G,,
342421468,00071,34242146800071,O,2005-01-01,,,,2007-08-31T11:13:24,true,4,,,,,LE POMMIER CARRE,36290,PAULNAY,,,36153,,,,,,,,,,,,,,,,,,,2007-08-30,F,,,,,01.4B,NAFRev1,N,1.163788,46.841749,0.93,locality,Le Pommier Carre 36290 Paulnay,36153_b366,G,LE POMMIER CARRE,
343598090,00011,34359809000011,O,1988-01-01,NN,,,2013-02-02T12:37:16,true,5,,,,,LA BARAUDIERE,36290,PAULNAY,,,36153,,,,,,,,,,,,,,,,,,,2008-01-01,F,,,,,01.11Z,NAFRev2,N,3.9366988,46.0037501,0.89,poi.track,Chemin de la Baraudière Saint-Alban-les-Eaux,https://osm.org/way/364347388,G,,
343852802,00010,34385280200010,O,,NN,,,,true,1,,,,DOM,DE BEAUVAIS,36290,PAULNAY,,,36153,,,,,,,,,,,,,,,,,,,1995-09-30,F,,,,,01.3Z,NAF1993,N,,,0,,,,,,
344465349,00019,34446534900019,O,1988-01-01,NN,,,2021-03-26T03:51:43,true,3,,,,,TOUCHE DE LAY,36290,PAULNAY,,,36153,,,,,,,,,,,,,,,,,,,2008-01-01,A,,,,,01.42Z,NAFRev2,N,1.180791,46.848627,0.93,locality,Touche de Lay 36290 Paulnay,36153_b462,G,TOUCHE DE LAY,
344465430,00017,34446543000017,O,1988-01-01,NN,,,2007-01-18T09:25:28,true,3,,,,,MONTBROND,36290,PAULNAY,,,36153,,,,,,,,,,,,,,,,,,,1996-12-25,F,,,,,01.3Z,NAF1993,N,1.166443,46.856789,0.72,locality,Les Terriers de Montbron 36290 Paulnay,36153_b457,G,LES TERRIERS DE MONTBRON,
348997578,00011,34899757800011,O,1988-08-19,NN,,,2015-01-14T10:19:57,false,4,,,,LD,LES CHATAIGNIERS,36290,PAULNAY,,,36153,,,,,,,,,,,,,,,,,,,2008-01-01,F,,,,,02.20Z,NAFRev2,N,2.1445079,48.8173059,0.9,poi.school,École les Chataigniers Versailles,https://osm.org/way/550626470,G,,
349331587,00015,34933158700015,O,,NN,,,,true,1,,,,,CARCOT,36290,PAULNAY,,,36153,,,,,,,,,,,,,,,,,,,1996-12-31,F,,,,,01.1A,NAF1993,N,1.137219,46.850394,0.9,locality,La Piece de Carcot 36290 Paulnay,36153_b322,G,LA PIECE DE CARCOT,
352081921,00012,35208192100012,O,1900-01-01,NN,,,2011-04-28T00:42:12,false,4,,,,LD,LA CARTERIE,36290,PAULNAY,,,36153,,,,,,,,,,,,,,,,,,,1991-12-25,F,,,,,86.10,NAP,N,1.150598,46.846964,0.91,street,Route de la Carterie 36290 Paulnay,36153_0015,G,ROUTE DE LA CARTERIE,
352430367,00016,35243036700016,O,1989-09-15,NN,,,2008-01-04T23:42:28,true,3,,,,,LE TRANCAY,36290,PAULNAY,,,36153,,,,,,,,,,,,,,,,,,,2008-01-01,A,,,,,01.11Z,NAFRev2,N,1.14932,46.823482,0.34,locality,Le Moulin de la Ramée 36290 Paulnay,36153_b279,G,LE MOULIN DE LA RAMEE,
353209075,00012,35320907500012,O,1990-01-01,NN,,,,true,1,,,,,TRONCAY,36290,PAULNAY,,,36153,,,,,,,,,,,,,,,,,,,2001-09-29,F,,,,,01.1A,NAF1993,N,1.166443,46.856789,0.34,locality,Les Terriers de Montbron 36290 Paulnay,36153_b457,G,LES TERRIERS DE MONTBRON,
353304686,00010,35330468600010,O,1990-01-01,NN,,,,true,1,,,,,LA PETONNIERE,36290,PAULNAY,,,36153,,,,,,,,,,,,,,,,,,,2001-09-30,F,,,,,01.1A,NAF1993,N,1.1442702,46.8853128,0.88,poi.track,Chemin Rural de la Pétonnière aux Grégeaudières Paulnay,https://osm.org/way/231130385,G,,
356000240,02921,35600024002921,O,1991-01-01,NN,,,2006-10-28T00:10:08,false,3,,5,,RUE,DE LA POSTE,36290,PAULNAY,,,36153,,,,,,,,,,,,,,,,,,,2006-04-01,F,BUREAU DE POSTE,,,,64.1A,NAFRev1,O,1.147808,46.849973,0.93,housenumber,5 Rue de la Poste 36290 Paulnay,36153_0080_00005,G,5 RUE DE LA POSTE,
379857550,00014,37985755000014,O,,NN,,,2006-11-25T11:28:06,true,1,,,,,LA MOTTE,36290,PAULNAY,,,36153,,,,,,,,,,,,,,,,,,,1993-09-18,F,,,,,92.3A,NAF1993,N,2.9613853,45.4137242,0.9,poi.peak,La Motte (Pic) Compains,https://osm.org/node/673843336,G,,
380067561,00023,38006756100023,O,1999-04-01,NN,,,2018-12-14T03:45:10,true,3,,,,,L OASIS,36290,PAULNAY,,,36153,,,,,,,,,,,,,,,,,,,2008-01-01,A,,,,,68.20B,NAFRev2,N,3.846203,45.914509,0.89,poi.bar,L'Oasis (Bar) Saint-Just-en-Chevalet,https://osm.org/way/407968431,G,,
380372714,00010,38037271400010,O,,NN,,,,true,1,,,,,LE BOURG,36290,PAULNAY,,,36153,,,,,,,,,,,,,,,,,,,1992-06-28,F,,,,,52.1B,NAF1993,N,2.212915,47.9910304,0.9,poi.bar,Le Bourg (Bar) Ingrannes,https://osm.org/node/1718543174,G,,
382526101,00011,38252610100011,O,1991-05-01,NN,,,2008-01-04T22:11:16,true,3,MAIRIE,3,,RUE,GEORGES CLEMENCEAU,36290,PAULNAY,,,36153,,,,,,,,,,,,,,,,,,,2008-01-01,A,,,,,01.61Z,NAFRev2,N,1.147376,46.850521,0.93,housenumber,3 Rue Georges Clémenceau 36290 Paulnay,36153_0041_00003,G,3 RUE GEORGES CLEMENCEAU,
384269270,00011,38426927000011,O,1992-01-01,NN,,,2008-01-04T22:36:16,true,3,,,,,CARCOT,36290,PAULNAY,,,36153,,,,,,,,,,,,,,,,,,,2008-01-01,A,,,,,01.50Z,NAFRev2,N,1.137219,46.850394,0.9,locality,La Piece de Carcot 36290 Paulnay,36153_b322,G,LA PIECE DE CARCOT,
388403537,00011,38840353700011,O,,NN,,,,true,1,,,,,LE BOURG,36290,PAULNAY,,,36153,,,,,,,,,,,,,,,,,,,1993-03-31,F,,,,,52.1B,NAF1993,N,2.212915,47.9910304,0.9,poi.bar,Le Bourg (Bar) Ingrannes,https://osm.org/node/1718543174,G,,
390198059,00011,39019805900011,O,1993-01-01,NN,,,2016-01-12T00:14:34,true,3,,,,,LA MAISON NEUVE,36290,PAULNAY,,,36153,,,,,,,,,,,,,,,,,,,2008-01-01,A,,,,,01.11Z,NAFRev2,N,1.150529,46.874303,0.93,locality,La Maison Neuve 36290 Paulnay,36153_b252,G,LA MAISON NEUVE,
391847308,00015,39184730800015,O,1993-07-03,NN,,,,true,1,,1,,PL,SAINT ETIENNE,36290,PAULNAY,,,36153,,,,,,,,,,,,,,,,,,,1998-05-31,F,,,,,52.1B,NAF1993,N,1.147991,46.850559,0.84,housenumber,1 Place Saint Etienne 36290 Paulnay,36153_0100_00001,G,1 PLACE SAINT ETIENNE,
392317525,00021,39231752500021,O,2000-02-07,NN,,,2006-10-28T01:51:16,true,3,,,,,LA TOUCHE DE LAY,36290,PAULNAY,,,36153,,,,,,,,,,,,,,,,,,,2004-11-03,F,,,,,01.4A,NAFRev1,N,1.180791,46.848627,0.83,locality,Touche de Lay 36290 Paulnay,36153_b462,G,TOUCHE DE LAY,
392994141,00019,39299414100019,O,,NN,,,2006-11-25T12:16:24,true,1,,,,,LA MOTTE,36290,PAULNAY,,,36153,,,,,,,,,,,,,,,,,,,1996-09-14,F,,,,,92.3A,NAF1993,N,2.9613853,45.4137242,0.9,poi.peak,La Motte (Pic) Compains,https://osm.org/node/673843336,G,,
394189989,00012,39418998900012,O,1992-11-01,NN,,,2014-06-14T02:16:32,true,3,,,,,LA BARAUDIERE,36290,PAULNAY,,,36153,,,,,,,,,,,,,,,,,,,2008-01-01,A,,,,,01.42Z,NAFRev2,N,3.9366988,46.0037501,0.89,poi.track,Chemin de la Baraudière Saint-Alban-les-Eaux,https://osm.org/way/364347388,G,,
399880236,00019,39988023600019,O,,NN,,,,true,1,,,,,LA TOUCHE AUX PLAIX,36290,PAULNAY,,,36153,,,,,,,,,,,,,,,,,,,1995-01-01,F,,,,,01.1A,NAF1993,N,1.157444,46.833653,0.83,locality,La Touche au Plaix 36290 Paulnay,36153_b461,G,LA TOUCHE AU PLAIX,
402232045,00011,40223204500011,O,1995-07-01,NN,,,,true,1,,28,,RUE,GEORGES CLEMENCEAU,36290,PAULNAY,,,36153,,,,,,,,,,,,,,,,,,,2002-03-31,F,,,,,50.1Z,NAF1993,O,1.142914,46.850767,0.93,housenumber,28 Rue Georges Clémenceau 36290 Paulnay,36153_0041_00028,G,28 RUE GEORGES CLEMENCEAU,
402553994,00011,40255399400011,O,1991-01-30,NN,,,2011-04-23T08:54:56,true,5,,,,,LES BRANDES,36290,PAULNAY,,,36153,,,,,,,,,,,,,,,,,,,2009-12-31,F,,,,,01.50Z,NAFRev2,N,0.5056813,46.5011472,0.9,poi.park,Les Brandes (Parc) Fleuré,https://osm.org/way/222489114,G,,
403116254,00018,40311625400018,O,,NN,,,,true,1,,,,,BEAUVAIS,36290,PAULNAY,,,36153,,,,,,,,,,,,,,,,,,,1996-05-13,F,,,,,01.3Z,NAF1993,N,2.0899092,49.4288339,0.9,poi.park,(Parc) Beauvais,https://osm.org/way/556458817,G,,
405279100,00011,40527910000011,O,,NN,,,,true,1,,,,,,36290,PAULNAY,,,36153,,,,,,,,,,,,,,,,,,,1996-12-31,F,,,,,01.1A,NAF1993,N,,,0,,,,,,
405279118,00013,40527911800013,O,,NN,,,,true,1,,,,,,36290,PAULNAY,,,36153,,,,,,,,,,,,,,,,,,,1996-11-30,F,,,,,01.1A,NAF1993,N,,,0,,,,,,
405279126,00016,40527912600016,O,1981-01-01,NN,,,2006-12-15T01:01:35,false,4,,,,,LA TOUCHE DE LAY,36290,PAULNAY,,,36153,,,,,,,,,,,,,,,,,,,1998-12-25,F,,,,,70.2B,NAF1993,N,1.180791,46.848627,0.83,locality,Touche de Lay 36290 Paulnay,36153_b462,G,TOUCHE DE LAY,
405279126,00024,40527912600024,O,1998-01-01,NN,,,2008-01-04T20:52:58,true,3,,,,,LA TOUCHE AU PLAIX,36290,PAULNAY,,,36153,,,,,,,,,,,,,,,,,,,2008-01-01,A,,,,,68.20B,NAFRev2,N,1.157444,46.833653,0.93,locality,La Touche au Plaix 36290 Paulnay,36153_b461,G,LA TOUCHE AU PLAIX,
405279134,00010,40527913400010,O,1981-01-01,NN,,3312ZB,2015-12-01T15:48:06,true,5,ROUTE DE L'OASIS,,,RTE,LES PRES DE LA FONTAINE,36290,PAULNAY,,,36153,,,,,,,,,,,,,,,,,,,2015-11-12,A,,,,,33.12Z,NAFRev2,N,1.1868,46.844094,0.84,locality,Les Pres de la Fontaine 36290 Paulnay,36153_b405,G,LES PRES DE LA FONTAINE,
408980274,00034,40898027400034,O,2013-04-01,,,,2016-02-01T08:35:55,true,2,,,,,LUCHET,36290,PAULNAY,,,36153,,,,,,,,,,,,,,,,,,,2016-01-31,F,,,,,56.10A,NAFRev2,N,0.2567256,44.2325151,0.88,poi.residential,Luchet (Zone résidentielle) Ambrus,https://osm.org/way/418335918,G,,
408987949,00018,40898794900018,O,1981-01-01,NN,,,,true,1,,,,,CARCOT,36290,PAULNAY,,,36153,,,,,,,,,,,,,,,,,,,2000-05-01,F,,,,,01.1A,NAF1993,N,1.137219,46.850394,0.9,locality,La Piece de Carcot 36290 Paulnay,36153_b322,G,LA PIECE DE CARCOT,
408987956,00013,40898795600013,O,1986-12-31,NN,,,2009-08-07T05:33:04,true,4,,,,RTE,D AZAY LE FERRON,36290,PAULNAY,,,36153,,,,,,,,,,,,,,,,,,,2009-08-31,F,,,,,01.11Z,NAFRev2,N,0.7122657,47.3784787,0.77,poi.footway,Place d'Azay le Ferron (Chemin piéton) Tours,https://osm.org/way/50576289,G,,
408987964,00017,40898796400017,O,1995-01-01,NN,,,,true,1,,,,,LA BECAVINIERE,36290,PAULNAY,,,36153,,,,,,,,,,,,,,,,,,,2002-05-15,F,,,,,01.1A,NAF1993,N,1.14367,46.875887,0.39,locality,La Piece des Bernardieres 36290 Paulnay,36153_b339,G,LA PIECE DES BERNARDIERES,
409072535,00035,40907253500035,O,2012-07-01,,,,2015-10-08T11:35:37,true,2,LUCHET,,,,,36290,PAULNAY,,,36153,,,,,,,,,,,,,,,,,,,2015-09-30,F,,,,,55.10Z,NAFRev2,N,1.157444,46.833653,0.37,locality,La Touche au Plaix 36290 Paulnay,36153_b461,D,LA TOUCHE AU PLAIX,
409886660,00029,40988666000029,O,2003-05-15,NN,,,2019-09-20T10:43:54,true,4,LA MARECHALERIE,,,,LES PRES DU CHAPITRE,36290,PAULNAY,,,36153,,,,,,,,,,,,,,,,,,,2016-11-21,F,,,,,47.78C,NAFRev2,N,1.14716,46.849125,0.93,locality,Les Pres du Chapitre 36290 Paulnay,36153_b414,G,LES PRES DU CHAPITRE,
410048953,00013,41004895300013,O,1996-10-01,NN,,,,true,4,,,,,LA CAILLONNIERE,36290,PAULNAY,,,36153,,,,,,,,,,,,,,,,,,,1999-08-02,F,,,,,01.2C,NAF1993,N,0.4334994,47.8507758,0.89,poi.track,Chemin de la Caillonnière au Camp Pruillé-l'Éguillé,https://osm.org/way/174480988,G,,
410904239,00010,41090423900010,O,1996-12-01,NN,,,2006-11-30T05:11:34,true,3,,,,,L ARBRE SEC,36290,PAULNAY,,,36153,,,,,,,,,,,,,,,,,,,2006-09-30,F,,,,,01.1A,NAFRev1,N,1.148823,46.864745,0.93,locality,L'Arbre Sec 36290 Paulnay,36153_b001,G,L ARBRE SEC,
412047086,00019,41204708600019,O,1997-06-01,NN,,,,true,1,,,,,LA PETONNIERE,36290,PAULNAY,,,36153,,,,,,,,,,,,,,,,,,,2001-02-28,F,,,,,50.1Z,NAF1993,N,1.1442702,46.8853128,0.88,poi.track,Chemin Rural de la Pétonnière aux Grégeaudières Paulnay,https://osm.org/way/231130385,G,,
412436636,00010,41243663600010,O,1997-05-15,NN,,,2008-01-04T22:16:07,true,3,,,,,LES MERLAUDIERES,36290,PAULNAY,,,36153,,,,,,,,,,,,,,,,,,,2008-01-01,A,,,,,01.11Z,NAFRev2,N,1.14367,46.875887,0.37,locality,La Piece des Bernardieres 36290 Paulnay,36153_b339,G,LA PIECE DES BERNARDIERES,
412456576,00013,41245657600013,O,1997-01-01,NN,,,2008-01-04T22:16:28,true,3,,,,,LA PETONNIERE,36290,PAULNAY,,,36153,,,,,,,,,,,,,,,,,,,2008-01-01,A,,,,,01.50Z,NAFRev2,N,1.1442702,46.8853128,0.88,poi.track,Chemin Rural de la Pétonnière aux Grégeaudières Paulnay,https://osm.org/way/231130385,G,,
413415738,00025,41341573800025,O,2004-01-01,NN,,,2009-05-13T05:06:41,true,4,,,,,LA TOUCHE AU PLAIX,36290,PAULNAY,,,36153,,,,,,,,,,,,,,,,,,,2008-11-30,F,,,,,01.50Z,NAFRev2,N,1.157444,46.833653,0.93,locality,La Touche au Plaix 36290 Paulnay,36153_b461,G,LA TOUCHE AU PLAIX,
415182518,00027,41518251800027,O,2018-12-31,01,2018,,2021-02-23T11:37:40,true,1,,,,LD,L'ARBRE SEC,36290,PAULNAY,,,36153,,,,,,,,,,,,,,,,,,,2018-12-31,A,,,,,01.11Z,NAFRev2,N,1.148823,46.864745,0.93,locality,L'Arbre Sec 36290 Paulnay,36153_b001,G,L ARBRE SEC,
415239714,00017,41523971400017,O,1997-12-31,NN,,,2021-02-23T11:37:44,true,3,,,,LD,LA TOUCHE DE LAY,36290,PAULNAY,,,36153,,,,,,,,,,,,,,,,,,,2008-01-01,A,,,,,01.11Z,NAFRev2,N,1.180791,46.848627,0.83,locality,Touche de Lay 36290 Paulnay,36153_b462,G,TOUCHE DE LAY,
417775475,00011,41777547500011,O,1998-02-03,NN,,,2009-08-07T05:33:05,true,3,,,,,LES MERLAUDIERS,36290,PAULNAY,,,36153,,,,,,,,,,,,,,,,,,,2005-06-23,F,,,,,01.1A,NAFRev1,N,1.166443,46.856789,0.41,locality,Les Terriers de Montbron 36290 Paulnay,36153_b457,G,LES TERRIERS DE MONTBRON,
418302857,00010,41830285700010,O,1998-01-01,NN,,,2007-01-05T16:11:04,true,3,,,,,MONTBRON,36290,PAULNAY,,,36153,,,,,,,,,,,,,,,,,,,2006-12-31,F,,,,,55.2E,NAFRev1,N,1.166443,46.856789,0.9,locality,Les Terriers de Montbron 36290 Paulnay,36153_b457,G,LES TERRIERS DE MONTBRON,
422060004,00013,42206000400013,O,1999-02-10,NN,,,2011-10-19T05:46:26,true,4,,,,,LE PIROUET,36290,PAULNAY,,,36153,,,,,,,,,,,,,,,,,,,2011-01-01,F,,,,,03.22Z,NAFRev2,N,4.3228616,45.3963892,0.72,poi.kindergarten,Crèche Les Pirouettes (Jardin d'enfant) Le Chambon-Feugerolles,https://osm.org/node/2228655946,G,,
422060178,00015,42206017800015,O,1999-02-10,01,2018,,2021-01-21T03:49:08,true,4,,,,,LE PIROUET,36290,PAULNAY,,,36153,,,,,,,,,,,,,,,,,,,2012-12-31,A,,,,,01.11Z,NAFRev2,O,4.3228616,45.3963892,0.72,poi.kindergarten,Crèche Les Pirouettes (Jardin d'enfant) Le Chambon-Feugerolles,https://osm.org/node/2228655946,G,,