siren,nic,siret,statutDiffusionEtablissement,dateCreationEtablissement,trancheEffectifsEtablissement,anneeEffectifsEtablissement,activitePrincipaleRegistreMetiersEtablissement,dateDernierTraitementEtablissement,etablissementSiege,nombrePeriodesEtablissement,complementAdresseEtablissement,numeroVoieEtablissement,indiceRepetitionEtablissement,typeVoieEtablissement,libelleVoieEtablissement,codePostalEtablissement,libelleCommuneEtablissement,libelleCommuneEtrangerEtablissement,distributionSpecialeEtablissement,codeCommuneEtablissement,codeCedexEtablissement,libelleCedexEtablissement,codePaysEtrangerEtablissement,libellePaysEtrangerEtablissement,complementAdresse2Etablissement,numeroVoie2Etablissement,indiceRepetition2Etablissement,typeVoie2Etablissement,libelleVoie2Etablissement,codePostal2Etablissement,libelleCommune2Etablissement,libelleCommuneEtranger2Etablissement,distributionSpeciale2Etablissement,codeCommune2Etablissement,codeCedex2Etablissement,libelleCedex2Etablissement,codePaysEtranger2Etablissement,libellePaysEtranger2Etablissement,dateDebut,etatAdministratifEtablissement,enseigne1Etablissement,enseigne2Etablissement,enseigne3Etablissement,denominationUsuelleEtablissement,activitePrincipaleEtablissement,nomenclatureActivitePrincipaleEtablissement,caractereEmployeurEtablissement,longitude,latitude,geo_score,geo_type,geo_adresse,geo_id,geo_ligne,geo_l4,geo_l5
213901028,00018,21390102800018,O,1983-03-01,02,2018,,2020-08-25T10:17:08,true,4,,,,,,01590,CHANCIA,,,39102,,,,,,,,,,,,,,,,,,,2008-01-01,A,MAIRIE,,,,84.11Z,NAFRev2,O,,,0,,,,,,
213901028,00034,21390102800034,O,1997-01-01,NN,,,2010-06-30T11:39:01,false,4,MAIRIE,,,,,01590,CHANCIA,,,39102,,,,,,,,,,,,,,,,,,,2008-12-31,F,SERVICE EAU,,,,36.00Z,NAFRev2,N,,,0,,,,,,
213901028,00042,21390102800042,O,2000-01-01,00,2018,,2020-08-25T10:17:08,false,4,,,,CHE,DEPARTEMENTAL 60,01590,CHANCIA,,,39102,,,,,,,,,,,,,,,,,,,2018-12-31,F,CAMPING DE CHANCIA,,,,55.30Z,NAFRev2,N,6.7782325,48.1905531,0.85,poi,Chemin Départemental 60 (Pont) La Chapelle-devant-Bruyères,https://osm.org/way/220398868,G,,
263900870,00019,26390087000019,O,1986-01-01,NN,,,2016-07-23T12:09:54,true,4,,,,,,01590,CHANCIA,,,39102,,,,,,,,,,,,,,,,,,,2016-01-01,F,CCAS,,,,88.99B,NAFRev2,N,,,0,,,,,,
305494205,00027,30549420500027,O,,NN,,,,true,1,,,,RUE,DU BAS,01590,CHANCIA,,,39102,,,,,,,,,,,,,,,,,,,1991-06-24,F,,,,,87.03,NAP,N,5.3388121,46.4032148,0.89,poi.track,Rue du Bas (Chemin) Les Trois-Châteaux,https://osm.org/way/389272923,G,,
312056393,00027,31205639300027,O,1997-10-01,NN,,,2020-11-12T09:11:26,true,4,,,,,LE VILLAGE,01590,CHANCIA,,,39102,,,,,,,,,,,,,,,,,,,2009-05-15,F,,,,,25.73A,NAFRev2,N,2.2950702,48.9311749,0.9,poi.bar,bar le village Gennevilliers,https://osm.org/node/3287755128,G,,
324583905,00017,32458390500017,O,,NN,,,2016-08-24T03:59:56,true,1,,,,,,01590,CHANCIA,,,39102,,,,,,,,,,,,,,,,,,,1996-12-31,F,,,,,02.0B,NAF1993,N,,,0,,,,,,
326237807,00036,32623780700036,O,1988-07-01,NN,,,2009-12-03T13:38:11,false,4,,,,,,01590,CHANCIA,,,39102,,,,,,,,,,,,,,,,,,,2009-08-31,F,,,,,68.20B,NAFRev2,N,,,0,,,,,,
342536307,00016,34253630700016,O,1987-10-01,NN,,,,false,4,,,,,,01590,CHANCIA,,,39102,,,,,,,,,,,,,,,,,,,1996-12-31,F,,,,,36.1G,NAF1993,O,,,0,,,,,,
342587227,00014,34258722700014,O,,,,,,true,1,,,,,,01590,CHANCIA,,,39102,,,,,,,,,,,,,,,,,,,1989-09-15,F,,,,,51.10,NAP,N,,,0,,,,,,
343451639,00011,34345163900011,O,1988-01-11,NN,,8219ZP,2015-01-08T08:26:29,true,4,,,,,,01590,CHANCIA,,,39102,,,,,,,,,,,,,,,,,,,2014-12-31,F,,,,,71.12B,NAFRev2,N,,,0,,,,,,
350271284,00035,35027128400035,O,2006-01-01,,,9602AB,2021-02-23T11:03:02,true,2,,12,,RUE,DE LA RAVIERE,01590,CHANCIA,,,39102,,,,,,,,,,,,,,,,,,,2008-01-01,A,,,,,96.02A,NAFRev2,N,5.642757,46.347834,0.93,housenumber,12 Rue de la Ravière 01590 Chancia,39102_0055_00012,G,12 RUE DE LA RAVIERE,
351838032,00024,35183803200024,O,2011-04-01,,,,2013-03-10T05:36:46,true,2,,14,,RUE,DE BELLEVUE,01590,CHANCIA,,,39102,,,,,,,,,,,,,,,,,,,2013-03-30,F,,,,,70.22Z,NAFRev2,N,5.642663,46.346567,0.93,housenumber,14 Rue de Bellevue 01590 Chancia,39102_0005_00014,G,14 RUE DE BELLEVUE,
353788599,00010,35378859900010,O,1990-01-01,NN,,,,true,4,,,,,,01590,CHANCIA,,,39102,,,,,,,,,,,,,,,,,,,1996-12-25,F,,,,,55.1A,NAF1993,O,,,0,,,,,,
379666738,00024,37966673800024,O,1990-10-01,NN,,,2012-05-05T03:47:07,true,5,,,,,,01590,CHANCIA,,,39102,,,,,,,,,,,,,,,,,,,2011-12-24,F,,,,,47.78C,NAFRev2,O,,,0,,,,,,
382612265,00035,38261226500035,O,2002-01-21,NN,,,,false,3,,16,,RUE,BELLEVUE,01590,CHANCIA,,,39102,,,,,,,,,,,,,,,,,,,2002-12-25,F,LA FLAMBEE,,,,55.3B,NAF1993,N,5.641747,46.34676,0.92,housenumber,16 Rue de Bellevue 01590 Chancia,39102_0005_00016,G,16 RUE DE BELLEVUE,
397941022,00022,39794102200022,O,1997-10-01,NN,,,2010-03-07T05:18:08,true,6,,,,LD,LE VILLAGE,01590,CHANCIA,,,39102,,,,,,,,,,,,,,,,,,,2009-12-10,F,,,,,33.12Z,NAFRev2,N,2.2950702,48.9311749,0.9,poi.bar,bar le village Gennevilliers,https://osm.org/node/3287755128,G,,
400163507,00017,40016350700017,O,1995-02-28,NN,,,,false,4,,,,,LE CHANET,01590,CHANCIA,,,39102,,,,,,,,,,,,,,,,,,,1998-06-30,F,,,,,70.2C,NAF1993,N,6.1275095,47.0995518,0.89,poi.camp_site,Le Chanet (Camping) Ornans,https://osm.org/way/420201539,G,,
401261045,00017,40126104500017,O,1995-05-15,NN,,,2008-08-03T11:34:09,true,4,,6,,RUE,DE BELLEVUE,01590,CHANCIA,,,39102,,,,,,,,,,,,,,,,,,,2008-05-16,F,,,,,46.74B,NAFRev2,N,5.644314,46.345874,0.93,housenumber,6 Rue de Bellevue 01590 Chancia,39102_0005_00006,G,6 RUE DE BELLEVUE,
420501314,00017,42050131400017,O,1998-10-12,NN,,,2016-03-15T15:57:31,false,4,,,,CHE,DEPARTEMENTAL 60,01590,CHANCIA,,,39102,,,,,,,,,,,,,,,,,,,2011-11-01,F,,,,,96.09Z,NAFRev2,N,6.7782325,48.1905531,0.85,poi,Chemin Départemental 60 (Pont) La Chapelle-devant-Bruyères,https://osm.org/way/220398868,G,,
430290296,00010,43029029600010,O,2000-04-28,,,,,true,1,,2,,RUE,DE BELLEVUE,01590,CHANCIA,,,39102,,,,,,,,,,,,,,,,,,,2000-09-10,F,,,,,55.1A,NAF1993,N,5.645648,46.345465,0.93,housenumber,2 Rue de Bellevue 01590 Chancia,39102_0005_00002,G,2 RUE DE BELLEVUE,
431331875,00010,43133187500010,O,2000-03-15,NN,,,,true,4,,,,LOT,LA RAVIERE 2,01590,CHANCIA,,,39102,,,,,,,,,,,,,,,,,,,2002-07-26,F,,,,,51.7Z,NAF1993,N,5.641754,46.348352,0.6,street,Rue de la Ravière 01590 Chancia,39102_0055,G,RUE DE LA RAVIERE,
439121468,00011,43912146800011,O,2001-08-31,NN,,,2010-08-06T18:35:02,true,4,,3,,CHE,DE NEZAN,01590,CHANCIA,,,39102,,,,,,,,,,,,,,,,,,,2010-06-30,F,,,,,70.22Z,NAFRev2,N,5.644374,46.347679,0.81,housenumber,3 Chemin de Nezan 01590 Chancia,39102_0030_00003,G,3 CHEMIN DE NEZAN,
444982649,00030,44498264900030,O,2005-10-01,,,,2011-09-28T13:07:29,false,3,,6,,RUE,DU JURA,01590,CHANCIA,,,39102,,,,,,,,,,,,,,,,,,,2011-07-01,F,,,,,62.01Z,NAFRev2,N,5.644233,46.345481,0.93,housenumber,6 Rue du Jura 01590 Chancia,39102_0025_00006,G,6 RUE DU JURA,
448797928,00018,44879792800018,O,2003-04-01,NN,,,2011-04-23T12:20:23,false,5,,2,,RUE,BELLEVUE,01590,CHANCIA,,,39102,,,,,,,,,,,,,,,,,,,2009-07-24,F,PIZZA DE LA TOUR,,,,68.20B,NAFRev2,N,5.645648,46.345465,0.92,housenumber,2 Rue de Bellevue 01590 Chancia,39102_0005_00002,G,2 RUE DE BELLEVUE,
453603268,00047,45360326800047,O,2019-10-01,,,3312ZB,2020-03-05T19:33:13,false,3,,12,,RUE,DU JURA,01590,CHANCIA,,,39102,,,,,,,,,,,,,,,,,,,2020-03-01,F,,,,PMMS 01,33.12Z,NAFRev2,N,5.641075,46.346419,0.93,housenumber,12 Rue du Jura 01590 Chancia,39102_0025_00012,G,12 RUE DU JURA,
479870800,00022,47987080000022,O,2009-05-15,,,,2016-01-09T00:11:37,false,2,PRESQU'ILE,,,,CAMPING LES CYCLAMENS,01590,CHANCIA,,,39102,,,,,,,,,,,,,,,,,,,2009-09-30,F,,,,,56.10C,NAFRev2,N,6.1319173,45.6882431,0.82,poi.camp_site,Camping des Cyclamens Le Châtelard,https://osm.org/way/406509336,G,,
488499658,00018,48849965800018,O,2006-02-02,NN,,,2017-05-04T05:49:49,false,3,,17,,RUE,CHAMP MONTANT,01590,CHANCIA,,,39102,,,,,,,,,,,,,,,,,,,2016-02-23,F,,,,,49.41A,NAFRev2,O,5.642998,46.348373,0.89,housenumber,17 Rue du Champ Montant 01590 Chancia,39102_0010_00017,G,17 RUE DU CHAMP MONTANT,
488779224,00010,48877922400010,O,2006-03-01,,,,2012-10-15T15:38:30,false,3,,2,,RUE,BELLEVUE,01590,CHANCIA,,,39102,,,,,,,,,,,,,,,,,,,2012-09-01,F,,,,,68.20B,NAFRev2,N,5.645648,46.345465,0.92,housenumber,2 Rue de Bellevue 01590 Chancia,39102_0005_00002,G,2 RUE DE BELLEVUE,
499280600,00010,49928060000010,O,2007-07-02,NN,,,2013-01-13T05:27:09,true,5,,2,,RUE,BELLEVUE,01590,CHANCIA,,,39102,,,,,,,,,,,,,,,,,,,2012-04-10,F,,,,,55.10Z,NAFRev2,N,5.645648,46.345465,0.92,housenumber,2 Rue de Bellevue 01590 Chancia,39102_0005_00002,G,2 RUE DE BELLEVUE,
501290969,00044,50129096900044,O,2009-09-01,,,,2012-03-08T13:46:26,false,2,,14,B,RUE,DE LA RAVIERE,01590,CHANCIA,,,39102,,,,,,,,,,,,,,,,,,,2012-02-01,F,,,,,66.22Z,NAFRev2,N,5.643501,46.34723,0.81,housenumber,14 bis Rue de la Ravière 01590 Chancia,39102_0055_00014_bis,G,14 BIS RUE DE LA RAVIERE,
504968033,00028,50496803300028,O,2009-06-05,,,,2014-05-21T03:40:07,false,2,,,,LD,LA PLAGE,01590,CHANCIA,,,39102,,,,,,,,,,,,,,,,,,,2014-03-14,F,LA PLAGE,,,,56.10C,NAFRev2,N,5.641457,46.344632,0.91,street,Chemin de la Plage 01590 Chancia,39102_0045,G,CHEMIN DE LA PLAGE,
507851756,00019,50785175600019,O,2008-09-01,,,,2011-02-04T04:58:27,true,1,,11,,RUE,DE BELLEVUE,01590,CHANCIA,,,39102,,,,,,,,,,,,,,,,,,,2008-09-01,A,,,,,43.34Z,NAFRev2,N,5.642555,46.346505,0.93,housenumber,11 Rue de Bellevue 01590 Chancia,39102_0005_00011,G,11 RUE DE BELLEVUE,
513861864,00017,51386186400017,O,2009-06-15,NN,,2562BZ,2018-09-29T12:28:37,true,4,,,,RUE,BELLEVUE,01590,CHANCIA,,,39102,,,,,,,,,,,,,,,,,,,2016-05-30,F,,,,,25.73A,NAFRev2,N,5.645154,46.345539,0.92,street,Rue de Bellevue 01590 Chancia,39102_0005,G,RUE DE BELLEVUE,
515318343,00016,51531834300016,O,1983-11-15,,,,2009-10-07T10:14:17,true,1,,,,,MAIRIE,01590,CHANCIA,,,39102,,,,,,,,,,,,,,,,,,,1983-11-15,A,,,,,94.99Z,NAFRev2,N,3.0709671,50.6304695,0.92,poi.townhall,Hôtel de Ville Lille,https://osm.org/way/40917078,G,,
519152508,00015,51915250800015,O,2010-01-01,01,2018,,2020-09-07T20:02:33,true,2,,12,,RUE,DE BELLEVUE,01590,CHANCIA,,,39102,,,,,,,,,,,,,,,,,,,2010-10-01,A,,,,,22.29B,NAFRev2,O,5.643076,46.346495,0.93,housenumber,12 Rue de Bellevue 01590 Chancia,39102_0005_00012,G,12 RUE DE BELLEVUE,
524219771,00044,52421977100044,O,2017-09-01,,,,2021-02-23T15:40:57,true,1,,5,,IMP,DU CHANAIS,01590,CHANCIA,,,39102,,,,,,,,,,,,,,,,,,,2017-09-01,A,,,,,70.21Z,NAFRev2,N,5.645133,46.347064,0.82,housenumber,5 Impasse du Chanais 01590 Chancia,39102_0015_00005,G,5 IMPASSE DU CHANAIS,
525093308,00019,52509330800019,O,2010-09-14,,,,2010-09-24T05:34:27,true,1,,22,,RUE,DE LA RAVIERE,01590,CHANCIA,,,39102,,,,,,,,,,,,,,,,,,,2010-09-14,A,,,,,68.20B,NAFRev2,N,5.644194,46.34689,0.93,housenumber,22 Rue de la Ravière 01590 Chancia,39102_0055_00022,G,22 RUE DE LA RAVIERE,
646340646,00017,64634064600017,O,1963-01-01,NN,,,2008-01-05T02:39:10,true,3,,,,,,01590,CHANCIA,,,39102,,,,,,,,,,,,,,,,,,,2008-01-01,A,,,,,68.20B,NAFRev2,N,,,0,,,,,,
762200756,00026,76220075600026,O,2014-10-20,01,2018,9529ZD,2021-02-23T16:11:50,true,2,,22,,RUE,DE LA RAVIERE,01590,CHANCIA,,,39102,,,,,,,,,,,,,,,,,,,2017-08-29,A,,,,,47.64Z,NAFRev2,O,5.644194,46.34689,0.93,housenumber,22 Rue de la Ravière 01590 Chancia,39102_0055_00022,G,22 RUE DE LA RAVIERE,
771200391,00031,77120039100031,O,2019-08-26,,,2573AZ,2021-02-23T16:11:51,true,1,,12,,RUE,DE BELLEVUE,01590,CHANCIA,,,39102,,,,,,,,,,,,,,,,,,,2019-08-26,A,,,,,25.73A,NAFRev2,O,5.643076,46.346495,0.93,housenumber,12 Rue de Bellevue 01590 Chancia,39102_0005_00012,G,12 RUE DE BELLEVUE,
778369215,00018,77836921500018,O,,,,,,true,1,,,,,,01590,CHANCIA,,,39102,,,,,,,,,,,,,,,,,,,1987-03-31,F,,,,,02.20,NAP,N,,,0,,,,,,
778369223,00012,77836922300012,O,,,,,,true,1,,,,,,01590,CHANCIA,,,39102,,,,,,,,,,,,,,,,,,,1984-12-25,F,,,,,48.07,NAP,N,,,0,,,,,,
778369249,00017,77836924900017,O,,NN,,,,true,1,,,,,,01590,CHANCIA,,,39102,,,,,,,,,,,,,,,,,,,1991-03-30,F,,,,,48.07,NAP,N,,,0,,,,,,
778369256,00012,77836925600012,O,,NN,,,,true,1,,,,,,01590,CHANCIA,,,39102,,,,,,,,,,,,,,,,,,,,F,,,,,48.07,NAP,N,,,0,,,,,,
778369298,00014,77836929800014,O,,NN,,,,true,1,,,,PL,DU VILLAGE,01590,CHANCIA,,,39102,,,,,,,,,,,,,,,,,,,1987-05-13,F,,,,,53.01,NAP,N,5.641749,46.346138,0.73,street,Rue du Village 01590 Chancia,39102_0065,G,RUE DU VILLAGE,
778369314,00019,77836931400019,O,,NN,,,,true,1,,,,,,01590,CHANCIA,,,39102,,,,,,,,,,,,,,,,,,,1994-09-09,F,,,,,52.2L,NAF1993,N,,,0,,,,,,
788379600,00042,78837960000042,O,2000-03-15,NN,,,2007-05-10T09:30:14,false,5,,12,,RUE,DE LA RAVIERE,01590,CHANCIA,,,39102,,,,,,,,,,,,,,,,,,,2003-12-25,F,,,,,74.1G,NAFRev1,N,5.642757,46.347834,0.93,housenumber,12 Rue de la Ravière 01590 Chancia,39102_0055_00012,G,12 RUE DE LA RAVIERE,
794111443,00014,79411144300014,O,2013-07-01,,,9602BA,2015-03-18T00:56:24,true,2,,3,,IMP,DU CHANAIS,01590,CHANCIA,,,39102,,,,,,,,,,,,,,,,,,,2013-08-02,A,,,,LA BOITE A ONGLES,96.02B,NAFRev2,N,5.645028,46.34758,0.82,housenumber,3 Impasse du Chanais 01590 Chancia,39102_0015_00003,G,3 IMPASSE DU CHANAIS,
801055484,00019,80105548400019,O,2014-02-11,NN,,,2017-11-22T03:19:03,true,4,,4,,CHE,DE LA PLAGE,01590,CHANCIA,,,39102,,,,,,,,,,,,,,,,,,,2015-09-30,F,,,,LA PLAGE,56.10A,NAFRev2,O,5.639458,46.343645,0.83,housenumber,4 Chemin de la Plage 01590 Chancia,39102_0045_00004,G,4 CHEMIN DE LA PLAGE,
802520734,00012,80252073400012,O,2014-05-13,,,,2019-10-15T17:32:58,false,2,,2,,RUE,DU VILLAGE,01590,CHANCIA,,,39102,,,,,,,,,,,,,,,,,,,2019-09-28,F,,,,,46.62Z,NAFRev2,N,5.64144,46.346112,0.93,housenumber,2 Rue du Village 01590 Chancia,39102_0065_00002,G,2 RUE DU VILLAGE,
804618726,00025,80461872600025,O,2014-10-13,NN,,2573BB,2016-04-26T06:37:42,false,2,,,,RUE,DE BELLEVUE,01590,CHANCIA,,,39102,,,,,,,,,,,,,,,,,,,2014-12-31,F,,,,,25.73B,NAFRev2,N,5.645154,46.345539,0.93,street,Rue de Bellevue 01590 Chancia,39102_0005,G,RUE DE BELLEVUE,
804782993,00013,80478299300013,O,2014-09-10,NN,,,2018-04-10T15:05:56,false,3,,8,,RUE,CHAMP MONTANT,01590,CHANCIA,,,39102,,,,,,,,,,,,,,,,,,,2015-07-15,F,,,,,64.30Z,NAFRev2,O,5.641878,46.349134,0.88,housenumber,8 Rue du Champ Montant 01590 Chancia,39102_0010_00008,G,8 RUE DU CHAMP MONTANT,
808854160,00021,80885416000021,O,2016-06-01,01,2018,2562BZ,2021-02-23T17:24:54,true,2,,9,,RUE,DE BELLEVUE,01590,CHANCIA,,,39102,,,,,,,,,,,,,,,,,,,2017-02-05,A,,,,,25.62B,NAFRev2,O,5.643321,46.346325,0.93,housenumber,9 Rue de Bellevue 01590 Chancia,39102_0005_00009,G,9 RUE DE BELLEVUE,
811387950,00017,81138795000017,O,2015-05-11,,,,2015-05-15T04:40:24,true,1,,22,,RUE,DE LA RAVIERE,01590,CHANCIA,,,39102,,,,,,,,,,,,,,,,,,,2015-05-11,A,,,,,68.20B,NAFRev2,N,5.644194,46.34689,0.93,housenumber,22 Rue de la Ravière 01590 Chancia,39102_0055_00022,G,22 RUE DE LA RAVIERE,
823121371,00012,82312137100012,O,2016-11-01,,,2562BZ,2016-10-14T10:51:25,true,1,,5,,RUE,DE LA PANETIERE,01590,CHANCIA,,,39102,,,,,,,,,,,,,,,,,,,2016-11-01,A,,,,A.M.I.S ALUMINIUM,25.62B,NAFRev2,N,5.640759,46.349198,0.93,housenumber,5 Rue de la Panetiere 01590 Chancia,39102_0035_00005,G,5 RUE DE LA PANETIERE,
828817692,00019,82881769200019,O,2017-03-13,01,2018,4322AZ,2020-08-25T11:34:46,true,5,,8,,RUE,DE BELLEVUE,01590,CHANCIA,,,39102,,,,,,,,,,,,,,,,,,,2019-10-11,A,,,,OPTITHERM HABITAT,43.22A,NAFRev2,N,5.643873,46.346084,0.93,housenumber,8 Rue de Bellevue 01590 Chancia,39102_0005_00008,G,8 RUE DE BELLEVUE,
835300047,00015,83530004700015,O,2018-02-10,,,1392ZC,2020-05-15T06:24:28,true,2,DOMICILE,1,,CHE,DES VIGNES,01590,CHANCIA,,,39102,,,,,,,,,,,,,,,,,,,2019-11-02,A,,,,,13.92Z,NAFRev2,N,5.645286,46.345986,0.82,housenumber,1 Chemin des Vignes 01590 Chancia,39102_0060_00001,G,1 CHEMIN DES VIGNES,
837575638,00015,83757563800015,O,2018-03-01,,,,2020-11-05T04:11:12,false,2,,5,,RUE,DU VILLAGE,01590,CHANCIA,,,39102,,,,,,,,,,,,,,,,,,,2018-04-03,F,,,,,32.13Z,NAFRev2,N,5.642031,46.346077,0.93,housenumber,5 Rue du Village 01590 Chancia,39102_0065_00005,G,5 RUE DU VILLAGE,
840211171,00011,84021117100011,O,2018-06-01,,,,2018-07-02T03:33:32,true,1,,,,CHE,DE LA PRESQU'ILE,01590,CHANCIA,,,39102,,,,,,,,,,,,,,,,,,,2018-06-01,A,,,,,55.30Z,NAFRev2,O,5.641457,46.344632,0.41,street,Chemin de la Plage 01590 Chancia,39102_0045,G,CHEMIN DE LA PLAGE,
841148133,00017,84114813300017,O,2018-07-03,,,,2018-07-19T04:36:23,true,1,CAMPING DE CHANCIA CHEMIN DE LA PRESQU,,,,,01590,CHANCIA,,,39102,,,,,,,,,,,,,,,,,,,2018-07-03,A,,,,,68.20B,NAFRev2,N,,,0,,,,,,
844532911,00014,84453291100014,O,2019-01-01,,,4399CZ,2018-12-12T07:50:28,true,1,,2,,RUE,DE LA FONTAINE,01590,CHANCIA,,,39102,,,,,,,,,,,,,,,,,,,2019-01-01,A,,,,L.F.M.T,43.99C,NAFRev2,N,5.641704,46.345871,0.93,housenumber,2 Rue de la Fontaine 01590 Chancia,39102_0020_00002,G,2 RUE DE LA FONTAINE,
850728668,00011,85072866800011,O,2018-10-24,,,,2019-05-14T09:33:23,true,1,,1,,RUE,DE LA PANETIERE,01590,CHANCIA,,,39102,,,,,,,,,,,,,,,,,,,2018-10-24,A,,,,,94.99Z,NAFRev2,N,5.640633,46.349444,0.93,housenumber,1 Rue de la Panetiere 01590 Chancia,39102_0035_00001,G,1 RUE DE LA PANETIERE,
877865790,00019,87786579000019,O,2019-09-24,,,,2019-10-08T03:45:23,true,1,,17,,RUE,DU CHAMP MONTANT,01590,CHANCIA,,,39102,,,,,,,,,,,,,,,,,,,2019-09-24,A,,,,,68.20B,NAFRev2,N,5.642998,46.348373,0.93,housenumber,17 Rue du Champ Montant 01590 Chancia,39102_0010_00017,G,17 RUE DU CHAMP MONTANT,
891372344,00012,89137234400012,O,2020-10-12,,,,2020-11-26T08:46:01,true,1,,8,,RUE,DE BELLEVUE,01590,CHANCIA,,,39102,,,,,,,,,,,,,,,,,,,2020-10-12,A,,,,,68.20B,NAFRev2,N,5.643873,46.346084,0.93,housenumber,8 Rue de Bellevue 01590 Chancia,39102_0005_00008,G,8 RUE DE BELLEVUE,
892522939,00016,89252293900016,O,2020-12-01,,,,2021-01-04T19:45:27,true,1,JURA,7,,RUE,DU CHAMP MONTANT,01590,CHANCIA,,,39102,,,,,,,,,,,,,,,,,,,2020-12-01,A,,,,,86.90D,NAFRev2,N,5.641876,46.34908,0.93,housenumber,7 Rue du Champ Montant 01590 Chancia,39102_0010_00007,G,7 RUE DU CHAMP MONTANT,
893448738,00011,89344873800011,O,2021-01-15,,,,2021-03-23T08:49:37,true,2,,5,,IMP,DU CHANAIS,01590,CHANCIA,,,39102,,,,,,,,,,,,,,,,,,,2021-02-01,A,,,,,70.22Z,NAFRev2,O,5.645133,46.347064,0.82,housenumber,5 Impasse du Chanais 01590 Chancia,39102_0015_00005,G,5 IMPASSE DU CHANAIS,
