siren,nic,siret,statutDiffusionEtablissement,dateCreationEtablissement,trancheEffectifsEtablissement,anneeEffectifsEtablissement,activitePrincipaleRegistreMetiersEtablissement,dateDernierTraitementEtablissement,etablissementSiege,nombrePeriodesEtablissement,complementAdresseEtablissement,numeroVoieEtablissement,indiceRepetitionEtablissement,typeVoieEtablissement,libelleVoieEtablissement,codePostalEtablissement,libelleCommuneEtablissement,libelleCommuneEtrangerEtablissement,distributionSpecialeEtablissement,codeCommuneEtablissement,codeCedexEtablissement,libelleCedexEtablissement,codePaysEtrangerEtablissement,libellePaysEtrangerEtablissement,complementAdresse2Etablissement,numeroVoie2Etablissement,indiceRepetition2Etablissement,typeVoie2Etablissement,libelleVoie2Etablissement,codePostal2Etablissement,libelleCommune2Etablissement,libelleCommuneEtranger2Etablissement,distributionSpeciale2Etablissement,codeCommune2Etablissement,codeCedex2Etablissement,libelleCedex2Etablissement,codePaysEtranger2Etablissement,libellePaysEtranger2Etablissement,dateDebut,etatAdministratifEtablissement,enseigne1Etablissement,enseigne2Etablissement,enseigne3Etablissement,denominationUsuelleEtablissement,activitePrincipaleEtablissement,nomenclatureActivitePrincipaleEtablissement,caractereEmployeurEtablissement,longitude,latitude,geo_score,geo_type,geo_adresse,geo_id,geo_ligne,geo_l4,geo_l5
072105265,00028,07210526500028,O,1991-09-01,NN,,,,false,3,,,,RUE,DE LA COTE ST AUBIN,44521,OUDON,,,44115,,,,,,,,,,,,,,,,,,,2003-03-03,F,GERANT ETS TOUBLANC FRANCOIS,,,,74.1J,NAFRev1,N,-1.289072,47.345899,0.87,street,Rue de la Côte Saint-aubin 44521 Oudon,44115_0139,G,RUE DE LA COTE SAINT AUBIN,
200073047,00041,20007304700041,O,2017-01-01,21,2018,,2020-08-25T10:15:16,false,2,,121,,RUE,VIEILLE COUR,44521,OUDON,,,44115,,,,,,,,,,,,,,,,,,,2018-02-04,A,EHPAD OUDON,,,,87.10A,NAFRev2,O,-1.287177,47.347317,0.94,housenumber,121 Rue de Vieille-cour 44521 Oudon,44115_0295_00121,G,121 RUE DE VIEILLE COUR,
214401150,00013,21440115000013,O,1983-03-01,12,2018,,2020-08-25T10:17:21,true,4,,150,,RUE,D ANJOU,44521,OUDON,,,44115,,,,,,,,,,,,,,,,,,,2008-01-01,A,MAIRIE,,,,84.11Z,NAFRev2,O,-1.284495,47.347311,0.94,housenumber,150 Rue d'Anjou 44521 Oudon,44115_0015_00150,G,150 RUE D ANJOU,
214401150,00021,21440115000021,O,1983-03-16,NN,,,2008-01-04T18:34:07,false,3,,,,RUE,DE LA GARE,44521,OUDON,,,44115,,,,,,,,,,,,,,,,,,,2008-01-01,A,CAMPING MUNICIPAL DE LA TOUR,,,,55.30Z,NAFRev2,N,-1.291314,47.344226,0.94,street,Rue de la Gare 44521 Oudon,44115_0180,G,RUE DE LA GARE,
214401150,00039,21440115000039,O,1983-12-21,12,2018,,2020-08-25T10:17:21,false,3,,,,BD,JULES VERNE,44521,OUDON,,,44115,,,,,,,,,,,,,,,,,,,2008-01-01,A,ECOLE PRIMAIRE JULES VERNE,,,,85.20Z,NAFRev2,N,-1.285221,47.348395,0.75,street,Avenue Jules Verne 44521 Oudon,44115_r2wafe,G,AVENUE JULES VERNE,
214401150,00047,21440115000047,O,1989-01-12,NN,,,2014-06-13T23:31:36,false,3,,,,RUE,JULES VERNE,44521,OUDON,,,44115,,,,,,,,,,,,,,,,,,,2008-01-01,A,ECOLE MATERNELLE PUBLIQUE,,,,85.20Z,NAFRev2,N,-1.285221,47.348395,0.82,street,Avenue Jules Verne 44521 Oudon,44115_r2wafe,G,AVENUE JULES VERNE,
214401150,00054,21440115000054,O,1995-12-25,NN,,,2015-07-09T15:28:43,false,3,,150,,RUE,D'ANJOU,44521,OUDON,,,44115,,,,,,,,,,,,,,,,,,,2014-05-22,F,SCE D'ASSAINISSEMENT D'OUDON,,,,37.00Z,NAFRev2,N,-1.284495,47.347311,0.94,housenumber,150 Rue d'Anjou 44521 Oudon,44115_0015_00150,G,150 RUE D ANJOU,
214401150,00062,21440115000062,O,1997-03-25,NN,,,2013-07-20T12:01:30,false,4,MAIRIE,150,,RUE,D ANJOU,44521,OUDON,,,44115,,,,,,,,,,,,,,,,,,,2008-01-01,F,LOTISSEMENT COMMUNAL,,,,42.99Z,NAFRev2,N,-1.284495,47.347311,0.94,housenumber,150 Rue d'Anjou 44521 Oudon,44115_0015_00150,G,150 RUE D ANJOU,
214401150,00070,21440115000070,O,1998-04-08,NN,,,2013-07-20T12:01:30,false,4,MAIRIE,150,,RUE,D'ANJOU,44521,OUDON,,,44115,,,,,,,,,,,,,,,,,,,2008-01-01,F,SCE EXTERIEUR DES POMPES FUNEBRES,,,,96.03Z,NAFRev2,N,-1.284495,47.347311,0.94,housenumber,150 Rue d'Anjou 44521 Oudon,44115_0015_00150,G,150 RUE D ANJOU,
214401150,00088,21440115000088,O,2004-03-26,NN,,,2013-07-05T14:41:40,false,4,MAIRIE,150,,RUE,D'ANJOU,44521,OUDON,,,44115,,,,,,,,,,,,,,,,,,,2008-01-01,F,LOTISSEMENT DE LA PRIMORDIERE,,,,42.99Z,NAFRev2,N,-1.284495,47.347311,0.94,housenumber,150 Rue d'Anjou 44521 Oudon,44115_0015_00150,G,150 RUE D ANJOU,
214401150,00096,21440115000096,O,2004-03-26,NN,,,2008-01-04T18:34:07,false,3,MAIRIE,150,,RUE,D'ANJOU,44521,OUDON,,,44115,,,,,,,,,,,,,,,,,,,2008-01-01,A,IMMOBILIER,,,,42.99Z,NAFRev2,N,-1.284495,47.347311,0.94,housenumber,150 Rue d'Anjou 44521 Oudon,44115_0015_00150,G,150 RUE D ANJOU,
214401150,00120,21440115000120,O,2014-02-28,,,,2015-05-22T15:42:51,false,1,MANEGE A CHEVAUX,470,,RUE,DU CHENE,44521,OUDON,,,44115,,,,,,,,,,,,,,,,,,,2014-02-28,A,PANNEAUX PHOTOVOLTAIQUES,,,,35.11Z,NAFRev2,N,-1.27828,47.347891,0.94,housenumber,470 Rue du Chêne 44521 Oudon,44115_0120_00470,G,470 RUE DU CHENE,
224400028,00557,22440002800557,O,1985-01-25,NN,,,2008-01-04T18:46:25,false,3,MAIRIE,150,,RUE,D'ANJOU,44521,OUDON,,,44115,,,,,,,,,,,,,,,,,,,2008-01-01,A,CTRE DE SECTEUR,,,,88.99B,NAFRev2,N,-1.284495,47.347311,0.94,housenumber,150 Rue d'Anjou 44521 Oudon,44115_0015_00150,G,150 RUE D ANJOU,
254402449,00014,25440244900014,O,1998-10-29,00,2018,,2020-08-25T10:20:26,true,4,MAIRIE,150,,RUE,NATIONALE,44521,OUDON,,,44115,,,,,,,,,,,,,,,,,,,2018-03-31,F,,,,,84.13Z,NAFRev2,O,-1.287652,47.345806,0.44,housenumber,150 Rue Alphonse Fouschard 44521 Oudon,44115_0010_00150,G,150 RUE ALPHONSE FOUSCHARD,
254402449,00022,25440244900022,O,2001-06-01,NN,,,2018-04-17T08:33:41,false,4,MAIRIE,150,,RUE,NATIONALE,44521,OUDON,,,44115,,,,,,,,,,,,,,,,,,,2018-03-31,F,LIAISON FLUVIALE,,,,50.40Z,NAFRev2,N,-1.287652,47.345806,0.44,housenumber,150 Rue Alphonse Fouschard 44521 Oudon,44115_0010_00150,G,150 RUE ALPHONSE FOUSCHARD,
264400011,00013,26440001100013,O,1983-03-01,NN,,,2019-06-24T13:14:06,true,5,,121,,RUE,VIEILLE COUR,44521,OUDON,,,44115,,,,,,,,,,,,,,,,,,,2017-01-01,F,,,,,87.10A,NAFRev2,O,-1.287177,47.347317,0.94,housenumber,121 Rue de Vieille-cour 44521 Oudon,44115_0295_00121,G,121 RUE DE VIEILLE COUR,
264400011,00021,26440001100021,O,2002-12-25,,,,2017-02-09T09:31:47,false,3,,121,,,VIEILLE COUR,44521,OUDON,,,44115,,,,,,,,,,,,,,,,,,,2017-01-01,F,DOTATION NON AFFECTEE,,,,66.19A,NAFRev2,N,-1.287177,47.347317,0.88,housenumber,121 Rue de Vieille-cour 44521 Oudon,44115_0295_00121,G,121 RUE DE VIEILLE COUR,
264402801,00015,26440280100015,O,1993-01-01,NN,,,2010-06-26T03:10:04,true,3,MAIRIE,150,,RUE,D ANJOU,44521,OUDON,,,44115,,,,,,,,,,,,,,,,,,,2008-01-01,A,CCAS,,,,88.99B,NAFRev2,N,-1.284495,47.347311,0.94,housenumber,150 Rue d'Anjou 44521 Oudon,44115_0015_00150,G,150 RUE D ANJOU,
294400072,00012,29440007200012,O,1983-08-10,NN,,,,true,3,MAIRIE,,,RUE,NATIONALE,44521,OUDON,,,44115,,,,,,,,,,,,,,,,,,,2003-12-31,F,,,,,70.1C,NAFRev1,N,1.720463,48.9914133,0.9,poi,Rue Nationale (Pont) Mantes-la-Jolie,https://osm.org/way/44833529,G,,
301112579,00018,30111257900018,O,,,,,,true,1,,,,RUE,A FOUSCHARD,44521,OUDON,,,44115,,,,,,,,,,,,,,,,,,,1984-12-25,F,,,,,63.05,NAP,N,-1.286148,47.346442,0.82,street,Rue Alphonse Fouschard 44521 Oudon,44115_0010,G,RUE ALPHONSE FOUSCHARD,
301489308,00017,30148930800017,O,,NN,,,,true,1,,,,RUE,DE LA LAVANDERIE,44521,OUDON,,,44115,,,,,,,,,,,,,,,,,,,1992-06-30,F,,,,,51.3W,NAF1993,N,-1.288744,47.345293,0.94,street,Rue de la Lavanderie 44521 Oudon,44115_0220,G,RUE DE LA LAVANDERIE,
301840161,00014,30184016100014,O,1975-01-01,NN,,,2008-11-07T00:17:52,true,3,,,,,,44521,OUDON,,,44115,,,,,,,,,,,,,,,,,,,2005-12-31,F,,,,,45.4C,NAFRev1,O,,,0,,,,,,
303383137,00021,30338313700021,O,1993-12-15,NN,,,2021-02-09T13:59:13,true,5,,24,,RUE,D ANJOU,44521,OUDON,,,44115,,,,,,,,,,,,,,,,,,,2021-02-05,A,,,,BROCANTE DE LA TOUR,47.89Z,NAFRev2,N,-1.285691,47.346613,0.94,housenumber,24 Rue d'Anjou 44521 Oudon,44115_0015_00024,G,24 RUE D ANJOU,
306022948,00021,30602294800021,O,,,,,,true,1,,6,,PL,ST MARTIN,44521,OUDON,,,44115,,,,,,,,,,,,,,,,,,,,F,,,,,67.01,NAP,N,-1.286019,47.346851,0.7,housenumber,6 Place Saint-martin 44521 Oudon,44115_0290_00006,G,6 PLACE SAINT MARTIN,
308204338,00013,30820433800013,O,,NN,,,,true,1,,,,RUE,DE BELLEVUE,44521,OUDON,,,44115,,,,,,,,,,,,,,,,,,,,F,,,,,86.10,NAP,N,-1.284193,47.347929,0.94,street,Rue de Bellevue 44521 Oudon,44115_nbdols,G,RUE DE BELLEVUE,
308865708,00025,30886570800025,O,1984-01-27,NN,,,,true,1,,,,LD,PIERRE BLANCHE,44521,OUDON,,,44115,,,,,,,,,,,,,,,,,,,1999-05-07,F,,,,,51.1R,NAF1993,N,-1.319128,47.35572,0.94,street,Pierre Blanche 44521 Oudon,44115_b780,G,PIERRE BLANCHE,
309066553,00046,30906655300046,O,1998-10-01,NN,,,,true,1,,367,R,,DE BEAUVAIS,44521,OUDON,,,44115,,,,,,,,,,,,,,,,,,,2002-10-31,F,,,,,70.1F,NAF1993,N,-1.281043,47.349519,0.93,street,Rue de Beauvais 44521 Oudon,44115_0061,G,RUE DE BEAUVAIS,
309603843,00017,30960384300017,O,,,,,,true,1,,,,,LA GARE,44521,OUDON,,,44115,,,,,,,,,,,,,,,,,,,1985-12-25,F,,,,,67.01,NAP,N,-1.291314,47.344226,0.92,street,Rue de la Gare 44521 Oudon,44115_0180,G,RUE DE LA GARE,
309882504,00017,30988250400017,O,1900-01-01,NN,,,,false,4,,,,RUE,ALPHONSE FOUCHARD,44521,OUDON,,,44115,,,,,,,,,,,,,,,,,,,2002-07-08,F,,,,,85.1G,NAF1993,N,-1.286148,47.346442,0.86,street,Rue Alphonse Fouschard 44521 Oudon,44115_0010,G,RUE ALPHONSE FOUSCHARD,
309882504,00025,30988250400025,O,2002-07-08,NN,,,2006-11-25T09:25:25,false,3,,165,,RUE,DE VIEILLE COUR,44521,OUDON,,,44115,,,,,,,,,,,,,,,,,,,2006-11-20,F,,,,,85.1G,NAFRev1,N,-1.287516,47.347625,0.94,housenumber,165 Rue de Vieille-cour 44521 Oudon,44115_0295_00165,G,165 RUE DE VIEILLE COUR,
309883312,00030,30988331200030,O,2007-06-15,,,,2011-05-10T08:33:34,true,3,,,,LD,MOULIN DE LA DURANDIERE,44521,OUDON,,,44115,,,,,,,,,,,,,,,,,,,2010-12-31,F,,,,,86.22C,NAFRev2,N,-1.253863,47.351758,0.94,street,Le Moulin de la Durandière 44521 Oudon,44115_b561,G,LE MOULIN DE LA DURANDIERE,
309989812,00024,30998981200024,O,2002-10-01,NN,,,2016-08-14T03:43:28,false,4,M.DIVERRES GEORGES,250,,,LA DURANDIERE,44521,OUDON,,,44115,,,,,,,,,,,,,,,,,,,2016-04-08,F,,,,,68.20B,NAFRev2,N,-1.251168,47.350719,0.94,housenumber,250 La Durandiere 44521 Oudon,44115_5gdkg2_00250,G,250 LA DURANDIERE,
311162077,00011,31116207700011,O,1976-01-01,NN,,,,true,1,,,,LD,LE PLESSIS,44521,OUDON,,,44115,,,,,,,,,,,,,,,,,,,1998-03-31,F,,,,,45.2V,NAF1993,O,-1.30026,47.35379,0.94,street,Le Plessis 44521 Oudon,44115_lt6hsu,G,LE PLESSIS,
311270193,00023,31127019300023,O,2006-04-28,,,,2014-04-16T15:50:16,false,3,,314,,RUE,DES BLOTS,44521,OUDON,,,44115,,,,,,,,,,,,,,,,,,,2014-03-01,F,,,,,85.52Z,NAFRev2,N,-1.299643,47.344598,0.94,housenumber,314 Rue des Blôts 44521 Oudon,44115_0065_00314,G,314 RUE DES BLOTS,
311270193,00031,31127019300031,O,2014-03-01,,,,2021-02-23T10:39:04,true,1,,585,,RUE,D ANJOU,44521,OUDON,,,44115,,,,,,,,,,,,,,,,,,,2014-03-01,A,,,,,85.52Z,NAFRev2,N,-1.279763,47.349637,0.94,housenumber,585 Rue d'Anjou 44521 Oudon,44115_0015_00585,G,585 RUE D ANJOU,
311277651,00023,31127765100023,O,1989-12-25,NN,,,2012-07-06T11:20:27,true,5,,60,,IMP,DU PETIT PARIS,44521,OUDON,,,44115,,,,,,,,,,,,,,,,,,,2012-02-27,F,,,,,68.20B,NAFRev2,N,-1.283215,47.347302,0.86,housenumber,60 Impasse du Petit Paris 44521 Oudon,44115_0262_00060,G,60 IMPASSE DU PETIT PARIS,
312049315,00012,31204931500012,O,,NN,,,,true,1,,225,,RUE,DE BRETAGNE,44521,OUDON,,,44115,,,,,,,,,,,,,,,,,,,1987-06-22,F,,,,,65.03,NAP,N,-1.294026,47.345128,0.94,housenumber,225 Rue de Bretagne 44521 Oudon,44115_0069_00225,G,225 RUE DE BRETAGNE,
312098833,00014,31209883300014,O,1900-01-01,NN,,,2008-01-04T20:11:54,true,3,,,,,MAIRIE,44521,OUDON,,,44115,,,,,,,,,,,,,,,,,,,2008-01-01,A,,,,,93.12Z,NAFRev2,N,3.0709671,50.6304695,0.92,poi.townhall,Hôtel de Ville Lille,https://osm.org/way/40917078,G,,
312098833,00022,31209883300022,O,1978-06-13,01,2018,,2020-08-25T10:25:11,false,4,MAIRIE,150,,RUE,D'ANJOU,44521,OUDON,,,44115,,,,,,,,,,,,,,,,,,,2008-01-01,A,TENNIS CLUB OUDONNAIS,,,,93.12Z,NAFRev2,O,-1.284495,47.347311,0.94,housenumber,150 Rue d'Anjou 44521 Oudon,44115_0015_00150,G,150 RUE D ANJOU,
312104128,00011,31210412800011,O,1978-01-01,NN,,,2008-01-04T20:11:57,true,4,,,,RUE,ST VINCENT,44521,OUDON,,,44115,,,,,,,,,,,,,,,,,,,2008-01-01,A,,,,,01.11Z,NAFRev2,N,3.2850781,46.5697696,0.78,poi,Rue Saint-Vincent (Pont) Neuvy,https://osm.org/way/111677128,G,,
312166275,00023,31216627500023,O,1995-11-01,NN,,,,true,1,,225,,RUE,DE BRETAGNE,44521,OUDON,,,44115,,,,,,,,,,,,,,,,,,,2002-08-24,F,,,,,70.2C,NAF1993,N,-1.294026,47.345128,0.94,housenumber,225 Rue de Bretagne 44521 Oudon,44115_0069_00225,G,225 RUE DE BRETAGNE,
312305626,00011,31230562600011,O,1963-01-01,NN,,,2008-11-07T00:27:25,false,4,,57,,RUE,ALPHONSE FOUSCHARD,44521,OUDON,,,44115,,,,,,,,,,,,,,,,,,,2006-08-01,F,,,,,52.4L,NAFRev1,O,-1.28649,47.34614,0.94,housenumber,57 Rue Alphonse Fouschard 44521 Oudon,44115_0010_00057,G,57 RUE ALPHONSE FOUSCHARD,
312305626,00029,31230562600029,O,2006-08-01,,,,2008-11-07T00:27:25,true,2,,,,,ZA DU PLESSIS,44521,OUDON,,,44115,,,,,,,,,,,,,,,,,,,2006-12-31,F,,,,,52.4L,NAFRev1,N,-1.300752,47.355972,0.94,street,ZA du Plessis 44521 Oudon,44115_c244,G,ZA DU PLESSIS,
312487549,00015,31248754900015,O,,,,,,true,1,,,,LD,LA VIEILLIERE,44521,OUDON,,,44115,,,,,,,,,,,,,,,,,,,1984-12-25,F,,,,,55.71,NAP,N,-1.229685,47.361068,0.76,street,La Vieillere 44521 Oudon,44115_ls889z,G,LA VIEILLERE,
312488059,00014,31248805900014,O,,NN,,,,true,1,,,,LD,LA COUR,44521,OUDON,,,44115,,,,,,,,,,,,,,,,,,,1988-08-10,F,,,,,64.25,NAP,N,-1.229539,47.361159,0.94,street,La Cour 44521 Oudon,44115_cjqgd1,G,LA COUR,
312847098,00026,31284709800026,O,1982-01-01,NN,,,,true,1,,739,,RUE,DE BRETAGNE,44521,OUDON,,,44115,,,,,,,,,,,,,,,,,,,2001-11-02,F,,,,,70.2C,NAF1993,N,-1.300149,47.345144,0.94,housenumber,739 Rue de Bretagne 44521 Oudon,44115_0069_00739,G,739 RUE DE BRETAGNE,
313308769,00014,31330876900014,O,1978-01-01,,,,2006-11-25T09:32:02,true,1,,,,,MAIRIE,44521,OUDON,,,44115,,,,,,,,,,,,,,,,,,,2001-12-31,F,,,,,66.0G,NAF1993,N,3.0709671,50.6304695,0.92,poi.townhall,Hôtel de Ville Lille,https://osm.org/way/40917078,G,,
313756728,00017,31375672800017,O,1978-01-01,NN,,,2008-11-07T00:29:02,true,4,,,,,LE CADOREAU,44521,OUDON,,,44115,,,,,,,,,,,,,,,,,,,2005-09-30,F,,,,,45.4J,NAFRev1,O,-1.276468,47.356993,0.94,street,Le Cadoreau 44521 Oudon,44115_3oy8my,G,LE CADOREAU,
314120932,00012,31412093200012,O,,,,,,true,1,,,,,LA MABONNIERE,44521,OUDON,,,44115,,,,,,,,,,,,,,,,,,,1986-03-03,F,,,,,01.2A,NAF1993,N,-1.284048,47.357862,0.94,street,La Mabonniere 44521 Oudon,44115_z2ng2b,G,LA MABONNIERE,
314224643,00036,31422464300036,O,,NN,,,,true,1,,,,,BLANCHE LANDE,44521,OUDON,,,44115,,,,,,,,,,,,,,,,,,,1988-03-15,F,,,,,48.05,NAP,N,-1.260028,47.353103,0.94,street,Blanche Lande 44521 Oudon,44115_b043,G,BLANCHE LANDE,
314274036,00016,31427403600016,O,,NN,,,,true,1,,219,,RUE,DU PONT LEVIS,44521,OUDON,,,44115,,,,,,,,,,,,,,,,,,,1993-12-31,F,,,,,45.2V,NAF1993,N,-1.292201,47.345503,0.94,housenumber,219 Rue du Pont-levis 44521 Oudon,44115_0278_00219,G,219 RUE DU PONT LEVIS,
314458035,00016,31445803500016,O,,NN,,,,true,1,,,,,LA NOELLE,44521,OUDON,,,44115,,,,,,,,,,,,,,,,,,,,F,,,,,00.10,NAP,N,-1.294907,47.345553,0.92,street,Rue de la Noëlle 44521 Oudon,44115_0252,G,RUE DE LA NOELLE,
315303933,00016,31530393300016,O,1979-01-01,NN,,,,true,3,,,,,PIERRE BLANCHE,44521,OUDON,,,44115,,,,,,,,,,,,,,,,,,,2003-12-31,F,,,,,01.1C,NAFRev1,N,-1.319128,47.35572,0.94,street,Pierre Blanche 44521 Oudon,44115_b780,G,PIERRE BLANCHE,
315452565,00023,31545256500023,O,1989-06-13,NN,,,2008-11-07T00:30:55,true,4,,25,,PL,ST MARTIN,44521,OUDON,,,44115,,,,,,,,,,,,,,,,,,,2003-12-31,F,,,,,93.0D,NAFRev1,O,-1.286323,47.346623,0.72,housenumber,25 Place Saint-martin 44521 Oudon,44115_0290_00025,G,25 PLACE SAINT MARTIN,
316367234,00010,31636723400010,O,,NN,,,,true,1,,,,LD,LE PLESSIS,44521,OUDON,,,44115,,,,,,,,,,,,,,,,,,,,F,,,,,00.10,NAP,N,-1.30026,47.35379,0.94,street,Le Plessis 44521 Oudon,44115_lt6hsu,G,LE PLESSIS,
316482728,00011,31648272800011,O,,,,,,true,1,,,,,LA MABONNIERE,44521,OUDON,,,44115,,,,,,,,,,,,,,,,,,,1984-12-25,F,,,,,55.60,NAP,N,-1.284048,47.357862,0.94,street,La Mabonniere 44521 Oudon,44115_z2ng2b,G,LA MABONNIERE,
316630862,00035,31663086200035,O,1982-03-29,NN,,,2009-08-25T08:26:24,true,3,,52,,RUE,BELLEVUE,44521,OUDON,,,44115,,,,,,,,,,,,,,,,,,,2008-01-01,A,,,,,68.20B,NAFRev2,N,-1.284299,47.348036,0.94,housenumber,52 Rue de Bellevue 44521 Oudon,44115_nbdols_00052,G,52 RUE DE BELLEVUE,
316746981,00026,31674698100026,O,1980-08-01,NN,,,2014-07-08T00:20:32,true,4,,,,IMP,DES AUBEPINES,44521,OUDON,,,44115,,,,,,,,,,,,,,,,,,,2010-06-30,F,,,,,43.32A,NAFRev2,N,-1.279638,47.350726,0.83,street,Impasse des Aubepines 44521 Oudon,44115_0018,G,IMPASSE DES AUBEPINES,
317345072,00027,31734507200027,O,1983-04-01,,,,2016-03-02T16:42:30,false,4,,112,,RUE,D'ANJOU,44521,OUDON,,,44115,,,,,,,,,,,,,,,,,,,1992-12-25,F,,,,,80.4A,NAF1993,N,-1.276521,47.351036,0.74,street,Rue d'Anjou 44521 Oudon,44115_0015,G,RUE D ANJOU,
317345072,00050,31734507200050,O,2002-04-08,NN,,,2018-09-29T12:16:29,true,4,,66,,RUE,ALPHONSE FOUSCHARD,44521,OUDON,,,44115,,,,,,,,,,,,,,,,,,,2016-02-04,F,,,,,85.53Z,NAFRev2,O,-1.287292,47.346297,0.94,housenumber,66 Rue Alphonse Fouschard 44521 Oudon,44115_0010_00066,G,66 RUE ALPHONSE FOUSCHARD,
317527174,00013,31752717400013,O,1900-01-01,02,2018,,2020-08-25T10:27:20,true,4,,108,,RUE,DU CHATEAU,44521,OUDON,,,44115,,,,,,,,,,,,,,,,,,,2008-01-01,A,,,,,85.20Z,NAFRev2,O,-1.290534,47.345623,0.94,housenumber,108 Rue du Château 44521 Oudon,44115_0089_00108,G,108 RUE DU CHATEAU,
317527174,00021,31752717400021,O,1986-12-25,11,2018,,2020-08-25T10:27:20,false,3,,108,,RUE,CHATEAU,44521,OUDON,,,44115,,,,,,,,,,,,,,,,,,,2008-01-01,A,ECOLE SAINT JOSEPH DDEC,,,,85.20Z,NAFRev2,O,-1.290534,47.345623,0.88,housenumber,108 Rue du Château 44521 Oudon,44115_0089_00108,G,108 RUE DU CHATEAU,
317569762,00030,31756976200030,O,2012-06-30,,,,2015-03-05T04:25:26,true,2,,28,,LD,LA ROUSSELIERE,44521,OUDON,,,44115,,,,,,,,,,,,,,,,,,,2014-12-31,F,,,,,03.11Z,NAFRev2,N,-1.287966,47.357806,0.94,housenumber,28 La Rousseliere 44521 Oudon,44115_0o668x_00028,G,28 LA ROUSSELIERE,
317595304,00013,31759530400013,O,,,,,,true,1,,,,LD,LE GRAND PATIS,44521,OUDON,,,44115,,,,,,,,,,,,,,,,,,,1984-12-25,F,,,,,55.71,NAP,N,-1.303014,47.35786,0.94,locality,Le Grand Patis 44521 Oudon,44115_b387,G,LE GRAND PATIS,
317649531,00017,31764953100017,O,1980-01-01,NN,,,2014-07-08T00:21:18,true,4,,,,LD,LA RICARDERIE,44521,OUDON,,,44115,,,,,,,,,,,,,,,,,,,2012-09-30,F,,,,,43.32A,NAFRev2,N,-1.320588,47.350799,0.94,street,La Ricarderie 44521 Oudon,44115_gpej4w,G,LA RICARDERIE,
318000395,00075,31800039500075,O,2014-07-01,01,2018,,2021-02-23T10:42:45,true,2,,566,,,LA DURANDIERE,44521,OUDON,,,44115,,,,,,,,,,,,,,,,,,,2015-02-03,A,,,,,71.11Z,NAFRev2,O,-1.247105,47.350812,0.94,housenumber,566 La Durandiere 44521 Oudon,44115_5gdkg2_00566,G,566 LA DURANDIERE,
318077690,00036,31807769000036,O,,NN,,,,true,1,,230,,RUE,ALPHONSE FOUSCHARD,44521,OUDON,,,44115,,,,,,,,,,,,,,,,,,,1996-06-01,F,,,,,55.4B,NAF1993,O,-1.288773,47.345663,0.94,housenumber,230 Rue Alphonse Fouschard 44521 Oudon,44115_0010_00230,G,230 RUE ALPHONSE FOUSCHARD,
318768322,00014,31876832200014,O,,NN,,,,true,1,,,,LD,LA RICARDERIE,44521,OUDON,,,44115,,,,,,,,,,,,,,,,,,,,F,,,,,55.71,NAP,N,-1.320588,47.350799,0.94,street,La Ricarderie 44521 Oudon,44115_gpej4w,G,LA RICARDERIE,
318891272,00045,31889127200045,O,2012-10-30,,,,2020-10-17T03:34:36,true,2,,162,,,COTE SAINT AUBIN,44521,OUDON,,,44115,,,,,,,,,,,,,,,,,,,2020-09-30,F,,,,,01.62Z,NAFRev2,N,-1.290358,47.346387,0.89,housenumber,162 Rue de la Côte Saint-aubin 44521 Oudon,44115_0139_00162,G,162 RUE DE LA COTE SAINT AUBIN,
318901782,00017,31890178200017,O,,NN,,,,true,1,,,,LD,LES ORMEAUX,44521,OUDON,,,44115,,,,,,,,,,,,,,,,,,,1993-02-21,F,,,,,51.12,NAP,N,-1.283283,47.347369,0.78,street,Rue des Ormeaux 44521 Oudon,44115_0255,G,RUE DES ORMEAUX,
319405262,00027,31940526200027,O,1991-07-31,NN,,,2009-04-23T05:13:59,true,3,,,,,FERRY,44521,OUDON,,,44115,,,,,,,,,,,,,,,,,,,2008-01-01,A,,,,,68.20B,NAFRev2,N,-1.305516,47.343955,0.93,street,Le Ferry 44521 Oudon,44115_goebiz,G,LE FERRY,
319456208,00028,31945620800028,O,,NN,,,,true,1,,72,,RUE,DE LA LOIRE,44521,OUDON,,,44115,,,,,,,,,,,,,,,,,,,1990-01-25,F,,,,,55.72,NAP,N,-1.28478,47.346339,0.94,housenumber,72 Rue de la Loire 44521 Oudon,44115_0225_00072,G,72 RUE DE LA LOIRE,
319470761,00028,31947076100028,O,1985-05-01,NN,,,2008-11-07T00:35:21,true,4,,,,,ZA LE PLESSIS,44521,OUDON,,,44115,,,,,,,,,,,,,,,,,,,1995-12-25,F,,,,,45.4C,NAF1993,O,-1.1240577,46.1628024,0.89,poi.industrial,ZA Le Plessis (Zone industrielle) La Rochelle,https://osm.org/way/304780334,G,,
320011778,00018,32001177800018,O,1980-11-19,NN,,,2008-11-07T00:36:01,true,4,LA ROUSSELIERE,150,,RUE,DE LA LOIRE,44521,OUDON,,,44115,,,,,,,,,,,,,,,,,,,2004-09-27,F,,,,,52.1B,NAFRev1,O,-1.283824,47.346236,0.94,housenumber,150 Rue de la Loire 44521 Oudon,44115_0225_00150,G,150 RUE DE LA LOIRE,
320138704,00012,32013870400012,O,,,,,,true,1,,46,,RUE,FOUCHARD,44521,OUDON,,,44115,,,,,,,,,,,,,,,,,,,1990-09-30,F,,,,,64.43,NAP,N,-1.286439,47.346257,0.82,housenumber,46 Rue Alphonse Fouschard 44521 Oudon,44115_0010_00046,G,46 RUE ALPHONSE FOUSCHARD,
320437890,00041,32043789000041,O,1992-04-05,NN,,,2021-02-23T10:44:25,true,5,,424,,RUE,DE BRETAGNE,44521,OUDON,,,44115,,,,,,,,,,,,,,,,,,,2009-05-31,A,D'GRIFF,,,,47.82Z,NAFRev2,O,-1.296437,47.345704,0.94,housenumber,424 Rue de Bretagne 44521 Oudon,44115_0069_00424,G,424 RUE DE BRETAGNE,
321414799,00049,32141479900049,O,2003-01-01,NN,,,2009-04-05T05:02:18,true,4,,,,,LE POULICHON,44521,OUDON,,,44115,,,,,,,,,,,,,,,,,,,2009-04-01,F,,,,,46.18Z,NAFRev2,N,-1.275818,47.348923,0.94,street,Le Poulichon 44521 Oudon,44115_6wog1z,G,LE POULICHON,
321846206,00019,32184620600019,O,,,,,,true,1,,25,,PL,ST MARTIN,44521,OUDON,,,44115,,,,,,,,,,,,,,,,,,,1984-12-25,F,,,,,64.11,NAP,N,-1.286323,47.346623,0.72,housenumber,25 Place Saint-martin 44521 Oudon,44115_0290_00025,G,25 PLACE SAINT MARTIN,
321879744,00019,32187974400019,O,,,,,,true,1,,,,,LE PLANTIS BLANC,44521,OUDON,,,44115,,,,,,,,,,,,,,,,,,,,F,,,,,78.02,NAP,N,-1.302825,47.344064,0.93,street,Le Plantis Blanc de Ferry 44521 Oudon,44115_c235,G,LE PLANTIS BLANC DE FERRY,
322218967,00022,32221896700022,O,,,,,,true,1,,,,,LE TERTRE,44521,OUDON,,,44115,,,,,,,,,,,,,,,,,,,1984-12-25,F,,,,,62.46,NAP,N,-1.29916,47.351655,0.94,street,Le Tertre 44521 Oudon,44115_z1qfx6,G,LE TERTRE,
322557042,00015,32255704200015,O,1981-07-01,,,,2006-10-27T01:19:18,true,3,,,,,OMBLEPIED,44521,OUDON,,,44115,,,,,,,,,,,,,,,,,,,2004-12-31,F,,,,,01.1F,NAFRev1,N,-1.241901,47.363032,0.94,street,Omblepied 44521 Oudon,44115_0jkwl9,G,OMBLEPIED,
322588195,00014,32258819500014,O,1981-07-01,NN,,,,false,3,,104,,RUE,DES ORMEAUX,44521,OUDON,,,44115,,,,,,,,,,,,,,,,,,,1992-12-14,F,,,,,85.1C,NAF1993,N,-1.282707,47.34781,0.94,housenumber,104 Rue des Ormeaux 44521 Oudon,44115_0255_00104,G,104 RUE DES ORMEAUX,
322588195,00022,32258819500022,O,1992-12-14,NN,,,2012-09-14T08:39:26,true,5,,76,,RUE,DES ORMEAUX,44521,OUDON,,,44115,,,,,,,,,,,,,,,,,,,2012-09-30,F,,,,,86.21Z,NAFRev2,N,-1.283389,47.347601,0.94,housenumber,76 Rue des Ormeaux 44521 Oudon,44115_0255_00076,G,76 RUE DES ORMEAUX,
322969833,00019,32296983300019,O,,,,,,true,1,,,,,HAUTE ROCHE,44521,OUDON,,,44115,,,,,,,,,,,,,,,,,,,1988-04-21,F,,,,,01.56,NAP,N,-1.262394,47.351107,0.94,street,Haute Roche 44521 Oudon,44115_b447,G,HAUTE ROCHE,
323245761,00024,32324576100024,O,1982-07-01,00,2018,,2020-08-25T10:30:06,false,6,,,,LD,OMBLEPIED,44521,OUDON,,,44115,,,,,,,,,,,,,,,,,,,2018-12-14,F,,,,,41.20A,NAFRev2,O,-1.241901,47.363032,0.94,street,Omblepied 44521 Oudon,44115_0jkwl9,G,OMBLEPIED,
323259580,00013,32325958000013,O,,,,,,true,1,,285,,RUE,FOUCHARD,44521,OUDON,,,44115,,,,,,,,,,,,,,,,,,,1987-08-01,F,,,,,69.11,NAP,N,-1.289139,47.345229,0.83,housenumber,285 Rue Alphonse Fouschard 44521 Oudon,44115_0010_00285,G,285 RUE ALPHONSE FOUSCHARD,