siren,nic,siret,statutDiffusionEtablissement,dateCreationEtablissement,trancheEffectifsEtablissement,anneeEffectifsEtablissement,activitePrincipaleRegistreMetiersEtablissement,dateDernierTraitementEtablissement,etablissementSiege,nombrePeriodesEtablissement,complementAdresseEtablissement,numeroVoieEtablissement,indiceRepetitionEtablissement,typeVoieEtablissement,libelleVoieEtablissement,codePostalEtablissement,libelleCommuneEtablissement,libelleCommuneEtrangerEtablissement,distributionSpecialeEtablissement,codeCommuneEtablissement,codeCedexEtablissement,libelleCedexEtablissement,codePaysEtrangerEtablissement,libellePaysEtrangerEtablissement,complementAdresse2Etablissement,numeroVoie2Etablissement,indiceRepetition2Etablissement,typeVoie2Etablissement,libelleVoie2Etablissement,codePostal2Etablissement,libelleCommune2Etablissement,libelleCommuneEtranger2Etablissement,distributionSpeciale2Etablissement,codeCommune2Etablissement,codeCedex2Etablissement,libelleCedex2Etablissement,codePaysEtranger2Etablissement,libellePaysEtranger2Etablissement,dateDebut,etatAdministratifEtablissement,enseigne1Etablissement,enseigne2Etablissement,enseigne3Etablissement,denominationUsuelleEtablissement,activitePrincipaleEtablissement,nomenclatureActivitePrincipaleEtablissement,caractereEmployeurEtablissement,longitude,latitude,geo_score,geo_type,geo_adresse,geo_id,geo_ligne,geo_l4,geo_l5
215002700,00015,21500270000015,O,1983-03-01,02,2018,,2020-08-25T10:17:32,true,3,,,,,VILLAGE EGLISE,50700,LIEUSAINT,,,50270,,,,,,,,,,,,,,,,,,,2008-01-01,A,MAIRIE,,,,84.11Z,NAFRev2,N,-1.476302,49.475819,0.87,street,Village de l'Eglise 50700 Lieusaint,50270_b327,G,VILLAGE DE L EGLISE,
215002700,00031,21500270000031,O,1999-01-01,NN,,,2019-01-18T14:05:39,false,4,MAIRIE,,,,VILLAGE EGLISE,50700,LIEUSAINT,,,50270,,,,,,,,,,,,,,,,,,,2018-01-01,F,SERVICE D'ASSAINISSEMENT,,,,84.12Z,NAFRev2,N,-1.476302,49.475819,0.87,street,Village de l'Eglise 50700 Lieusaint,50270_b327,G,VILLAGE DE L EGLISE,
215002700,00049,21500270000049,O,2003-01-01,,,,2008-09-03T08:46:23,false,4,MAIRIE,,,,VILLAGE EGLISE,50700,LIEUSAINT,,,50270,,,,,,,,,,,,,,,,,,,2008-01-01,F,SERVICE ORDURES MENAGERES,,,,38.12Z,NAFRev2,N,-1.476302,49.475819,0.87,street,Village de l'Eglise 50700 Lieusaint,50270_b327,G,VILLAGE DE L EGLISE,
265005884,00019,26500588400019,O,1995-12-25,,,,2017-08-06T14:12:41,true,3,MAIRIE,,,,VILLAGE EGLISE,50700,LIEUSAINT,,,50270,,,,,,,,,,,,,,,,,,,2017-08-01,F,CCAS,,,,88.99B,NAFRev2,N,-1.476302,49.475819,0.87,street,Village de l'Eglise 50700 Lieusaint,50270_b327,G,VILLAGE DE L EGLISE,
303945703,00013,30394570300013,O,1974-01-01,NN,,,2009-06-27T03:40:25,true,6,,,,,VILLAGE DE L'EGLISE,50700,LIEUSAINT,,,50270,,,,,,,,,,,,,,,,,,,2009-05-15,F,,,,,43.31Z,NAFRev2,N,-1.476302,49.475819,0.93,street,Village de l'Eglise 50700 Lieusaint,50270_b327,G,VILLAGE DE L EGLISE,
310997457,00059,31099745700059,O,1991-10-15,11,2018,0812ZZ,2021-02-23T10:38:57,true,4,,,,,LE HAUT PITOIS,50700,LIEUSAINT,,,50270,,,,,,,,,,,,,,,,,,,2008-01-01,A,,,,,08.12Z,NAFRev2,O,-1.478892,49.468996,0.93,street,Le Haut Pitois 50700 Lieusaint,50270_b349,G,LE HAUT PITOIS,
319726386,00018,31972638600018,O,,,,,,true,1,,,,,,50700,LIEUSAINT,,,50270,,,,,,,,,,,,,,,,,,,1984-12-25,F,,,,,21.08,NAP,N,,,0,,,,,,
319920187,00014,31992018700014,O,,NN,,,,true,1,,,,,LE GIBET,50700,LIEUSAINT,,,50270,,,,,,,,,,,,,,,,,,,,F,,,,,21.08,NAP,N,-1.464914,49.493803,0.93,street,Le Gibet 50700 Lieusaint,50270_7rbcjq,G,LE GIBET,
326890225,00013,32689022500013,O,1983-01-27,NN,,,2019-12-17T03:55:57,true,4,,,,LD,LA MADELEINE,50700,LIEUSAINT,,,50270,,,,,,,,,,,,,,,,,,,2019-12-16,F,,,,,68.20B,NAFRev2,N,-1.457188,49.485743,0.93,street,La Madeleine 50700 Lieusaint,50270_1d7e8y,G,LA MADELEINE,
330364134,00016,33036413400016,O,1984-05-01,NN,,,,true,4,,,,,LE BOURG,50700,LIEUSAINT,,,50270,,,,,,,,,,,,,,,,,,,1991-12-31,F,,,,,67.01,NAP,N,2.212915,47.9910304,0.9,poi.bar,Le Bourg (Bar) Ingrannes,https://osm.org/node/1718543174,G,,
338122666,00013,33812266600013,O,,NN,,,,true,1,,,,,VILLAGE DE L EGLISE,50700,LIEUSAINT,,,50270,,,,,,,,,,,,,,,,,,,,F,,,,,62.46,NAP,N,-1.476302,49.475819,0.93,street,Village de l'Eglise 50700 Lieusaint,50270_b327,G,VILLAGE DE L EGLISE,
339826133,00037,33982613300037,O,,NN,,,,true,1,,,,,LES FONTAINES,50700,LIEUSAINT,,,50270,,,,,,,,,,,,,,,,,,,1994-03-04,F,,,,,45.4J,NAF1993,O,-1.469973,49.486312,0.93,street,Les Fontaines 50700 Lieusaint,50270_yvy0cp,G,LES FONTAINES,
340390046,00019,34039004600019,O,,NN,,,,true,1,,,,,VILLAGE DE LA LANDE DE PER,50700,LIEUSAINT,,,50270,,,,,,,,,,,,,,,,,,,1987-03-01,F,,,,,69.12,NAP,N,-1.476302,49.475819,0.53,street,Village de l'Eglise 50700 Lieusaint,50270_b327,G,VILLAGE DE L EGLISE,
341117919,00033,34111791900033,O,2005-05-30,,,,2018-12-20T19:34:48,true,3,,20,,,LES FONTAINES,50700,LIEUSAINT,,,50270,,,,,,,,,,,,,,,,,,,2018-05-01,F,,,,,68.10Z,NAFRev2,N,-1.471522,49.484505,0.93,housenumber,20 Les Fontaines 50700 Lieusaint,50270_yvy0cp_00020,G,20 LES FONTAINES,
342427002,00023,34242700200023,O,1990-09-14,NN,,,,true,3,,,,,VILLAGE PERCY,50700,LIEUSAINT,,,50270,,,,,,,,,,,,,,,,,,,1995-12-25,F,,,,,60.2B,NAF1993,O,5.6495848,44.8009136,0.83,poi.bus_stop,Percy - Village (Arrêt de bus) Percy,https://osm.org/node/1705945531,G,,
353951890,00014,35395189000014,O,1990-03-01,NN,,,2019-09-25T11:32:38,true,5,,,,,LES FONTAINES,50700,LIEUSAINT,,,50270,,,,,,,,,,,,,,,,,,,2019-08-16,F,,,,,68.20B,NAFRev2,N,-1.469973,49.486312,0.93,street,Les Fontaines 50700 Lieusaint,50270_yvy0cp,G,LES FONTAINES,
381472075,00013,38147207500013,O,1991-04-02,NN,,4399CZ,2017-01-29T17:21:24,true,4,,1,,,PLACE DE L EGLISE,50700,LIEUSAINT,,,50270,,,,,,,,,,,,,,,,,,,2015-12-31,F,,,,,43.99C,NAFRev2,N,-1.478876,49.47482,0.81,housenumber,1 Place l'Eglise 50700 Lieusaint,50270_0011_00001,G,1 PLACE L EGLISE,
381732437,00011,38173243700011,O,,NN,,,,true,1,,,,LD,VILLAGE DE L'EGLISE,50700,LIEUSAINT,,,50270,,,,,,,,,,,,,,,,,,,1991-07-29,F,,,,,84.12,NAP,N,-1.476302,49.475819,0.93,street,Village de l'Eglise 50700 Lieusaint,50270_b327,G,VILLAGE DE L EGLISE,
384541496,00012,38454149600012,O,1992-01-01,NN,,,2008-01-04T22:40:17,true,3,,,,,,50700,LIEUSAINT,,,50270,,,,,,,,,,,,,,,,,,,2008-01-01,A,,,,,01.11Z,NAFRev2,N,,,0,,,,,,
387568546,00015,38756854600015,O,1977-01-01,NN,,,2010-11-12T05:38:57,true,5,,,,,LA MADELEINE,50700,LIEUSAINT,,,50270,,,,,,,,,,,,,,,,,,,2008-12-31,F,,,,,01.41Z,NAFRev2,N,-1.457188,49.485743,0.93,street,La Madeleine 50700 Lieusaint,50270_1d7e8y,G,LA MADELEINE,
392145298,00015,39214529800015,O,1970-01-01,NN,,,2012-05-10T15:47:10,true,4,,29,,,RUE DE L EGLISE,50700,LIEUSAINT,,,50270,,,,,,,,,,,,,,,,,,,2008-01-01,A,,,,,68.20B,NAFRev2,N,-1.476047,49.477232,0.82,housenumber,29 Rue de Eglise 50700 Lieusaint,50270_0010_00029,G,29 RUE DE EGLISE,
392451266,00010,39245126600010,O,1993-10-05,NN,,,2008-01-05T00:05:05,true,4,,,,,VIL DE PERCY,50700,LIEUSAINT,,,50270,,,,,,,,,,,,,,,,,,,2008-01-01,A,,,,,68.20B,NAFRev2,N,5.6479501,44.800906,0.82,poi.townhall,(Hôtel de ville) Percy,https://osm.org/node/1705945509,G,,
398324723,00012,39832472300012,O,1989-01-01,NN,,,2007-01-18T09:36:26,true,3,,,,LD,LA FOSSE,50700,LIEUSAINT,,,50270,,,,,,,,,,,,,,,,,,,1998-12-25,F,,,,,01.2A,NAF1993,N,-1.476955,49.490783,0.93,street,La Fosse 50700 Lieusaint,50270_covumc,G,LA FOSSE,
402308423,00019,40230842300019,O,1985-01-01,NN,,,,true,1,,,,,FERME D'AZEVILLE,50700,LIEUSAINT,,,50270,,,,,,,,,,,,,,,,,,,2001-03-31,F,,,,,01.2A,NAF1993,N,-1.479632,49.485095,0.55,street,Azeville 50700 Lieusaint,50270_4wa4wz,G,AZEVILLE,
402386387,00011,40238638700011,O,1975-07-15,NN,,,2012-03-22T04:48:33,true,4,,,,,VILLAGE DE L'EGLISE,50700,LIEUSAINT,,,50270,,,,,,,,,,,,,,,,,,,2011-12-31,F,,,,,01.41Z,NAFRev2,N,-1.476302,49.475819,0.93,street,Village de l'Eglise 50700 Lieusaint,50270_b327,G,VILLAGE DE L EGLISE,
402392245,00013,40239224500013,O,1982-01-01,NN,,,2005-12-21T10:02:58,true,3,,,,,FERME DE THURIN,50700,LIEUSAINT,,,50270,,,,,,,,,,,,,,,,,,,2002-12-31,F,,,,,01.3Z,NAF1993,N,-1.47289,49.479632,0.93,locality,Ferme de Thurin 50700 Lieusaint,50270_b026,G,FERME DE THURIN,
402500599,00012,40250059900012,O,1981-01-01,NN,,,2008-04-03T04:48:20,true,4,,,,,LA PETITE LOURDE,50700,LIEUSAINT,,,50270,,,,,,,,,,,,,,,,,,,2008-01-31,F,,,,,01.41Z,NAFRev2,N,0.7931411,46.3252809,0.8,poi.river,La Petite Blourde (Rivière) Moulismes,https://osm.org/way/41871204,G,,
404793416,00011,40479341600011,O,1978-12-31,NN,,,2008-01-04T20:45:58,true,4,,,,,BEAULIEU,50700,LIEUSAINT,,,50270,,,,,,,,,,,,,,,,,,,2008-01-01,A,,,,,01.41Z,NAFRev2,N,-1.469981,49.486852,0.93,street,Beaulieu 50700 Lieusaint,50270_g63gtq,G,BEAULIEU,
405377607,00016,40537760700016,O,1996-05-02,,,,2014-11-28T10:19:58,false,3,,,,,VILLAGE DE L'EGLISE,50700,LIEUSAINT,,,50270,,,,,,,,,,,,,,,,,,,1998-01-31,F,,,,,74.8F,NAF1993,N,-1.476302,49.475819,0.93,street,Village de l'Eglise 50700 Lieusaint,50270_b327,G,VILLAGE DE L EGLISE,
405377607,00024,40537760700024,O,2014-03-01,,,,2017-09-28T08:35:12,true,2,,6,,RUE,ABBE CANU,50700,LIEUSAINT,,,50270,,,,,,,,,,,,,,,,,,,2017-09-01,F,,,,,47.99A,NAFRev2,N,-1.476678,49.475405,0.93,housenumber,6 Rue Abbe Canu 50700 Lieusaint,50270_0002_00006,G,6 RUE ABBE CANU,
408633279,00018,40863327900018,O,1984-12-31,NN,,,2008-01-04T21:14:18,true,3,,,,,,50700,LIEUSAINT,,,50270,,,,,,,,,,,,,,,,,,,2008-01-01,A,,,,,01.41Z,NAFRev2,N,,,0,,,,,,
410640346,00020,41064034600020,O,2019-03-19,,,,2021-02-23T11:32:51,true,1,,6,,RUE,ABBE CANU,50700,LIEUSAINT,,,50270,,,,,,,,,,,,,,,,,,,2019-03-19,A,,,,,70.22Z,NAFRev2,N,-1.476678,49.475405,0.93,housenumber,6 Rue Abbe Canu 50700 Lieusaint,50270_0002_00006,G,6 RUE ABBE CANU,
412562043,00015,41256204300015,O,1997-04-15,NN,,,2019-02-13T11:39:56,true,3,,9,,RUE,DE PERCY,50700,LIEUSAINT,,,50270,,,,,,,,,,,,,,,,,,,2008-01-01,A,,,,,68.20B,NAFRev2,N,-1.469409,49.484895,0.93,housenumber,9 Rue de Percy 50700 Lieusaint,50270_0030_00009,G,9 RUE DE PERCY,
422907865,00014,42290786500014,O,1999-04-06,NN,,,2020-09-03T15:55:01,false,4,,,,RUE,VILLAGE DE L EGLISE,50700,LIEUSAINT,,,50270,,,,,,,,,,,,,,,,,,,2020-04-27,F,,,,,68.20B,NAFRev2,N,-1.476302,49.475819,0.8,street,Village de l'Eglise 50700 Lieusaint,50270_b327,G,VILLAGE DE L EGLISE,
427878855,00019,42787885500019,O,1968-01-01,NN,,,2010-01-11T13:45:13,true,4,,,,,LES FONTAINES,50700,LIEUSAINT,,,50270,,,,,,,,,,,,,,,,,,,2008-01-01,F,,,,,01.11Z,NAFRev2,N,-1.469973,49.486312,0.93,street,Les Fontaines 50700 Lieusaint,50270_yvy0cp,G,LES FONTAINES,
430968040,00013,43096804000013,O,1987-01-01,NN,,,2018-12-10T08:25:38,true,5,,,,,LA FRAISNEE,50700,LIEUSAINT,,,50270,,,,,,,,,,,,,,,,,,,2018-03-23,F,,,,,01.43Z,NAFRev2,N,-1.478811,49.475391,0.4,street,Impasse de la Fresnaie 50700 Lieusaint,50270_0041,G,IMPASSE DE LA FRESNAIE,
430968180,00017,43096818000017,O,1988-01-01,NN,,,2007-01-18T09:43:35,true,3,,,,,VILLAGE DE PERCY,50700,LIEUSAINT,,,50270,,,,,,,,,,,,,,,,,,,2003-12-31,F,,,,,01.3Z,NAFRev1,N,5.6495848,44.8009136,0.79,poi.bus_stop,Percy - Village (Arrêt de bus) Percy,https://osm.org/node/1705945531,G,,
433268638,00015,43326863800015,O,2000-10-23,01,2018,4520AB,2020-08-25T10:21:29,true,6,,1,,RUE,ABBE CANU,50700,LIEUSAINT,,,50270,,,,,,,,,,,,,,,,,,,2012-12-31,A,,,,,45.11Z,NAFRev2,O,-1.476402,49.47633,0.93,housenumber,1 Rue Abbe Canu 50700 Lieusaint,50270_0002_00001,G,1 RUE ABBE CANU,
435135124,00012,43513512400012,O,2001-04-01,00,2018,3312ZB,2020-08-25T10:23:46,true,3,,,,,VIL DE PERCY,50700,LIEUSAINT,,,50270,,,,,,,,,,,,,,,,,,,2008-01-01,A,,,,,25.62B,NAFRev2,O,5.6479501,44.800906,0.82,poi.townhall,(Hôtel de ville) Percy,https://osm.org/node/1705945509,G,,
438126393,00034,43812639300034,O,2006-12-22,NN,,,2012-05-05T07:59:38,true,3,,2,,,BELLOTTERIE,50700,LIEUSAINT,,,50270,,,,,,,,,,,,,,,,,,,2010-03-18,F,,,,,43.99C,NAFRev2,O,-1.470136,49.493905,0.73,housenumber,2 La Belloterie 50700 Lieusaint,50270_hdg4bs_00002,G,2 LA BELLOTERIE,
443656756,00014,44365675600014,O,2002-11-04,01,2018,4312AZ,2020-08-25T10:31:14,true,3,,,,,FERME DE LA FOSSE,50700,LIEUSAINT,,,50270,,,,,,,,,,,,,,,,,,,2008-01-01,A,,,,,81.30Z,NAFRev2,N,3.9709222,47.8564722,0.89,poi.guest_house,Ferme de la Fosse Dionne (Maison d'hôte) Tonnerre,https://osm.org/way/70592952,G,,
443722962,00026,44372296200026,O,2003-03-31,NN,,,2007-05-19T14:46:22,false,3,,,,,LE HAUT PITOIS,50700,LIEUSAINT,,,50270,,,,,,,,,,,,,,,,,,,2005-02-11,F,,,,,74.1J,NAFRev1,O,-1.478892,49.468996,0.93,street,Le Haut Pitois 50700 Lieusaint,50270_b349,G,LE HAUT PITOIS,
443726583,00026,44372658300026,O,2003-03-31,NN,,,2017-06-27T08:46:13,true,3,LIEUSAINT,,,,LE HAUT PITOIS,50700,LIEUSAINT,,,50270,,,,,,,,,,,,,,,,,,,2008-01-01,A,,,,,64.20Z,NAFRev2,N,-1.478892,49.468996,0.93,street,Le Haut Pitois 50700 Lieusaint,50270_b349,G,LE HAUT PITOIS,
443741061,00016,44374106100016,O,2002-10-01,NN,,,2011-02-01T06:26:31,true,4,,,,,FERME DE THURIN,50700,LIEUSAINT,,,50270,,,,,,,,,,,,,,,,,,,2010-12-31,F,,,,,01.41Z,NAFRev2,N,-1.47289,49.479632,0.93,locality,Ferme de Thurin 50700 Lieusaint,50270_b026,G,FERME DE THURIN,
443816152,00021,44381615200021,O,2003-03-31,NN,,,2017-12-12T04:10:32,true,3,,,,,LE HAUT PITOIS,50700,LIEUSAINT,,,50270,,,,,,,,,,,,,,,,,,,2008-01-01,A,,,,,64.20Z,NAFRev2,N,-1.478892,49.468996,0.93,street,Le Haut Pitois 50700 Lieusaint,50270_b349,G,LE HAUT PITOIS,
481507291,00013,48150729100013,O,2005-02-24,,,,2016-06-23T19:34:14,true,2,,,,,LE HAUT PITOIS,50700,LIEUSAINT,,,50270,,,,,,,,,,,,,,,,,,,2008-01-01,A,,,,,38.11Z,NAFRev2,N,-1.478892,49.468996,0.93,street,Le Haut Pitois 50700 Lieusaint,50270_b349,G,LE HAUT PITOIS,
483071825,00010,48307182500010,O,2005-07-05,NN,,9522ZB,2014-09-07T18:08:10,true,3,,49,,RUE,DE PERCY,50700,LIEUSAINT,,,50270,,,,,,,,,,,,,,,,,,,2008-01-01,A,,,,,95.22Z,NAFRev2,O,-1.462848,49.482263,0.93,housenumber,49 Rue de Percy 50700 Lieusaint,50270_0030_00049,G,49 RUE DE PERCY,
483696944,00014,48369694400014,O,2005-09-20,NN,,4321AB,2017-05-04T05:04:40,true,4,,8,,,LE GIBET,50700,LIEUSAINT,,,50270,,,,,,,,,,,,,,,,,,,2015-05-01,F,,,,,43.21A,NAFRev2,O,-1.465052,49.494258,0.93,housenumber,8 Le Gibet 50700 Lieusaint,50270_7rbcjq_00008,G,8 LE GIBET,
490932894,00010,49093289400010,O,2005-06-30,,,,2008-01-05T03:44:41,true,2,,21,,RUE,DE PERCY,50700,LIEUSAINT,,,50270,,,,,,,,,,,,,,,,,,,2008-01-01,A,,,,,47.75Z,NAFRev2,N,-1.467446,49.484125,0.93,housenumber,21 Rue de Percy 50700 Lieusaint,50270_0030_00021,G,21 RUE DE PERCY,
501653737,00012,50165373700012,O,1980-01-01,,,,2010-03-01T14:43:24,true,3,,,,,FERME DE LA BELLOTTERIE,50700,LIEUSAINT,,,50270,,,,,,,,,,,,,,,,,,,2009-12-31,F,,,,,01.42Z,NAFRev2,N,-1.470827,49.493793,0.56,street,La Belloterie 50700 Lieusaint,50270_hdg4bs,G,LA BELLOTERIE,
503497620,00016,50349762000016,O,2008-02-01,,,,2012-08-26T04:55:23,true,2,,,,,LA PETITE LANDE,50700,LIEUSAINT,,,50270,,,,,,,,,,,,,,,,,,,2012-07-01,A,,,,,68.20B,NAFRev2,N,-1.478737,49.493769,0.93,street,La Petite Lande 50700 Lieusaint,50270_b102,G,LA PETITE LANDE,
503529422,00019,50352942200019,O,2008-05-05,NN,,4332AA,2016-07-03T04:49:57,true,3,VILLAGE DES FONTAINES,10,,CHE,DE LA LANDE DE PERCY,50700,LIEUSAINT,,,50270,,,,,,,,,,,,,,,,,,,2014-06-30,A,ETS TRAVERT LAURENT,,,,43.32A,NAFRev2,N,-1.468052,49.48431,0.53,housenumber,10 Rue de Percy 50700 Lieusaint,50270_0030_00010,G,10 RUE DE PERCY,
507560308,00011,50756030800011,O,2008-08-01,,,,2008-10-02T08:18:27,false,2,,,,,LA MADELEINE,50700,LIEUSAINT,,,50270,,,,,,,,,,,,,,,,,,,2008-10-01,F,,,,,86.90E,NAFRev2,N,-1.457188,49.485743,0.93,street,La Madeleine 50700 Lieusaint,50270_1d7e8y,G,LA MADELEINE,
508894136,00037,50889413600037,O,2013-06-24,,,,2015-12-23T03:51:16,false,2,,14,,,LES FONTAINES,50700,LIEUSAINT,,,50270,,,,,,,,,,,,,,,,,,,2015-11-07,F,,,,,68.20B,NAFRev2,N,-1.470923,49.485165,0.93,housenumber,14 Les Fontaines 50700 Lieusaint,50270_yvy0cp_00014,G,14 LES FONTAINES,
509188736,00011,50918873600011,O,2008-12-01,,,9602AB,2018-10-03T10:22:17,false,2,,50,,RUE,DE PERCY,50700,LIEUSAINT,,,50270,,,,,,,,,,,,,,,,,,,2017-11-13,F,ML COIFF',,,,96.02A,NAFRev2,N,-1.464016,49.481668,0.93,housenumber,50 Rue de Percy 50700 Lieusaint,50270_0030_00050,G,50 RUE DE PERCY,
511646838,00017,51164683800017,O,2009-04-01,,,,2017-09-28T03:49:15,true,2,,6,,RUE,ABBE CARU,50700,LIEUSAINT,,,50270,,,,,,,,,,,,,,,,,,,2017-08-31,F,,,,,70.22Z,NAFRev2,N,-1.476678,49.475405,0.77,housenumber,6 Rue Abbe Canu 50700 Lieusaint,50270_0002_00006,G,6 RUE ABBE CANU,
520353335,00026,52035333500026,O,2015-11-17,01,2018,4332AA,2021-02-23T15:33:41,true,2,,7,,,LES FONTAINES,50700,LIEUSAINT,,,50270,,,,,,,,,,,,,,,,,,,2016-09-01,A,B'CONFORT,,,,43.32A,NAFRev2,O,-1.470251,49.485701,0.93,housenumber,7 Les Fontaines 50700 Lieusaint,50270_yvy0cp_00007,G,7 LES FONTAINES,
528584436,00018,52858443600018,O,2010-11-22,,,,2012-03-02T20:03:59,false,2,,2,,,LA BELLOTERIE,50700,LIEUSAINT,,,50270,,,,,,,,,,,,,,,,,,,2011-12-15,F,,,,,71.11Z,NAFRev2,N,-1.470136,49.493905,0.93,housenumber,2 La Belloterie 50700 Lieusaint,50270_hdg4bs_00002,G,2 LA BELLOTERIE,
530710110,00020,53071011000020,O,2012-07-18,,,4332AA,2021-02-23T15:49:16,true,2,,34,,RUE,DE L'EGLISE,50700,LIEUSAINT,,,50270,,,,,,,,,,,,,,,,,,,2018-03-01,A,,,,,43.32A,NAFRev2,O,-1.476193,49.476836,0.82,housenumber,34 Rue de Eglise 50700 Lieusaint,50270_0010_00034,G,34 RUE DE EGLISE,
535219380,00016,53521938000016,O,2011-01-22,,,,2018-03-07T08:31:40,true,1,,8,,LD,LE GIBET,50700,LIEUSAINT,,,50270,,,,,,,,,,,,,,,,,,,2011-01-22,A,,,,,47.99A,NAFRev2,N,-1.465052,49.494258,0.93,housenumber,8 Le Gibet 50700 Lieusaint,50270_7rbcjq_00008,G,8 LE GIBET,
539554527,00017,53955452700017,O,2006-09-11,,,,2012-01-31T08:16:50,true,1,,15,,RUE,DE PERCY,50700,LIEUSAINT,,,50270,,,,,,,,,,,,,,,,,,,2006-09-11,A,,,,,47.99A,NAFRev2,N,-1.468611,49.484635,0.93,housenumber,15 Rue de Percy 50700 Lieusaint,50270_0030_00015,G,15 RUE DE PERCY,
539554535,00010,53955453500010,O,2009-12-01,,,,2013-02-21T13:57:40,true,1,,8,,RUE,DE PERCY,50700,LIEUSAINT,,,50270,,,,,,,,,,,,,,,,,,,2009-12-01,A,,,,,47.99A,NAFRev2,N,-1.469398,49.484802,0.93,housenumber,8 Rue de Percy 50700 Lieusaint,50270_0030_00008,G,8 RUE DE PERCY,
539963546,00012,53996354600012,O,2012-02-15,,,,2021-02-23T16:02:50,true,1,,6,,,VILLAGE BEAULIEU,50700,LIEUSAINT,,,50270,,,,,,,,,,,,,,,,,,,2012-02-15,A,,,,,38.32Z,NAFRev2,N,5.39254,45.193921,0.89,poi.bus_stop,Beaulieu - Le Village (Arrêt de bus) Beaulieu,https://osm.org/node/2271880606,G,,
602640880,00012,60264088000012,O,,NN,,,,true,1,,,,,,50700,LIEUSAINT,,,50270,,,,,,,,,,,,,,,,,,,,F,,,,,82.06,NAP,N,,,0,,,,,,
642646004,00019,64264600400019,O,,,,,,true,1,,,,,VGE DE L EGLISE,50700,LIEUSAINT,,,50270,,,,,,,,,,,,,,,,,,,1993-09-30,F,,,,,45.2V,NAF1993,N,-1.476302,49.475819,0.82,street,Village de l'Eglise 50700 Lieusaint,50270_b327,G,VILLAGE DE L EGLISE,
642647226,00017,64264722600017,O,,,,,,true,1,,,,,,50700,LIEUSAINT,,,50270,,,,,,,,,,,,,,,,,,,1984-12-25,F,,,,,86.06,NAP,N,,,0,,,,,,
669200784,00132,66920078400132,O,2018-01-01,,,,2018-01-26T12:24:11,false,1,,,,,LE BOURG,50700,LIEUSAINT,,,50270,,,,,,,,,,,,,,,,,,,2018-01-01,A,,,,,46.61Z,NAFRev2,O,2.212915,47.9910304,0.9,poi.bar,Le Bourg (Bar) Ingrannes,https://osm.org/node/1718543174,G,,
692650039,00047,69265003900047,O,1989-04-05,NN,,,2017-01-16T09:09:09,false,5,,,,,FERME THURIN,50700,LIEUSAINT,,,50270,,,,,,,,,,,,,,,,,,,2016-12-31,F,,,,,08.12Z,NAFRev2,N,-1.47289,49.479632,0.93,locality,Ferme de Thurin 50700 Lieusaint,50270_b026,G,FERME DE THURIN,
753248145,00017,75324814500017,O,2012-07-01,,,,2012-08-26T04:55:22,true,1,,2,,,LA PETITE LANDE,50700,LIEUSAINT,,,50270,,,,,,,,,,,,,,,,,,,2012-07-01,A,,,,,01.41Z,NAFRev2,N,-1.481153,49.493208,0.93,housenumber,2 La Petite Lande 50700 Lieusaint,50270_b102_00002,G,2 LA PETITE LANDE,
791101207,00011,79110120700011,O,2013-02-15,,,,2013-04-12T11:51:53,true,1,,2,,,LA BELLOTERIE,50700,LIEUSAINT,,,50270,,,,,,,,,,,,,,,,,,,2013-02-15,F,,,,,62.09Z,NAFRev2,N,-1.470136,49.493905,0.93,housenumber,2 La Belloterie 50700 Lieusaint,50270_hdg4bs_00002,G,2 LA BELLOTERIE,
800474371,00013,80047437100013,O,2009-01-10,,,,2017-02-06T03:51:07,true,2,LIEU DIT TURIN,,,,VILLAGE DE LEGLISE,50700,LIEUSAINT,,,50270,,,,,,,,,,,,,,,,,,,2016-09-09,F,INDIVISION HERVIEU,,,,68.20B,NAFRev2,N,-1.476302,49.475819,0.84,street,Village de l'Eglise 50700 Lieusaint,50270_b327,G,VILLAGE DE L EGLISE,
801449026,00013,80144902600013,O,2014-04-01,,,,2015-02-04T14:07:28,false,2,,,,,LE HAUT PITOIS,50700,LIEUSAINT,,,50270,,,,,,,,,,,,,,,,,,,2014-11-01,F,,,,,96.04Z,NAFRev2,N,-1.478892,49.468996,0.93,street,Le Haut Pitois 50700 Lieusaint,50270_b349,G,LE HAUT PITOIS,
802171546,00012,80217154600012,O,2014-01-01,,,,2014-05-12T08:23:14,true,1,,20,,IMP,DE LA FRESNAIE,50700,LIEUSAINT,,,50270,,,,,,,,,,,,,,,,,,,2014-01-01,A,,,,,01.11Z,NAFRev2,N,-1.479936,49.476381,0.85,housenumber,20 Impasse de la Fresnaie 50700 Lieusaint,50270_0041_00020,G,20 IMPASSE DE LA FRESNAIE,
804698728,00016,80469872800016,O,2014-10-01,01,2018,4399CZ,2021-02-26T03:43:42,false,2,,2,,,LE GIBET,50700,LIEUSAINT,,,50270,,,,,,,,,,,,,,,,,,,2021-02-16,F,,,,,43.99C,NAFRev2,O,-1.464914,49.493803,0.93,housenumber,2 Le Gibet 50700 Lieusaint,50270_7rbcjq_00002,G,2 LE GIBET,
811158005,00017,81115800500017,O,2015-05-01,01,2018,4321AB,2020-08-25T11:19:40,true,2,,,,,6 - 8  LE GIBET,50700,LIEUSAINT,,,50270,,,,,,,,,,,,,,,,,,,2015-07-06,A,,,,,43.21A,NAFRev2,O,-1.464914,49.493803,0.68,street,Le Gibet 50700 Lieusaint,50270_7rbcjq,G,LE GIBET,
820055713,00011,82005571300011,O,2016-05-25,,,,2016-05-03T04:00:00,true,1,,25,,,RUE ABBE CANU,50700,LIEUSAINT,,,50270,,,,,,,,,,,,,,,,,,,2016-05-25,A,,,,,96.09Z,NAFRev2,N,-1.475512,49.47243,0.93,housenumber,25 Rue Abbe Canu 50700 Lieusaint,50270_0002_00025,G,25 RUE ABBE CANU,
820796233,00014,82079623300014,O,2016-08-01,,,,2016-08-02T12:16:43,true,1,,17,,RUE,DE L'EGLISE,50700,LIEUSAINT,,,50270,,,,,,,,,,,,,,,,,,,2016-08-01,A,,,,,01.49Z,NAFRev2,N,-1.477325,49.475653,0.82,housenumber,17 Rue de Eglise 50700 Lieusaint,50270_0010_00017,G,17 RUE DE EGLISE,
823759634,00012,82375963400012,O,2016-11-15,,,,2016-11-17T04:48:38,true,1,,25,,RUE,ABBE CANU,50700,LIEUSAINT,,,50270,,,,,,,,,,,,,,,,,,,2016-11-15,A,,,,,68.20B,NAFRev2,N,-1.475512,49.47243,0.93,housenumber,25 Rue Abbe Canu 50700 Lieusaint,50270_0002_00025,G,25 RUE ABBE CANU,
828745273,00015,82874527300015,O,2017-03-01,,,,2018-01-27T04:17:15,true,2,,,,,LA MADELEINE,50700,LIEUSAINT,,,50270,,,,,,,,,,,,,,,,,,,2017-12-31,F,,,,,01.42Z,NAFRev2,N,-1.457188,49.485743,0.93,street,La Madeleine 50700 Lieusaint,50270_1d7e8y,G,LA MADELEINE,
839068277,00012,83906827700012,O,2018-05-05,,,,2018-04-20T04:29:36,true,1,,,,,LE MOULIN,50700,LIEUSAINT,,,50270,,,,,,,,,,,,,,,,,,,2018-05-05,A,,,,,86.90F,NAFRev2,N,-1.478533,49.467321,0.93,street,Le Moulin 50700 Lieusaint,50270_hwb2au,G,LE MOULIN,
842675670,00017,84267567000017,O,2018-09-26,,,2320ZZ,2020-03-07T03:35:08,false,2,,,,,LE HAUT PITOIS,50700,LIEUSAINT,,,50270,,,,,,,,,,,,,,,,,,,2020-03-02,F,,,,,08.12Z,NAFRev2,N,-1.478892,49.468996,0.93,street,Le Haut Pitois 50700 Lieusaint,50270_b349,G,LE HAUT PITOIS,
844426536,00018,84442653600018,O,2019-01-01,,,,2018-12-10T08:11:38,true,1,,23,,RUE,ABBE CANU,50700,LIEUSAINT,,,50270,,,,,,,,,,,,,,,,,,,2019-01-01,A,,,,,01.43Z,NAFRev2,N,-1.476992,49.473575,0.93,housenumber,23 Rue Abbe Canu 50700 Lieusaint,50270_0002_00023,G,23 RUE ABBE CANU,
847503471,00017,84750347100017,O,2018-05-02,,,,2020-12-23T10:55:59,true,2,,18,,,LES FONTAINES,50700,LIEUSAINT,,,50270,,,,,,,,,,,,,,,,,,,2020-12-31,F,,,,MOREL,68.10Z,NAFRev2,N,-1.471403,49.484585,0.93,housenumber,18 Les Fontaines 50700 Lieusaint,50270_yvy0cp_00018,G,18 LES FONTAINES,
853847432,00012,85384743200012,O,2019-09-01,,,,2020-09-15T19:32:33,true,2,,21,,RUE,DE L'EGLISE,50700,LIEUSAINT,,,50270,,,,,,,,,,,,,,,,,,,2020-03-15,F,,,,,01.61Z,NAFRev2,N,-1.477169,49.475833,0.82,housenumber,21 Rue de Eglise 50700 Lieusaint,50270_0010_00021,G,21 RUE DE EGLISE,
867200578,02035,86720057802035,O,1989-01-01,NN,,,2007-01-17T10:58:40,false,3,,,,,LA LANDE DE PERCY,50700,LIEUSAINT,,,50270,,,,,,,,,,,,,,,,,,,2006-09-30,F,,,,,52.1A,NAFRev1,N,-1.470572,49.484801,0.6,street,Rue de Percy 50700 Lieusaint,50270_0030,G,RUE DE PERCY,