siren,nic,siret,statutDiffusionEtablissement,dateCreationEtablissement,trancheEffectifsEtablissement,anneeEffectifsEtablissement,activitePrincipaleRegistreMetiersEtablissement,dateDernierTraitementEtablissement,etablissementSiege,nombrePeriodesEtablissement,complementAdresseEtablissement,numeroVoieEtablissement,indiceRepetitionEtablissement,typeVoieEtablissement,libelleVoieEtablissement,codePostalEtablissement,libelleCommuneEtablissement,libelleCommuneEtrangerEtablissement,distributionSpecialeEtablissement,codeCommuneEtablissement,codeCedexEtablissement,libelleCedexEtablissement,codePaysEtrangerEtablissement,libellePaysEtrangerEtablissement,complementAdresse2Etablissement,numeroVoie2Etablissement,indiceRepetition2Etablissement,typeVoie2Etablissement,libelleVoie2Etablissement,codePostal2Etablissement,libelleCommune2Etablissement,libelleCommuneEtranger2Etablissement,distributionSpeciale2Etablissement,codeCommune2Etablissement,codeCedex2Etablissement,libelleCedex2Etablissement,codePaysEtranger2Etablissement,libellePaysEtranger2Etablissement,dateDebut,etatAdministratifEtablissement,enseigne1Etablissement,enseigne2Etablissement,enseigne3Etablissement,denominationUsuelleEtablissement,activitePrincipaleEtablissement,nomenclatureActivitePrincipaleEtablissement,caractereEmployeurEtablissement,longitude,latitude,geo_score,geo_type,geo_adresse,geo_id,geo_ligne,geo_l4,geo_l5
215707282,00012,21570728200012,O,1983-03-01,01,2018,,2020-08-25T10:17:57,true,3,,,,,,57580,VOIMHAUT,,,57728,,,,,,,,,,,,,,,,,,,2008-01-01,A,MAIRIE,,,,84.11Z,NAFRev2,N,,,0,,,,,,
265700971,00012,26570097100012,O,1983-03-01,NN,,,2020-01-07T13:48:00,true,4,,,,,,57580,VOIMHAUT,,,57728,,,,,,,,,,,,,,,,,,,2020-01-01,F,CCAS,,,,88.99B,NAFRev2,N,,,0,,,,,,
295700637,00016,29570063700016,O,,NN,,,2006-11-25T09:10:51,true,1,,,,,MAIRIE,57580,VOIMHAUT,,,57728,,,,,,,,,,,,,,,,,,,1988-12-25,F,,,,,90.12,NAP,N,6.416347,49.02099,0.9,street,Rue de la Mairie 57580 Voimhaut,57728_0182,G,RUE DE LA MAIRIE,
314890427,00011,31489042700011,O,1979-01-01,NN,,,2007-05-19T08:54:47,false,3,,,,,,57580,VOIMHAUT,,,57728,,,,,,,,,,,,,,,,,,,2005-04-28,F,,,,,01.1A,NAFRev1,N,,,0,,,,,,
314890427,00029,31489042700029,O,2005-04-28,NN,,,2019-01-12T04:10:18,true,2,,20,,RUE,DES VIGNES,57580,VOIMHAUT,,,57728,,,,,,,,,,,,,,,,,,,2008-01-01,A,,,,,01.41Z,NAFRev2,N,6.418202,49.023059,0.93,housenumber,20 Rue des Vignes 57580 Voimhaut,57728_0270_00020,G,20 RUE DES VIGNES,
318374428,00015,31837442800015,O,,NN,,,,true,1,,78,,RUE,PRINCIPALE,57580,VOIMHAUT,,,57728,,,,,,,,,,,,,,,,,,,1995-12-25,F,,,,,52.6G,NAF1993,N,2.061661,50.820766,0.9,poi,Rue Principale (Pont) Zouafques,https://osm.org/way/111379934,G,,
320182546,00020,32018254600020,O,1992-09-11,,,,2008-11-07T00:36:11,true,4,,,,,DESSOUS LES VIGNES,57580,VOIMHAUT,,,57728,,,,,,,,,,,,,,,,,,,2007-06-14,F,,,,,45.2V,NAFRev1,N,6.2104259,48.3950451,0.9,poi.track,Chemin de Dessous les Vignes Hergugney,https://osm.org/way/188180488,G,,
320349004,00020,32034900400020,O,,NN,,,,true,1,,15,,,,57580,VOIMHAUT,,,57728,,,,,,,,,,,,,,,,,,,,F,,,,,78.02,NAP,N,,,0,,,,,,
321775819,00014,32177581900014,O,1981-04-25,01,2018,,2020-08-25T10:29:20,true,4,VOIMHAUT,,,,,57580,VOIMHAUT,,,57728,,,,,,,,,,,,,,,,,,,2012-12-31,A,,,,,01.61Z,NAFRev2,O,6.414733,49.021047,0.93,municipality,Voimhaut,57728,D,VOIMHAUT,
325069532,00068,32506953200068,O,1997-04-01,NN,,,,false,4,,56,,RUE,PRINCIPALE,57580,VOIMHAUT,,,57728,,,,,,,,,,,,,,,,,,,2003-02-01,F,,,,,31.1C,NAFRev1,O,2.061661,50.820766,0.9,poi,Rue Principale (Pont) Zouafques,https://osm.org/way/111379934,G,,
329949945,00029,32994994500029,O,1991-11-12,NN,,,,true,1,,,,,DESSOUS LES VIGNES,57580,VOIMHAUT,,,57728,,,,,,,,,,,,,,,,,,,1999-08-25,F,,,,,45.2V,NAF1993,O,6.2104259,48.3950451,0.9,poi.track,Chemin de Dessous les Vignes Hergugney,https://osm.org/way/188180488,G,,
350636916,00024,35063691600024,O,,NN,,,,true,1,,48,,RUE,PRINCIPALE,57580,VOIMHAUT,,,57728,,,,,,,,,,,,,,,,,,,1991-11-20,F,,,,,74.1C,NAF1993,N,2.061661,50.820766,0.9,poi,Rue Principale (Pont) Zouafques,https://osm.org/way/111379934,G,,
351017330,00017,35101733000017,O,1988-07-01,NN,,,2006-11-25T11:07:37,true,1,,,,,DESSOUS LES VIGNES,57580,VOIMHAUT,,,57728,,,,,,,,,,,,,,,,,,,1999-05-29,F,,,,,74.1J,NAF1993,N,6.2104259,48.3950451,0.9,poi.track,Chemin de Dessous les Vignes Hergugney,https://osm.org/way/188180488,G,,
378645527,00011,37864552700011,O,1990-07-15,NN,,,2008-11-08T00:34:21,true,4,,,,CHE,DESSOUS LES VIGNES,57580,VOIMHAUT,,,57728,,,,,,,,,,,,,,,,,,,1999-06-30,F,,,,,45.2J,NAF1993,O,6.2104259,48.3950451,0.87,poi.track,Chemin de Dessous les Vignes Hergugney,https://osm.org/way/188180488,G,,
380624403,00016,38062440300016,O,1991-01-15,NN,,,2013-11-24T18:05:19,false,4,,64,,RUE,PRINCIPALE,57580,VOIMHAUT,,,57728,,,,,,,,,,,,,,,,,,,2011-01-20,F,,,,,01.42Z,NAFRev2,N,2.061661,50.820766,0.9,poi,Rue Principale (Pont) Zouafques,https://osm.org/way/111379934,G,,
380624403,00024,38062440300024,O,2011-01-20,01,2018,,2021-02-23T11:09:06,true,1,,3,,PL,DU SAULE,57580,VOIMHAUT,,,57728,,,,,,,,,,,,,,,,,,,2011-01-20,A,,,,,01.42Z,NAFRev2,N,6.41804,49.021616,0.8,housenumber,3 Place du Saule 57580 Voimhaut,57728_0250_00003,G,3 PLACE DU SAULE,
384787347,00010,38478734700010,O,1991-09-01,NN,,,2008-01-04T22:43:48,true,3,,,,,,57580,VOIMHAUT,,,57728,,,,,,,,,,,,,,,,,,,2008-01-01,A,,,,,82.19Z,NAFRev2,N,,,0,,,,,,
385367453,00037,38536745300037,O,1994-04-01,NN,,,2008-01-04T22:53:39,true,3,,,,,DESSOUS LES VIGNES,57580,VOIMHAUT,,BP 8,57728,,,,,,,,,,,,,,,,,,,2008-01-01,A,,,,,43.99C,NAFRev2,N,6.2104259,48.3950451,0.9,poi.track,Chemin de Dessous les Vignes Hergugney,https://osm.org/way/188180488,G,,
389111550,00015,38911155000015,O,1992-11-01,NN,,,2012-06-12T14:00:46,false,4,MR ISLER GABRIEL,,,,DESSOUS LES VIGNES,57580,VOIMHAUT,,,57728,,,,,,,,,,,,,,,,,,,2011-08-31,F,,,,,68.20A,NAFRev2,N,6.2104259,48.3950451,0.9,poi.track,Chemin de Dessous les Vignes Hergugney,https://osm.org/way/188180488,G,,
391887460,00015,39188746000015,O,1991-01-16,NN,,,,true,1,,,,,,57580,VOIMHAUT,,,57728,,,,,,,,,,,,,,,,,,,2001-01-21,F,,,,,70.2B,NAF1993,N,,,0,,,,,,
408933943,00016,40893394300016,O,1980-01-01,NN,,,2011-01-20T08:39:23,true,4,,45,,RUE,PRINCIPALE,57580,VOIMHAUT,,,57728,,,,,,,,,,,,,,,,,,,2010-05-09,F,,,,,01.42Z,NAFRev2,N,2.061661,50.820766,0.9,poi,Rue Principale (Pont) Zouafques,https://osm.org/way/111379934,G,,
410403489,00017,41040348900017,O,1980-01-01,NN,,,2008-01-04T21:42:47,true,3,,59,,RUE,PRINCIPALE,57580,VOIMHAUT,,,57728,,,,,,,,,,,,,,,,,,,2008-01-01,A,,,,,01.24Z,NAFRev2,N,2.061661,50.820766,0.9,poi,Rue Principale (Pont) Zouafques,https://osm.org/way/111379934,G,,
410403497,00010,41040349700010,O,1988-01-01,NN,,,2021-02-23T11:32:34,true,3,,25,,RUE,DES VIGNES,57580,VOIMHAUT,,,57728,,,,,,,,,,,,,,,,,,,2008-01-01,A,,,,,01.61Z,NAFRev2,N,6.417729,49.02273,0.93,housenumber,25 Rue des Vignes 57580 Voimhaut,57728_0270_00025,G,25 RUE DES VIGNES,
410403497,00028,41040349700028,O,2020-01-30,,,,2021-03-03T16:16:29,false,1,,25,,RUE,DES VIGNES,57580,VOIMHAUT,,,57728,,,,,,,,,,,,,,,,,,,2020-01-30,F,,,,,47.99A,NAFRev2,N,6.417729,49.02273,0.93,housenumber,25 Rue des Vignes 57580 Voimhaut,57728_0270_00025,G,25 RUE DES VIGNES,
410403505,00010,41040350500010,O,1991-01-01,NN,,,,true,1,,55,,RUE,PRINCIPALE,57580,VOIMHAUT,,,57728,,,,,,,,,,,,,,,,,,,2002-03-16,F,,,,,01.1F,NAF1993,N,2.061661,50.820766,0.9,poi,Rue Principale (Pont) Zouafques,https://osm.org/way/111379934,G,,
413080367,00019,41308036700019,O,1997-04-15,NN,,,2021-02-23T11:35:23,true,3,,1,,IMP,DE L ECHALOTTE,57580,VOIMHAUT,,,57728,,,,,,,,,,,,,,,,,,,2008-01-01,A,,,,,01.41Z,NAFRev2,N,6.41848,49.022412,0.84,housenumber,1 Impasse de l'Echalotte 57580 Voimhaut,57728_0070_00001,G,1 IMPASSE DE L ECHALOTTE,
413558594,00011,41355859400011,O,1997-04-01,NN,,,,true,4,,56,,RUE,PRINCIPALE,57580,VOIMHAUT,,,57728,,,,,,,,,,,,,,,,,,,2003-03-31,F,,,,,70.2C,NAFRev1,N,2.061661,50.820766,0.9,poi,Rue Principale (Pont) Zouafques,https://osm.org/way/111379934,G,,
420190985,00010,42019098500010,O,1997-05-01,NN,,,2008-01-04T23:48:09,true,3,,55,,RUE,PRINCIPALE,57580,VOIMHAUT,,,57728,,,,,,,,,,,,,,,,,,,2008-01-01,A,,,,,68.20B,NAFRev2,N,2.061661,50.820766,0.9,poi,Rue Principale (Pont) Zouafques,https://osm.org/way/111379934,G,,
429453459,00019,42945345900019,O,2000-01-01,NN,,,2017-03-17T13:45:45,false,4,,4,,IMP,DU CHENOU,57580,VOIMHAUT,,,57728,,,,,,,,,,,,,,,,,,,2017-01-01,F,,,,,01.11Z,NAFRev2,N,6.418202,49.021076,0.7,housenumber,4 Impasse au Chenou 57580 Voimhaut,57728_0030_00004,G,4 IMPASSE AU CHENOU,
429453459,00027,42945345900027,O,2017-01-01,,,,2021-02-23T11:49:06,true,1,,9,,RTE,DES PRES,57580,VOIMHAUT,,,57728,,,,,,,,,,,,,,,,,,,2017-01-01,A,,,,,01.11Z,NAFRev2,N,6.417248,49.01936,0.8,housenumber,9 Route des Pres 57580 Voimhaut,57728_0200_00009,G,9 ROUTE DES PRES,
430626143,00019,43062614300019,O,1994-01-01,NN,,,2016-01-12T00:22:21,true,3,,68,,RUE,PRINCIPALE,57580,VOIMHAUT,,,57728,,,,,,,,,,,,,,,,,,,2008-01-01,A,,,,,01.50Z,NAFRev2,N,2.061661,50.820766,0.9,poi,Rue Principale (Pont) Zouafques,https://osm.org/way/111379934,G,,
432703437,00017,43270343700017,O,2000-09-01,NN,,,,true,1,,49,,RUE,PRINCIPALE,57580,VOIMHAUT,,,57728,,,,,,,,,,,,,,,,,,,2002-06-30,F,,,,,36.1K,NAF1993,N,2.061661,50.820766,0.9,poi,Rue Principale (Pont) Zouafques,https://osm.org/way/111379934,G,,
480428242,00022,48042824200022,O,2008-01-02,,,,2013-07-01T10:15:03,false,2,,13,,IMP,DU FOND DE VAU,57580,VOIMHAUT,,,57728,,,,,,,,,,,,,,,,,,,2009-06-30,F,,,,,66.19B,NAFRev2,N,6.415247,49.020449,0.85,housenumber,13 Impasse du Fond de Vau 57580 Voimhaut,57728_0120_00013,G,13 IMPASSE DU FOND DE VAU,
482865417,00018,48286541700018,O,2005-06-01,NN,,4321AB,2017-12-05T14:38:50,true,4,,4,,IMP,DU FOND DE VAU,57580,VOIMHAUT,,,57728,,,,,,,,,,,,,,,,,,,2008-01-01,A,,,,,43.21A,NAFRev2,N,6.416036,49.019801,0.84,housenumber,4 Impasse du Fond de Vau 57580 Voimhaut,57728_0120_00004,G,4 IMPASSE DU FOND DE VAU,
489536334,00019,48953633400019,O,2006-03-29,NN,,,2012-05-05T11:20:00,false,4,,6,,RUE,PRINCIPALE,57580,VOIMHAUT,,,57728,,,,,,,,,,,,,,,,,,,2010-03-12,F,,,,,64.20Z,NAFRev2,O,2.061661,50.820766,0.9,poi,Rue Principale (Pont) Zouafques,https://osm.org/way/111379934,G,,
502597867,00014,50259786700014,O,2007-11-26,,,,2015-11-27T08:23:11,true,1,,8,,IMP,DU FONDS DE VAU,57580,VOIMHAUT,,,57728,,,,,,,,,,,,,,,,,,,2007-11-26,A,,,,,68.20B,NAFRev2,N,6.416088,49.019958,0.73,housenumber,8 Impasse du Fond de Vau 57580 Voimhaut,57728_0120_00008,G,8 IMPASSE DU FOND DE VAU,
511026742,00029,51102674200029,O,2010-03-01,,,,2012-11-10T00:36:37,true,2,,68,,RUE,PRINCIPALE,57580,VOIMHAUT,,,57728,,,,,,,,,,,,,,,,,,,2010-03-22,F,,,,,74.90B,NAFRev2,N,2.061661,50.820766,0.9,poi,Rue Principale (Pont) Zouafques,https://osm.org/way/111379934,G,,
512422734,00016,51242273400016,O,2009-05-01,,,,2017-05-04T11:07:53,false,2,,60,,RUE,PRINCIPALE,57580,VOIMHAUT,,,57728,,,,,,,,,,,,,,,,,,,2012-01-24,F,,,,,82.19Z,NAFRev2,N,2.061661,50.820766,0.9,poi,Rue Principale (Pont) Zouafques,https://osm.org/way/111379934,G,,
512422734,00024,51242273400024,O,2017-04-04,,,8219ZP,2019-01-31T19:32:27,true,2,,4,,RUE,DES VIGNES,57580,VOIMHAUT,,,57728,,,,,,,,,,,,,,,,,,,2018-12-30,F,,,,LAPAGE,82.19Z,NAFRev2,N,6.417567,49.021709,0.93,housenumber,4 Rue des Vignes 57580 Voimhaut,57728_0270_00004,G,4 RUE DES VIGNES,
522705458,00019,52270545800019,O,1970-01-01,,,,2010-05-27T08:21:46,true,1,,,,,VOIMHAUT,57580,VOIMHAUT,,,57728,,,,,,,,,,,,,,,,,,,1970-01-01,A,,,,,01.49Z,NAFRev2,N,6.414733,49.021047,0.93,municipality,Voimhaut,57728,G,VOIMHAUT,
524522174,00019,52452217400019,O,2010-08-04,NN,,,2015-05-14T08:34:39,true,4,,46,B,RUE,PRINCIPALE,57580,VOIMHAUT,,,57728,,,,,,,,,,,,,,,,,,,2014-09-26,F,,,,,47.91B,NAFRev2,N,2.061661,50.820766,0.9,poi,Rue Principale (Pont) Zouafques,https://osm.org/way/111379934,G,,
524559770,00010,52455977000010,O,2010-09-01,,,,2014-11-23T03:34:33,true,2,LES VIGNES DU SAC,,,,,57580,VOIMHAUT,,,57728,,,,,,,,,,,,,,,,,,,2014-12-31,F,LES VERGERS DE LA COTE,,,,01.24Z,NAFRev2,N,6.417483,49.021878,0.45,street,Rue des Vignes 57580 Voimhaut,57728_0270,D,RUE DES VIGNES,
528029796,00018,52802979600018,O,2010-11-01,,,,2012-11-10T02:39:02,true,3,,5,,RUE,DES VIGNES,57580,VOIMHAUT,,,57728,,,,,,,,,,,,,,,,,,,2012-01-01,F,THIEBAUT SERVICES A LA PERSONNE,,,,96.09Z,NAFRev2,N,6.416571,49.022079,0.93,housenumber,5 Rue des Vignes 57580 Voimhaut,57728_0270_00005,G,5 RUE DES VIGNES,
528164437,00014,52816443700014,O,2010-11-08,,,4333ZZ,2015-03-18T01:31:02,false,2,,12,,IMP,DU FOND DE VEAU,57580,VOIMHAUT,,,57728,,,,,,,,,,,,,,,,,,,2013-03-10,F,,,,,43.33Z,NAFRev2,N,6.415322,49.020337,0.74,housenumber,12 Impasse du Fond de Vau 57580 Voimhaut,57728_0120_00012,G,12 IMPASSE DU FOND DE VAU,
529662256,00013,52966225600013,O,2010-05-10,,,,2021-02-23T15:47:24,true,1,,20,,RUE,DU CHAMP L'EVEQUE,57580,VOIMHAUT,,,57728,,,,,,,,,,,,,,,,,,,2010-05-10,A,,,,,01.19Z,NAFRev2,N,6.414447,49.02144,0.93,housenumber,20 Rue du Champ l'Eveque 57580 Voimhaut,57728_0024_00020,G,20 RUE DU CHAMP L EVEQUE,
532209038,00019,53220903800019,O,2011-05-02,,,,2015-07-23T08:24:04,true,2,,26,,RUE,PRINCIPALE,57580,VOIMHAUT,,,57728,,,,,,,,,,,,,,,,,,,2014-03-31,F,,,,,69.20Z,NAFRev2,N,2.061661,50.820766,0.9,poi,Rue Principale (Pont) Zouafques,https://osm.org/way/111379934,G,,
533675518,00039,53367551800039,O,2012-07-14,,,,2021-02-23T15:54:40,true,1,,1,,RUE,DE LA MAIRIE,57580,VOIMHAUT,,,57728,,,,,,,,,,,,,,,,,,,2012-07-14,A,,,,,38.32Z,NAFRev2,N,6.416347,49.02099,0.93,housenumber,1 Rue de la Mairie 57580 Voimhaut,57728_0182_00001,G,1 RUE DE LA MAIRIE,
533986873,00016,53398687300016,O,2011-08-08,,,4332BB,2014-06-27T01:19:39,true,1,REMILLY,6,B,IMP,DU FOND DE VAU,57580,VOIMHAUT,,,57728,,,,,,,,,,,,,,,,,,,2011-08-08,A,,,,,43.32B,NAFRev2,N,6.416175,49.019889,0.77,housenumber,6 b Impasse du Fond de Vau 57580 Voimhaut,57728_0120_00006_b,G,6 B IMPASSE DU FOND DE VAU,
537466013,00019,53746601300019,O,2011-10-03,NN,,,2014-07-10T02:12:15,false,2,,11,,RUE,DES VIGNES,57580,VOIMHAUT,,,57728,,,,,,,,,,,,,,,,,,,2013-10-01,F,,,,,43.22B,NAFRev2,O,6.416914,49.022249,0.93,housenumber,11 Rue des Vignes 57580 Voimhaut,57728_0270_00011,G,11 RUE DES VIGNES,
752926667,00011,75292666700011,O,1990-04-19,,,,2012-07-24T10:07:42,true,1,,32,,RUE,DU CHAMP L EVEQUE,57580,VOIMHAUT,,,57728,,,,,,,,,,,,,,,,,,,1990-04-19,A,,,,,94.99Z,NAFRev2,N,6.415019,49.018132,0.93,housenumber,32 Rue du Champ l'Eveque 57580 Voimhaut,57728_0024_00032,G,32 RUE DU CHAMP L EVEQUE,
780047643,00017,78004764300017,O,,,,,,true,1,,,,,,57580,VOIMHAUT,,,57728,,,,,,,,,,,,,,,,,,,1984-12-25,F,,,,,67.04,NAP,N,,,0,,,,,,
780047676,00017,78004767600017,O,1900-01-01,NN,,,2006-11-25T22:11:56,true,4,,,,,,57580,VOIMHAUT,,,57728,,,,,,,,,,,,,,,,,,,1992-07-20,F,,,,,92.3B,NAF1993,N,,,0,,,,,,
792858110,00010,79285811000010,O,2013-04-29,,,,2015-12-28T08:46:47,false,4,1 PLACE DU BON PUITS,1,,PL,DU BON PUIT,57580,VOIMHAUT,,,57728,,,,,,,,,,,,,,,,,,,2014-09-27,F,,,,,56.21Z,NAFRev2,N,6.417393,49.020834,0.77,housenumber,1 Place du Bon Puits 57580 Voimhaut,57728_0023_00001,G,1 PLACE DU BON PUITS,
793400128,00013,79340012800013,O,2013-05-18,,,,2020-08-18T13:43:47,false,2,,12,,RUE,DES VIGNES,57580,VOIMHAUT,,,57728,,,,,,,,,,,,,,,,,,,2020-08-14,F,,,,,86.90F,NAFRev2,N,6.418391,49.022118,0.93,housenumber,12 Rue des Vignes 57580 Voimhaut,57728_0270_00012,G,12 RUE DES VIGNES,
799347307,00016,79934730700016,O,2014-01-01,,,,2013-12-26T10:51:11,true,1,,1,,IMP,AU CHENOU,57580,VOIMHAUT,,,57728,,,,,,,,,,,,,,,,,,,2014-01-01,A,,,,,85.59B,NAFRev2,N,6.417647,49.020757,0.82,housenumber,1 Impasse au Chenou 57580 Voimhaut,57728_0030_00001,G,1 IMPASSE AU CHENOU,
799347422,00013,79934742200013,O,2014-01-01,,,,2013-12-26T10:53:28,true,1,,1,,IMP,AU CHENOU,57580,VOIMHAUT,,,57728,,,,,,,,,,,,,,,,,,,2014-01-01,A,,,,,85.59A,NAFRev2,N,6.417647,49.020757,0.82,housenumber,1 Impasse au Chenou 57580 Voimhaut,57728_0030_00001,G,1 IMPASSE AU CHENOU,
799491840,00010,79949184000010,O,2014-01-02,,,,2014-07-29T11:35:57,true,2,,1,,,PLACE DU BON PUITS,57580,VOIMHAUT,,,57728,,,,,,,,,,,,,,,,,,,2014-07-16,F,,,,,56.21Z,NAFRev2,N,6.417393,49.020834,0.93,housenumber,1 Place du Bon Puits 57580 Voimhaut,57728_0023_00001,G,1 PLACE DU BON PUITS,
815128780,00013,81512878000013,O,2015-12-15,,,,2018-04-06T18:04:22,true,1,,4,,RUE,DES VIGNES,57580,VOIMHAUT,,,57728,,,,,,,,,,,,,,,,,,,2015-12-15,A,,,,,64.20Z,NAFRev2,N,6.417567,49.021709,0.93,housenumber,4 Rue des Vignes 57580 Voimhaut,57728_0270_00004,G,4 RUE DES VIGNES,
843919739,00014,84391973900014,O,2018-10-15,,,,2018-11-19T08:45:33,true,1,,13,,IMP,DU FOND E VAU,57580,VOIMHAUT,,,57728,,,,,,,,,,,,,,,,,,,2018-10-15,A,,,,LUMONOGA,66.30Z,NAFRev2,N,6.415247,49.020449,0.76,housenumber,13 Impasse du Fond de Vau 57580 Voimhaut,57728_0120_00013,G,13 IMPASSE DU FOND DE VAU,
897464327,00013,89746432700013,O,2021-03-22,,,9602BA,2021-03-23T19:32:19,true,1,,10,,PL,DU BON PUITS,57580,VOIMHAUT,,,57728,,,,,,,,,,,,,,,,,,,2021-03-22,A,,,,CHARLOTT'ESTHETIQUE,96.02B,NAFRev2,N,6.417569,49.020511,0.84,housenumber,10 Place du Bon Puits 57580 Voimhaut,57728_0023_00010,G,10 PLACE DU BON PUITS,
