siren,nic,siret,statutDiffusionEtablissement,dateCreationEtablissement,trancheEffectifsEtablissement,anneeEffectifsEtablissement,activitePrincipaleRegistreMetiersEtablissement,dateDernierTraitementEtablissement,etablissementSiege,nombrePeriodesEtablissement,complementAdresseEtablissement,numeroVoieEtablissement,indiceRepetitionEtablissement,typeVoieEtablissement,libelleVoieEtablissement,codePostalEtablissement,libelleCommuneEtablissement,libelleCommuneEtrangerEtablissement,distributionSpecialeEtablissement,codeCommuneEtablissement,codeCedexEtablissement,libelleCedexEtablissement,codePaysEtrangerEtablissement,libellePaysEtrangerEtablissement,complementAdresse2Etablissement,numeroVoie2Etablissement,indiceRepetition2Etablissement,typeVoie2Etablissement,libelleVoie2Etablissement,codePostal2Etablissement,libelleCommune2Etablissement,libelleCommuneEtranger2Etablissement,distributionSpeciale2Etablissement,codeCommune2Etablissement,codeCedex2Etablissement,libelleCedex2Etablissement,codePaysEtranger2Etablissement,libellePaysEtranger2Etablissement,dateDebut,etatAdministratifEtablissement,enseigne1Etablissement,enseigne2Etablissement,enseigne3Etablissement,denominationUsuelleEtablissement,activitePrincipaleEtablissement,nomenclatureActivitePrincipaleEtablissement,caractereEmployeurEtablissement,longitude,latitude,geo_score,geo_type,geo_adresse,geo_id,geo_ligne,geo_l4,geo_l5
217402551,00014,21740255100014,O,1983-03-01,12,2018,,2020-08-25T10:18:55,true,4,,,,,,74150,SALES,,,74255,,,,,,,,,,,,,,,,,,,2008-01-01,A,MAIRIE,,,,84.11Z,NAFRev2,O,,,0,,,,,,
217402551,00022,21740255100022,O,1983-12-21,11,2018,,2020-08-25T10:18:55,false,3,,,,,CHEF LIEU,74150,SALES,,,74255,,,,,,,,,,,,,,,,,,,2008-01-01,A,ECOLE PRIMAIRE PUBLIQUE,,,,85.20Z,NAFRev2,N,5.959889,45.874531,0.92,street,Rte du Chef Lieu 74150 Sales,74255_0100,G,RTE DU CHEF LIEU,
217402551,00030,21740255100030,O,1983-12-21,03,2018,,2020-08-25T10:18:55,false,3,,,,,,74150,SALES,,,74255,,,,,,,,,,,,,,,,,,,2008-01-01,A,ECOLE MATERNELLE PUBLIQUE,,,,85.10Z,NAFRev2,N,,,0,,,,,,
217402551,00048,21740255100048,O,1995-01-01,NN,,,2012-11-06T15:38:02,false,4,MAIRIE,,,,,74150,SALES,,,74255,,,,,,,,,,,,,,,,,,,2011-01-01,F,SCE ASSAINISSEMENT,,,,37.00Z,NAFRev2,N,,,0,,,,,,
217402551,00055,21740255100055,O,1997-06-01,NN,,,2012-11-06T15:44:18,false,4,MAIRIE,,,,,74150,SALES,,,74255,,,,,,,,,,,,,,,,,,,2010-12-15,F,ZONE ARTISANALE DE SALES,,,,42.99Z,NAFRev2,N,,,0,,,,,,
217402551,00063,21740255100063,O,1994-12-25,NN,,,2013-10-05T12:22:03,false,3,MAIRIE,,,,,74150,SALES,,,74255,,,,,,,,,,,,,,,,,,,2012-12-25,F,SERVICES DES EAUX DE SALES,,,,36.00Z,NAFRev2,N,,,0,,,,,,
217402551,00071,21740255100071,O,1998-01-01,NN,,,,false,2,MAIRIE,,,,,74150,SALES,,,74255,,,,,,,,,,,,,,,,,,,1998-12-25,F,SERVICE PARKING,,,,63.2A,NAF1993,N,,,0,,,,,,
217402551,00097,21740255100097,O,2015-02-13,,,,2016-01-20T10:20:04,false,1,,8,,CHE,DES ECOLIERS,74150,SALES,,,74255,,,,,,,,,,,,,,,,,,,2015-02-13,A,MULTI ACCUEIL TOUCHATOUT,,,,88.91A,NAFRev2,N,5.956827,45.873209,0.86,street,Che des Ecoliers 74150 Sales,74255_0240,G,CHE DES ECOLIERS,
217402551,00105,21740255100105,O,2015-12-16,,,,2021-02-23T10:33:20,false,1,,8,,CHE,DES ECOLIERS,74150,SALES,,,74255,,,,,,,,,,,,,,,,,,,2015-12-16,A,JARDIN D'ENFANTS LES PTIOUTS,,,,88.91A,NAFRev2,N,5.956827,45.873209,0.86,street,Che des Ecoliers 74150 Sales,74255_0240,G,CHE DES ECOLIERS,
267400414,00012,26740041400012,O,1993-01-01,NN,,,2006-10-26T23:45:46,true,3,,,,,MAIRIE,74150,SALES,,,74255,,,,,,,,,,,,,,,,,,,2005-02-16,F,CDE,,,,85.3K,NAFRev1,N,3.0709671,50.6304695,0.92,poi.townhall,Hôtel de Ville Lille,https://osm.org/way/40917078,G,,
267400513,00011,26740051300011,O,1993-01-01,NN,,,2010-06-26T03:15:34,true,3,,,,,MAIRIE,74150,SALES,,,74255,,,,,,,,,,,,,,,,,,,2008-01-01,A,CCAS,,,,88.99B,NAFRev2,N,3.0709671,50.6304695,0.92,poi.townhall,Hôtel de Ville Lille,https://osm.org/way/40917078,G,,
277401303,00015,27740130300015,O,,NN,,,,true,1,,,,,MAIRIE,74150,SALES,,,74255,,,,,,,,,,,,,,,,,,,1995-12-25,F,,,,,41.0Z,NAF1993,N,3.0709671,50.6304695,0.92,poi.townhall,Hôtel de Ville Lille,https://osm.org/way/40917078,G,,
301651493,00035,30165149300035,O,1900-01-01,NN,,,2017-11-17T15:36:46,true,4,,27,,LD,GERMONEX,74150,SALES,,,74255,,,,,,,,,,,,,,,,,,,2017-12-01,F,,,,,74.90A,NAFRev2,N,5.964002,45.886569,0.85,housenumber,27 Rte de Germonex 74150 Sales,74255_0330_00027,G,27 RTE DE GERMONEX,
302582747,00028,30258274700028,O,,,,,,true,1,,,,LD,TIGNY,74150,SALES,,,74255,,,,,,,,,,,,,,,,,,,1985-12-25,F,,,,,01.10,NAP,N,5.960491,45.874538,0.92,street,Rte de Tigny 74150 Sales,74255_0670,G,RTE DE TIGNY,
302963442,00017,30296344200017,O,1900-01-01,NN,,,2008-01-04T19:22:49,true,3,,,,,,74150,SALES,,,74255,,,,,,,,,,,,,,,,,,,2008-01-01,A,,,,,56.29B,NAFRev2,N,,,0,,,,,,
303263628,00024,30326362800024,O,1991-01-01,NN,,,2016-01-11T12:54:42,true,7,,305,,RTE,DES CREUSES,74150,SALES,,,74255,,,,,,,,,,,,,,,,,,,2015-09-02,F,MACONNERIE MAILLET JACQUES,,,,43.99C,NAFRev2,N,5.959619,45.867793,0.94,housenumber,305 Rte des Creuses 74150 Sales,74255_0200_00305,G,305 RTE DES CREUSES,
303333348,00017,30333334800017,O,,NN,,,,true,1,,,,,LE CRUET,74150,SALES,,,74255,,,,,,,,,,,,,,,,,,,,F,,,,,64.24,NAP,N,5.965703,45.858638,0.71,street,Rte de Cruet Sud 74150 Sales,74255_0230,G,RTE DE CRUET SUD,
306539982,00026,30653998200026,O,2015-12-01,,,,2017-09-29T11:33:28,true,2,DOMAINE DE CLARAFOND,22,,CHE,DU PLATANE,74150,SALES,,,74255,,,,,,,,,,,,,,,,,,,2016-07-31,F,,,,OPTANIMATION JM CARPENTIER,47.81Z,NAFRev2,N,5.972148,45.8774,0.94,housenumber,22 Che du Platane 74150 Sales,74255_0570_00022,G,22 CHE DU PLATANE,
308415207,00031,30841520700031,O,,NN,,,,true,1,,,,,BEAUSOLEIL,74150,SALES,,,74255,,,,,,,,,,,,,,,,,,,1997-06-24,F,,,,,50.2Z,NAF1993,N,5.947193,45.877597,0.92,street,All de Beausoleil 74150 Sales,74255_0040,G,ALL DE BEAUSOLEIL,
308477322,00017,30847732200017,O,,,,,,true,1,,,,LD,PAVONGES,74150,SALES,,,74255,,,,,,,,,,,,,,,,,,,1984-12-25,F,,,,,21.08,NAP,N,,,0,,,,,,
308599166,00110,30859916600110,O,2012-05-01,,,,2019-07-05T08:41:02,true,2,LOTISSEMENT CHEZ GAUDIN - BP 30,,,RTE,DU PONT COPPET,74150,SALES,,,74255,,,,,,,,,,,,,,,,,,,2018-08-30,F,B - JC TAXI,,,,49.32Z,NAFRev2,N,5.942739,45.888453,0.94,street,Rte du Pont Coppet 74150 Sales,74255_0580,G,RTE DU PONT COPPET,
309012359,00027,30901235900027,O,1900-01-01,NN,,,2008-11-07T00:23:42,true,3,,,,LD,GAUDIN,74150,SALES,,,74255,,,,,,,,,,,,,,,,,,,2004-09-30,F,,,,,45.1A,NAFRev1,N,5.942513,45.889133,0.92,street,Imp de Gaudin 74150 Sales,74255_0320,G,IMP DE GAUDIN,
309503373,00016,30950337300016,O,1977-01-01,NN,,,2020-07-23T11:01:23,true,7,LES ANNONCIADES,,,,LES ANNONCIADES,74150,SALES,,,74255,,,,,,,,,,,,,,,,,,,2020-01-01,A,,,,,68.20B,NAFRev2,N,5.966158,45.896514,0.86,street,Imp des Annonciades 74150 Sales,74255_0020,G,IMP DES ANNONCIADES,
309680924,00011,30968092400011,O,1900-01-01,NN,,,2009-06-27T03:51:23,false,5,,,,,LES BALMES,74150,SALES,,,74255,,,,,,,,,,,,,,,,,,,2008-01-31,F,,,,,96.03Z,NAFRev2,O,5.95992,45.86434,0.83,street,All des Balmes 74150 Sales,74255_0030,G,ALL DES BALMES,
310947312,00016,31094731200016,O,,NN,,,,true,1,,,,,VOIR 301 651 493,74150,SALES,,,74255,,,,,,,,,,,,,,,,,,,,F,,,,,,,N,,,0,,,,,,
310959747,00018,31095974700018,O,,,,,,true,1,,,,,LE CRUET,74150,SALES,,,74255,,,,,,,,,,,,,,,,,,,1984-12-25,F,,,,,65.06,NAP,N,5.965703,45.858638,0.71,street,Rte de Cruet Sud 74150 Sales,74255_0230,G,RTE DE CRUET SUD,
312829898,00039,31282989800039,O,1985-09-01,NN,,,2014-07-08T00:16:55,true,4,,,,,,74150,SALES,,,74255,,,,,,,,,,,,,,,,,,,2012-12-31,F,,,,,32.99Z,NAFRev2,N,,,0,,,,,,
313120883,00043,31312088300043,O,,NN,,,,true,1,,,,LD,GERMONEX,74150,SALES,,,74255,,,,,,,,,,,,,,,,,,,,F,,,,,55.60,NAP,N,5.963731,45.886161,0.92,street,Rte de Germonex 74150 Sales,74255_0330,G,RTE DE GERMONEX,
313959504,00025,31395950400025,O,2009-01-26,,,,2011-01-24T16:01:16,true,2,,,,,PROVONGES,74150,SALES,,,74255,,,,,,,,,,,,,,,,,,,2010-12-31,F,,,,,86.90E,NAFRev2,N,5.954775,45.869497,0.92,street,Imp de Provonges 74150 Sales,74255_0610,G,IMP DE PROVONGES,
314240722,00012,31424072200012,O,,NN,,,,true,1,,,,,PROVONGES,74150,SALES,,,74255,,,,,,,,,,,,,,,,,,,1993-04-11,F,,,,,50.1Z,NAF1993,N,5.954775,45.869497,0.92,street,Imp de Provonges 74150 Sales,74255_0610,G,IMP DE PROVONGES,
314562968,00029,31456296800029,O,1987-07-20,NN,,,,true,1,,,,,TIGNY,74150,SALES,,,74255,,,,,,,,,,,,,,,,,,,1998-11-03,F,,,,,52.6D,NAF1993,N,5.960491,45.874538,0.92,street,Rte de Tigny 74150 Sales,74255_0670,G,RTE DE TIGNY,
314588658,00018,31458865800018,O,,NN,,,,true,1,,,,,RADIE DE 321 221 228,74150,SALES,,,74255,,,,,,,,,,,,,,,,,,,,F,,,,,77.14,NAP,N,,,0,,,,,,
315114140,00041,31511414000041,O,,NN,,,,true,1,,,,,,74150,SALES,,,74255,,,,,,,,,,,,,,,,,,,1996-02-20,F,,,,,29.5E,NAF1993,O,,,0,,,,,,
316291590,00024,31629159000024,O,1900-01-01,22,2018,,2020-08-25T10:26:50,false,6,,14,,RUE,DU LAVOIR,74150,SALES,,,74255,,,,,,,,,,,,,,,,,,,2018-11-16,A,,,,,46.61Z,NAFRev2,O,5.952587,45.8824,0.78,housenumber,14 Rte du Lavoir 74150 Sales,74255_0430_00014,G,14 RTE DU LAVOIR,
316548759,00018,31654875900018,O,1979-01-01,NN,,,2014-07-08T00:20:23,false,5,GERMONEX,,,LD,GERMONEX,74150,SALES,,,74255,,,,,,,,,,,,,,,,,,,2012-01-01,F,,,,,43.34Z,NAFRev2,O,5.963731,45.886161,0.92,street,Rte de Germonex 74150 Sales,74255_0330,G,RTE DE GERMONEX,
316587195,00033,31658719500033,O,,NN,,,,true,1,,,,LD,LE PESSEY,74150,SALES,,,74255,,,,,,,,,,,,,,,,,,,1987-05-31,F,,,,,55.73,NAP,N,5.955666,45.8907,0.74,street,Rte de la Chapelle du Pessey 74150 Sales,74255_0070,G,RTE DE LA CHAPELLE DU PESSEY,
316757350,00046,31675735000046,O,1996-10-01,NN,,,2014-07-08T00:20:33,true,5,,,,,MOULIN DE PROVONGES,74150,SALES,,,74255,,,,,,,,,,,,,,,,,,,2008-01-01,A,,,,,43.99C,NAFRev2,N,5.954775,45.869497,0.63,street,Imp de Provonges 74150 Sales,74255_0610,G,IMP DE PROVONGES,
316757350,00053,31675735000053,O,2009-06-01,,,,2013-09-12T00:10:23,false,1,,,,,MOULIN DE PROVONGES,74150,SALES,,,74255,,,,,,,,,,,,,,,,,,,2009-06-01,F,,,,,81.21Z,NAFRev2,N,5.954775,45.869497,0.63,street,Imp de Provonges 74150 Sales,74255_0610,G,IMP DE PROVONGES,
317107472,00019,31710747200019,O,1979-01-01,NN,,,2014-07-08T00:20:53,true,4,,,,,COUTY,74150,SALES,,,74255,,,,,,,,,,,,,,,,,,,2011-12-31,F,,,,,95.22Z,NAFRev2,N,5.952829,45.868731,0.92,street,R de Couty 74150 Sales,74255_0180,G,R DE COUTY,
317585503,00012,31758550300012,O,1979-01-01,NN,,,2019-04-04T19:35:26,true,13,PROVONGES,393,,RTE,DES CREUSES,74150,SALES,,,74255,,,,,,,,,,,,,,,,,,,2018-12-12,F,ZIM ZAM REAL KLUBB,,,ZIM ZAM REAL KLUBB,56.30Z,NAFRev2,O,5.95459,45.868159,0.94,housenumber,393 Rte des Creuses 74150 Sales,74255_0200_00393,G,393 RTE DES CREUSES,
319672820,00028,31967282000028,O,2001-05-28,NN,,,2017-11-22T04:47:50,true,3,,282,,RTE,CHEF LIEU,74150,SALES,,,74255,,,,,,,,,,,,,,,,,,,2008-01-01,A,,,,,68.20B,NAFRev2,N,6.1696782,46.0109002,0.71,poi.track,Route du Chef Lieu (Chemin) Groisy,https://osm.org/way/185818542,G,,
321221228,00026,32122122800026,O,,NN,,,,true,1,,,,LD,PROVONGES,74150,SALES,,,74255,,,,,,,,,,,,,,,,,,,1993-12-22,F,,,,,74.8K,NAF1993,N,5.954775,45.869497,0.92,street,Imp de Provonges 74150 Sales,74255_0610,G,IMP DE PROVONGES,
325720498,00089,32572049800089,O,2002-09-30,02,2018,,2020-08-25T10:31:30,false,3,FROMAGERIE DE SALES,,,,,74150,SALES,,,74255,,,,,,,,,,,,,,,,,,,2008-01-01,A,,,,,10.51C,NAFRev2,O,5.963731,45.886161,0.48,street,Rte de Germonex 74150 Sales,74255_0330,D,RTE DE GERMONEX,
325811172,00015,32581117200015,O,1958-01-01,,,,,true,1,,,,LD,PROVONGES,74150,SALES,,,74255,,,,,,,,,,,,,,,,,,,2001-09-30,F,,,,,70.2C,NAF1993,N,5.954775,45.869497,0.92,street,Imp de Provonges 74150 Sales,74255_0610,G,IMP DE PROVONGES,
326120474,00019,32612047400019,O,1961-01-01,NN,,,2014-06-14T01:48:12,true,5,,,,LD,BEAUSOLEIL,74150,SALES,,,74255,,,,,,,,,,,,,,,,,,,2012-11-29,F,,,,,46.21Z,NAFRev2,O,5.947193,45.877597,0.92,street,All de Beausoleil 74150 Sales,74255_0040,G,ALL DE BEAUSOLEIL,
326212230,00022,32621223000022,O,1985-11-27,NN,,,2008-08-20T03:50:11,true,4,,,,,LE NOUVEAU HAMEAU,74150,SALES,,,74255,,,,,,,,,,,,,,,,,,,2008-01-01,F,,,,,68.20B,NAFRev2,N,5.94466,45.874432,0.76,street,Imp du Nouveau Hameau 74150 Sales,74255_0530,G,IMP DU NOUVEAU HAMEAU,
326712007,00011,32671200700011,O,,,,,,true,1,,,,LD,BEAU SOLEIL,74150,SALES,,,74255,,,,,,,,,,,,,,,,,,,1989-04-30,F,,,,,57.02,NAP,N,-2.4480901,47.6582175,0.9,poi.school,Ecole Beau Soleil Questembert,https://osm.org/way/582045173,G,,
326820313,00012,32682031300012,O,1965-01-01,NN,,,,false,5,,,,,,74150,SALES,,,74255,,,,,,,,,,,,,,,,,,,2003-12-31,F,,,,,51.8P,NAFRev1,O,,,0,,,,,,
326820313,00020,32682031300020,O,2003-12-31,,,,2006-11-25T10:03:23,true,3,,,,LD,LES GRANDS CHAMPS,74150,SALES,,,74255,,,,,,,,,,,,,,,,,,,2004-07-30,F,,,,,51.8P,NAFRev1,N,5.6683008,46.8547986,0.9,poi.track,Les Grands Champs (Chemin) Tourmont,https://osm.org/way/252586310,G,,
326912268,00033,32691226800033,O,2007-08-01,,,,2013-01-18T11:37:13,true,2,,,,RTE,DU CIMETIERE,74150,SALES,,,74255,,,,,,,,,,,,,,,,,,,2012-12-31,F,,,,,49.41A,NAFRev2,N,6.7774826,46.055886,0.8,poi,Route du Cimetière (Pont) Sixt-Fer-à-Cheval,https://osm.org/way/300455357,G,,
327152112,00014,32715211200014,O,1900-01-01,NN,,,2011-04-28T00:23:10,false,3,,,,LD,TIGNY,74150,SALES,,,74255,,,,,,,,,,,,,,,,,,,1986-12-25,F,,,,,49.05,NAP,N,5.960491,45.874538,0.92,street,Rte de Tigny 74150 Sales,74255_0670,G,RTE DE TIGNY,
327296026,00013,32729602600013,O,,NN,,,,true,1,,,,LD,LES MOLLIATS,74150,SALES,,,74255,,,,,,,,,,,,,,,,,,,,F,,,,,69.25,NAP,N,5.949236,45.873613,0.85,street,Rte des Molliats 74150 Sales,74255_0490,G,RTE DES MOLLIATS,
327395380,00022,32739538000022,O,1995-07-01,NN,,,,false,3,,7,,,HAMEAU DU GRAND PRE,74150,SALES,,,74255,,,,,,,,,,,,,,,,,,,1996-06-22,F,ATELIER ART ET CREATION,,,,36.6E,NAF1993,N,5.94466,45.874432,0.43,street,Imp du Nouveau Hameau 74150 Sales,74255_0530,G,IMP DU NOUVEAU HAMEAU,
328122429,00033,32812242900033,O,1991-01-01,NN,,,,true,4,,,,,LE CRUET NORD,74150,SALES,,,74255,,,,,,,,,,,,,,,,,,,1993-12-25,F,,,,,60.2L,NAF1993,N,5.962657,45.864725,0.74,street,Rte du Cruet Nord 74150 Sales,74255_0220,G,RTE DU CRUET NORD,
328512025,00045,32851202500045,O,2003-10-07,NN,,,2006-11-25T10:08:10,false,3,,,,HAM,BEAU SOLEIL,74150,SALES,,,74255,,,,,,,,,,,,,,,,,,,2005-04-01,F,,,,,85.1G,NAFRev1,N,-2.4480901,47.6582175,0.9,poi.school,Ecole Beau Soleil Questembert,https://osm.org/way/582045173,G,,
329094155,00010,32909415500010,O,,NN,,,,true,1,,,,LD,CHEF LIEU,74150,SALES,,,74255,,,,,,,,,,,,,,,,,,,1992-12-31,F,,,,,45.4C,NAF1993,N,5.959889,45.874531,0.92,street,Rte du Chef Lieu 74150 Sales,74255_0100,G,RTE DU CHEF LIEU,
329094163,00014,32909416300014,O,,NN,,,,true,1,,,,LD,CHEF LIEU,74150,SALES,,,74255,,,,,,,,,,,,,,,,,,,1992-12-31,F,,,,,45.4C,NAF1993,N,5.959889,45.874531,0.92,street,Rte du Chef Lieu 74150 Sales,74255_0100,G,RTE DU CHEF LIEU,
329271225,00016,32927122500016,O,1984-01-03,NN,,,2017-01-05T03:42:27,true,5,,315,,RTE,DU CHERAN,74150,SALES,,,74255,,,,,,,,,,,,,,,,,,,2016-12-31,F,ENTREPRISE ARTISANALE TOURNEUX PATR,,,ENTREPRISE ARTISANALE TOURNEUX PATRICK,43.99C,NAFRev2,N,5.959965,45.865652,0.76,street,Rte du Cheran 74150 Sales,74255_0120,G,RTE DU CHERAN,
329637441,00026,32963744100026,O,1900-01-01,,,,2011-04-28T00:25:02,false,4,,,,,CHEF LIEU,74150,SALES,,,74255,,,,,,,,,,,,,,,,,,,1992-12-25,F,,,,,74.8F,NAF1993,N,5.959889,45.874531,0.92,street,Rte du Chef Lieu 74150 Sales,74255_0100,G,RTE DU CHEF LIEU,
330318544,00013,33031854400013,O,,NN,,,,true,1,,,,LD,LES BALMES,74150,SALES,,,74255,,,,,,,,,,,,,,,,,,,1995-06-30,F,,,,,91.3E,NAF1993,O,5.95992,45.86434,0.83,street,All des Balmes 74150 Sales,74255_0030,G,ALL DES BALMES,
332451368,00010,33245136800010,O,,NN,,,,true,1,,,,LD,GERMONEX,74150,SALES,,,74255,,,,,,,,,,,,,,,,,,,,F,,,,,55.60,NAP,N,5.963731,45.886161,0.92,street,Rte de Germonex 74150 Sales,74255_0330,G,RTE DE GERMONEX,
332451384,00017,33245138400017,O,,NN,,,,true,1,,,,LD,GERMONEX,74150,SALES,,,74255,,,,,,,,,,,,,,,,,,,,F,,,,,55.60,NAP,N,5.963731,45.886161,0.92,street,Rte de Germonex 74150 Sales,74255_0330,G,RTE DE GERMONEX,
332572718,00010,33257271800010,O,1985-04-01,NN,,,,true,4,,,,LD,EXUEL,74150,SALES,,,74255,,,,,,,,,,,,,,,,,,,1993-07-01,F,,,,,74.2C,NAF1993,N,5.96259,45.89309,0.92,street,Rte d'Exuel 74150 Sales,74255_0260,G,RTE D EXUEL,
333486892,00016,33348689200016,O,1985-04-01,,,,,false,3,,,,LD,LE MOLLARD EN BAS,74150,SALES,,,74255,,,,,,,,,,,,,,,,,,,1997-01-01,F,,,,,19.2Z,NAF1993,N,5.947241,45.882831,0.58,street,Rte du Mollard Bas 74150 Sales,74255_0470,G,RTE DU MOLLARD BAS,
341602803,00015,34160280300015,O,2005-11-01,NN,,,2007-09-27T10:30:45,true,1,,,,,ZA LES ECOREES,74150,SALES,,,74255,,,,,,,,,,,,,,,,,,,2007-09-30,F,PALISSANDRE,,,,52.4H,NAFRev1,N,5.953147,45.886752,0.67,street,Imp des Ecorees 74150 Sales,74255_0245,G,IMP DES ECOREES,
341983591,00015,34198359100015,O,,NN,,,,true,1,,,,LD,CHEF LIEU,74150,SALES,,,74255,,,,,,,,,,,,,,,,,,,1996-12-31,F,,,,,70.2A,NAF1993,N,5.959889,45.874531,0.92,street,Rte du Chef Lieu 74150 Sales,74255_0100,G,RTE DU CHEF LIEU,
343066395,00017,34306639500017,O,1987-12-03,NN,,,2008-09-10T16:17:57,true,3,,,,LD,LE MOLLARD,74150,SALES,,,74255,,,,,,,,,,,,,,,,,,,2008-01-01,A,,,,,68.20B,NAFRev2,N,5.2044508,46.4186563,0.9,poi.forest,Le Mollard (Forêt) Cormoz,https://osm.org/way/41750519,G,,
343176103,00012,34317610300012,O,,NN,,,,true,1,,,,LD,CHEF LIEU,74150,SALES,,,74255,,,,,,,,,,,,,,,,,,,1992-12-31,F,,,,,55.3A,NAF1993,O,5.959889,45.874531,0.92,street,Rte du Chef Lieu 74150 Sales,74255_0100,G,RTE DU CHEF LIEU,
343258547,00011,34325854700011,O,1987-12-01,NN,,,2008-01-04T22:13:21,true,3,,,,LD,PROVONGES,74150,SALES,,,74255,,,,,,,,,,,,,,,,,,,2008-01-01,A,,,,,68.20A,NAFRev2,N,5.954775,45.869497,0.92,street,Imp de Provonges 74150 Sales,74255_0610,G,IMP DE PROVONGES,
343589743,00016,34358974300016,O,1988-01-01,NN,,,,true,4,,,,LD,LES BALMES,74150,SALES,,,74255,,,,,,,,,,,,,,,,,,,2003-03-31,F,,,,,60.2M,NAFRev1,N,5.95992,45.86434,0.83,street,All des Balmes 74150 Sales,74255_0030,G,ALL DES BALMES,
344065891,00022,34406589100022,O,1989-07-01,NN,,,2019-10-24T03:37:37,true,4,GERMONEX,,,,GERMONEX,74150,SALES,,,74255,,,,,,,,,,,,,,,,,,,2019-10-23,F,,,,,68.20B,NAFRev2,N,5.963731,45.886161,0.92,street,Rte de Germonex 74150 Sales,74255_0330,G,RTE DE GERMONEX,
344852447,00012,34485244700012,O,,NN,,,,true,1,,,,,CHARVAZ,74150,SALES,,,74255,,,,,,,,,,,,,,,,,,,1992-08-17,F,,,,,52.6D,NAF1993,N,5.957222,45.879039,0.92,street,Rte de Charvaz 74150 Sales,74255_0090,G,RTE DE CHARVAZ,
347846081,00029,34784608100029,O,1989-04-28,NN,,,,true,1,,,,LD,EXUEL,74150,SALES,,,74255,,,,,,,,,,,,,,,,,,,2000-04-21,F,,,,,67.2Z,NAF1993,N,5.96259,45.89309,0.92,street,Rte d'Exuel 74150 Sales,74255_0260,G,RTE D EXUEL,
349073130,00016,34907313000016,O,1989-01-01,NN,,,2008-11-08T00:23:46,false,4,,,,LD,CHARVAZ,74150,SALES,,,74255,,,,,,,,,,,,,,,,,,,2000-12-01,F,,,,,36.1E,NAF1993,O,5.957222,45.879039,0.92,street,Rte de Charvaz 74150 Sales,74255_0090,G,RTE DE CHARVAZ,
349164301,00013,34916430100013,O,1989-01-01,NN,,,2008-11-08T00:23:56,false,4,LES MESANGES,,,LD,LES MESANGES,74150,SALES,,,74255,,,,,,,,,,,,,,,,,,,2006-07-01,F,,,,,45.4L,NAFRev1,N,5.943631,45.878749,0.85,street,All des Mesanges 74150 Sales,74255_0460,G,ALL DES MESANGES,
349164301,00021,34916430100021,O,2006-07-01,NN,,,2014-07-08T00:52:35,true,5,ZA LES ECOREES,,,,,74150,SALES,,,74255,,,,,,,,,,,,,,,,,,,2011-06-30,F,,,,,31.09B,NAFRev2,O,5.953147,45.886752,0.67,street,Imp des Ecorees 74150 Sales,74255_0245,D,IMP DES ECOREES,
350486098,00014,35048609800014,O,1989-03-15,NN,,,,true,1,,,,LD,COUTY,74150,SALES,,,74255,,,,,,,,,,,,,,,,,,,1998-06-30,F,,,,,52.7C,NAF1993,N,5.952829,45.868731,0.92,street,R de Couty 74150 Sales,74255_0180,G,R DE COUTY,
350595468,00017,35059546800017,O,1989-05-01,NN,,,2019-06-26T03:44:50,true,4,BEAUSOLEIL,121,,RTE,D'HAUTEVILLE,74150,SALES,,,74255,,,,,,,,,,,,,,,,,,,2019-06-20,A,,,,,46.23Z,NAFRev2,O,5.944482,45.875427,0.79,street,Rte d'Hauteville 74150 Sales,74255_0380,G,RTE D HAUTEVILLE,
350702346,00031,35070234600031,O,1998-09-25,NN,,,2006-12-15T00:36:27,false,4,LE PESSEY,,,,CHAMP SOUS LES VIGNES,74150,SALES,,,74255,,,,,,,,,,,,,,,,,,,2005-12-31,F,,,,,60.2M,NAFRev1,N,-0.0513928,48.0439031,0.89,poi.farmland,Le Champ sous les Vignes (Terres agricoles) Amné,https://osm.org/way/273259732,G,,
350702346,00049,35070234600049,O,2006-03-01,,,,2010-03-26T11:51:23,true,3,,,,,LE PESSEY,74150,SALES,,,74255,,,,,,,,,,,,,,,,,,,2010-03-31,F,,,,,49.41A,NAFRev2,N,5.955666,45.8907,0.74,street,Rte de la Chapelle du Pessey 74150 Sales,74255_0070,G,RTE DE LA CHAPELLE DU PESSEY,
351100102,00018,35110010200018,O,1989-05-30,NN,,,2020-06-02T16:13:45,true,3,,53,,,ROUTE DE BOUSSY,74150,SALES,,,74255,,,,,,,,,,,,,,,,,,,2008-01-01,A,,,,,68.20B,NAFRev2,N,5.96308,45.870088,0.76,housenumber,53 Rte de Boussy 74150 Sales,74255_0050_00053,G,53 RTE DE BOUSSY,
351657275,00027,35165727500027,O,2009-06-01,,,,2016-10-23T03:26:08,true,2,,,,,COUTY,74150,SALES,,,74255,,,,,,,,,,,,,,,,,,,2011-06-30,F,,,,,43.99C,NAFRev2,N,5.952829,45.868731,0.92,street,R de Couty 74150 Sales,74255_0180,G,R DE COUTY,
352015036,00010,35201503600010,O,,NN,,,,true,1,,,,,,74150,SALES,,,74255,,,,,,,,,,,,,,,,,,,1990-03-31,F,,,,,64.40,NAP,N,,,0,,,,,,
353026628,00019,35302662800019,O,1989-11-01,01,2018,,2020-08-25T10:13:12,true,3,,,,LD,LE PESSEY,74150,SALES,,,74255,,,,,,,,,,,,,,,,,,,2008-01-01,A,,,,,01.41Z,NAFRev2,N,5.955666,45.8907,0.74,street,Rte de la Chapelle du Pessey 74150 Sales,74255_0070,G,RTE DE LA CHAPELLE DU PESSEY,
353786320,00062,35378632000062,O,2012-05-10,,,3320CZ,2021-02-23T11:06:02,true,3,,72,,RTE,DU PAVE,74150,SALES,,,74255,,,,,,,,,,,,,,,,,,,2015-09-14,A,,,,,33.20C,NAFRev2,N,5.949477,45.870349,0.94,housenumber,72 Rte du Pave 74150 Sales,74255_0545_00072,G,72 RTE DU PAVE,
377921440,00022,37792144000022,O,2019-06-03,,,,2021-02-23T11:06:42,true,1,,495,,,ROUTE DES CREUSES,74150,SALES,,,74255,,,,,,,,,,,,,,,,,,,2019-06-03,A,,,,,68.20A,NAFRev2,N,5.948547,45.869395,0.78,housenumber,495 Rte des Creuses 74150 Sales,74255_0200_00495,G,495 RTE DES CREUSES,
379334428,00016,37933442800016,O,1990-10-08,NN,,,2008-11-08T00:35:31,true,5,,,,,CHARVAZ,74150,SALES,,,74255,,,,,,,,,,,,,,,,,,,2008-01-31,F,,,,,43.21A,NAFRev2,N,5.957222,45.879039,0.92,street,Rte de Charvaz 74150 Sales,74255_0090,G,RTE DE CHARVAZ,
379443757,00016,37944375700016,O,1990-09-01,NN,,,,true,1,,,,,COUTY,74150,SALES,,,74255,,,,,,,,,,,,,,,,,,,2000-12-31,F,,,,,74.8K,NAF1993,N,5.952829,45.868731,0.92,street,R de Couty 74150 Sales,74255_0180,G,R DE COUTY,
379930258,00015,37993025800015,O,1990-10-02,NN,,,2018-09-29T12:08:04,true,8,,74,,CHE,DU FORT,74150,SALES,,,74255,,,,,,,,,,,,,,,,,,,2012-08-06,A,,,,,31.09B,NAFRev2,O,5.964304,45.892718,0.94,housenumber,74 Che du Fort 74150 Sales,74255_0290_00074,G,74 CHE DU FORT,
381062843,00051,38106284300051,O,2019-07-24,,,,2019-09-13T18:44:51,false,1,,34,,RTE,DU PAVE,74150,SALES,,,74255,,,,,,,,,,,,,,,,,,,2019-07-24,A,,,,,71.12B,NAFRev2,N,5.951075,45.871442,0.94,housenumber,34 Rte du Pave 74150 Sales,74255_0545_00034,G,34 RTE DU PAVE,
381660687,00025,38166068700025,O,2000-06-30,NN,,,2021-04-20T08:50:02,true,3,,282,,RTE,CHEF LIEU,74150,SALES,,,74255,,,,,,,,,,,,,,,,,,,2008-01-01,A,,,,,68.20A,NAFRev2,N,6.1696782,46.0109002,0.71,poi.track,Route du Chef Lieu (Chemin) Groisy,https://osm.org/way/185818542,G,,
382524593,00011,38252459300011,O,1991-07-20,NN,,,,true,1,,,,,NOUVEAU HAMEAU,74150,SALES,,,74255,,,,,,,,,,,,,,,,,,,2000-09-30,F,,,,,45.4J,NAF1993,N,5.94466,45.874432,0.92,street,Imp du Nouveau Hameau 74150 Sales,74255_0530,G,IMP DU NOUVEAU HAMEAU,
384073391,00011,38407339100011,O,1992-01-06,NN,,,2008-11-08T00:44:31,false,3,,,,,LE MOLLARD HAUT,74150,SALES,,,74255,,,,,,,,,,,,,,,,,,,2003-07-12,F,S.T.I.,,,,45.3F,NAFRev1,N,5.947658,45.878397,0.77,street,Rte du Mollard Haut 74150 Sales,74255_0480,G,RTE DU MOLLARD HAUT,
384284618,00012,38428461800012,O,1991-12-17,NN,,,2019-10-24T03:37:37,true,4,,,,,GERMONEX,74150,SALES,,,74255,,,,,,,,,,,,,,,,,,,2019-10-23,F,,,,,68.20A,NAFRev2,N,5.963731,45.886161,0.92,street,Rte de Germonex 74150 Sales,74255_0330,G,RTE DE GERMONEX,