siren,nic,siret,statutDiffusionEtablissement,dateCreationEtablissement,trancheEffectifsEtablissement,anneeEffectifsEtablissement,activitePrincipaleRegistreMetiersEtablissement,dateDernierTraitementEtablissement,etablissementSiege,nombrePeriodesEtablissement,complementAdresseEtablissement,numeroVoieEtablissement,indiceRepetitionEtablissement,typeVoieEtablissement,libelleVoieEtablissement,codePostalEtablissement,libelleCommuneEtablissement,libelleCommuneEtrangerEtablissement,distributionSpecialeEtablissement,codeCommuneEtablissement,codeCedexEtablissement,libelleCedexEtablissement,codePaysEtrangerEtablissement,libellePaysEtrangerEtablissement,complementAdresse2Etablissement,numeroVoie2Etablissement,indiceRepetition2Etablissement,typeVoie2Etablissement,libelleVoie2Etablissement,codePostal2Etablissement,libelleCommune2Etablissement,libelleCommuneEtranger2Etablissement,distributionSpeciale2Etablissement,codeCommune2Etablissement,codeCedex2Etablissement,libelleCedex2Etablissement,codePaysEtranger2Etablissement,libellePaysEtranger2Etablissement,dateDebut,etatAdministratifEtablissement,enseigne1Etablissement,enseigne2Etablissement,enseigne3Etablissement,denominationUsuelleEtablissement,activitePrincipaleEtablissement,nomenclatureActivitePrincipaleEtablissement,caractereEmployeurEtablissement,longitude,latitude,geo_score,geo_type,geo_adresse,geo_id,geo_ligne,geo_l4,geo_l5
200005247,00016,20000524700016,O,2006-09-22,,,,2019-11-14T14:00:58,true,3,MAIRIE,,,PL,DE L'EGLISE,77760,BOISSY-AUX-CAILLES,,,77041,,,,,,,,,,,,,,,,,,,2008-07-24,F,,,,,42.99Z,NAFRev2,N,2.504601,48.318683,0.81,street,Place de l'Eglise 77760 Boissy-aux-Cailles,77041_0053,G,PLACE DE L EGLISE,
217700418,00015,21770041800015,O,1983-03-01,01,2018,,2020-08-25T10:19:06,true,4,,,,,,77760,BOISSY-AUX-CAILLES,,,77041,,,,,,,,,,,,,,,,,,,2008-01-01,A,MAIRIE,,,,84.11Z,NAFRev2,O,,,0,,,,,,
217700418,00023,21770041800023,O,1997-01-01,NN,,,2019-11-14T14:00:58,false,4,,,,PL,DE L'EGLISE,77760,BOISSY-AUX-CAILLES,,,77041,,,,,,,,,,,,,,,,,,,2017-12-31,F,SERVICE DES EAUX,,,,36.00Z,NAFRev2,N,2.504601,48.318683,0.81,street,Place de l'Eglise 77760 Boissy-aux-Cailles,77041_0053,G,PLACE DE L EGLISE,
257701714,00012,25770171400012,O,1983-03-01,NN,,,2019-11-14T14:00:58,false,4,,,,,,77760,BOISSY-AUX-CAILLES,,,77041,,,,,,,,,,,,,,,,,,,2003-01-01,F,,,,,90.0A,NAF1993,N,,,0,,,,,,
267706067,00019,26770606700019,O,1983-03-01,NN,,,2019-11-14T14:00:58,true,4,,,,,,77760,BOISSY-AUX-CAILLES,,,77041,,,,,,,,,,,,,,,,,,,2017-10-18,F,CCAS,,,,88.99B,NAFRev2,N,,,0,,,,,,
267706182,00016,26770618200016,O,1982-03-28,NN,,,2019-11-14T14:00:58,true,4,,,,PL,DE L'EGLISE,77760,BOISSY-AUX-CAILLES,,,77041,,,,,,,,,,,,,,,,,,,1996-10-25,F,CDE,,,,85.3K,NAF1993,N,2.504601,48.318683,0.81,street,Place de l'Eglise 77760 Boissy-aux-Cailles,77041_0053,G,PLACE DE L EGLISE,
297703688,00012,29770368800012,O,1984-01-09,NN,,,2019-11-14T14:00:58,true,3,MAIRIE,,,PL,DE L'EGLISE,77760,BOISSY-AUX-CAILLES,,,77041,,,,,,,,,,,,,,,,,,,2006-02-27,F,,,,,70.1C,NAFRev1,N,2.504601,48.318683,0.81,street,Place de l'Eglise 77760 Boissy-aux-Cailles,77041_0053,G,PLACE DE L EGLISE,
300961364,00027,30096136400027,O,1900-01-01,,,,2019-11-14T14:00:58,true,4,,19,,RUE,DU GENERAL DE GAULLE,77760,BOISSY-AUX-CAILLES,,,77041,,,,,,,,,,,,,,,,,,,1991-12-25,F,,,,,55.73,NAP,N,2.508948,48.307653,0.55,housenumber,19 Rue Charles de Gaulle 77760 Boissy-aux-Cailles,77041_0020_00019,G,19 RUE CHARLES DE GAULLE,
303484240,00021,30348424000021,O,1981-06-01,,,,2019-11-14T14:00:58,false,3,,1,,RUE,DES VIGNES,77760,BOISSY-AUX-CAILLES,,,77041,,,,,,,,,,,,,,,,,,,1998-01-05,F,,,,,70.2C,NAF1993,N,2.473836,48.305865,0.93,housenumber,1 Rue des Vignes 77760 Boissy-aux-Cailles,77041_0196_00001,G,1 RUE DES VIGNES,
303484240,00039,30348424000039,O,1998-01-05,NN,,,2019-11-14T14:00:58,true,3,,15,,RUE,DE LA LIBERATION,77760,BOISSY-AUX-CAILLES,,,77041,,,,,,,,,,,,,,,,,,,2005-12-31,F,,,,,36.1K,NAFRev1,N,2.473765,48.305456,0.93,housenumber,15 Rue de la Liberation 77760 Boissy-aux-Cailles,77041_0080_00015,G,15 RUE DE LA LIBERATION,
307769802,00017,30776980200017,O,,,,,2019-11-14T14:00:58,true,1,,,,LD,MAINBERVILLIERS,77760,BOISSY-AUX-CAILLES,,,77041,,,,,,,,,,,,,,,,,,,1984-12-25,F,,,,,,,N,,,0,,,,,,
308221134,00015,30822113400015,O,,NN,,,2019-11-14T14:00:58,true,1,,,,,MAINBERVILLIERS,77760,BOISSY-AUX-CAILLES,,,77041,,,,,,,,,,,,,,,,,,,,F,,,,,01.80,NAP,N,,,0,,,,,,
310527361,00011,31052736100011,O,,NN,,,2019-11-14T14:00:58,true,1,,1,,RUE,DE LA LIBERATION,77760,BOISSY-AUX-CAILLES,,,77041,,,,,,,,,,,,,,,,,,,1989-12-31,F,,,,,55.10,NAP,N,2.477965,48.305413,0.93,housenumber,1 Rue de la Liberation 77760 Boissy-aux-Cailles,77041_0080_00001,G,1 RUE DE LA LIBERATION,
312113939,00010,31211393900010,O,,NN,,,2019-11-14T14:00:58,true,1,,,,,,77760,BOISSY-AUX-CAILLES,,,77041,,,,,,,,,,,,,,,,,,,1990-05-22,F,,,,,54.04,NAP,N,,,0,,,,,,
312771678,00025,31277167800025,O,1900-01-01,NN,,,2019-11-14T14:00:58,true,4,,14,,PL,DE L EGLISE,77760,BOISSY-AUX-CAILLES,,,77041,,,,,,,,,,,,,,,,,,,1992-12-15,F,,,,,51.6L,NAF1993,N,2.505076,48.318641,0.83,housenumber,14 Place de l'Eglise 77760 Boissy-aux-Cailles,77041_0053_00014,G,14 PLACE DE L EGLISE,
313861601,00018,31386160100018,O,1956-05-30,,,,2019-11-14T14:00:58,true,4,,,,,FERME DU FIEF,77760,BOISSY-AUX-CAILLES,,,77041,,,,,,,,,,,,,,,,,,,2008-01-01,A,,,,,01.11Z,NAFRev2,N,2.507443,48.322092,0.93,locality,Ferme du Fief 77760 Boissy-aux-Cailles,77041_b041,G,FERME DU FIEF,
317088326,00010,31708832600010,O,1979-01-01,NN,,,2019-11-14T14:00:58,true,1,,31,,RUE,DE LA LIBERATION MAINBERVI,77760,BOISSY-AUX-CAILLES,,,77041,,,,,,,,,,,,,,,,,,,2000-12-31,F,,,,,74.2C,NAF1993,N,2.47026,48.305629,0.72,housenumber,31 Rue de la Liberation 77760 Boissy-aux-Cailles,77041_0080_00031,G,31 RUE DE LA LIBERATION,
321588576,00017,32158857600017,O,1981-03-01,NN,,,2019-11-14T14:00:58,false,3,,21,,RUE,GENERAL DE GAULLE,77760,BOISSY-AUX-CAILLES,,,77041,,,,,,,,,,,,,,,,,,,2004-01-01,F,,,,,92.3A,NAFRev1,N,5.1047139,47.2783266,0.9,poi,Rue Général de Gaulle (Pont) Neuilly-lès-Dijon,https://osm.org/way/37832985,G,,
322082363,00027,32208236300027,O,,,,,2019-11-14T14:00:58,true,1,,,,CHE,DES OUCHES DU COUCHANT,77760,BOISSY-AUX-CAILLES,,,77041,,,,,,,,,,,,,,,,,,,1984-12-25,F,,,,,77.03,NAP,N,2.507801,48.308442,0.85,street,Chemin des Ouches du Couchant 77760 Boissy-aux-Cailles,77041_0055,G,CHEMIN DES OUCHES DU COUCHANT,
324102276,00049,32410227600049,O,2010-05-01,,,,2021-02-23T10:47:14,true,1,,21,,RUE,DU GENERAL DE GAULLE - MARLANVAL,77760,BOISSY-AUX-CAILLES,,,77041,,,,,,,,,,,,,,,,,,,2010-05-01,A,,,,,90.03A,NAFRev2,N,1.6097254,48.6136751,0.72,poi,Rue du Général de Gaulle (Pont) Saint-Martin-de-Nigelles,https://osm.org/way/504607133,G,,
324343177,00014,32434317700014,O,1982-04-01,,,,2019-11-14T14:00:58,true,3,,4,,RUE,DE LA LIBERATION,77760,BOISSY-AUX-CAILLES,,,77041,,,,,,,,,,,,,,,,,,,1997-10-19,F,,,,,01.1A,NAF1993,N,2.475361,48.305943,0.93,housenumber,4 Rue de la Liberation 77760 Boissy-aux-Cailles,77041_0080_00004,G,4 RUE DE LA LIBERATION,
326294923,00015,32629492300015,O,1982-11-15,NN,,,2020-11-09T11:25:58,true,3,,6,,RUE,DE LA LIBERATION,77760,BOISSY-AUX-CAILLES,,,77041,,,,,,,,,,,,,,,,,,,2008-01-01,A,,,,,01.11Z,NAFRev2,N,2.474944,48.305921,0.93,housenumber,6 Rue de la Liberation 77760 Boissy-aux-Cailles,77041_0080_00006,G,6 RUE DE LA LIBERATION,
326377348,00015,32637734800015,O,1982-09-28,NN,,,2019-11-14T14:00:58,true,3,,17,,RUE,LIBERATION,77760,BOISSY-AUX-CAILLES,,,77041,,,,,,,,,,,,,,,,,,,2007-03-10,F,,,,,01.1A,NAFRev1,N,2.473162,48.30588,0.92,housenumber,17 Rue de la Liberation 77760 Boissy-aux-Cailles,77041_0080_00017,G,17 RUE DE LA LIBERATION,
327612412,00012,32761241200012,O,1983-04-12,,,,2019-11-14T14:00:58,true,3,FERME DE MARLANVAL,9,,RUE,CHARLES DE GAULLE,77760,BOISSY-AUX-CAILLES,,,77041,,,,,,,,,,,,,,,,,,,2008-01-01,A,,,,,01.11Z,NAFRev2,N,2.509238,48.306944,0.93,housenumber,9 Rue Charles de Gaulle 77760 Boissy-aux-Cailles,77041_0020_00009,G,9 RUE CHARLES DE GAULLE,
328517412,00016,32851741200016,O,1983-10-22,NN,,,2019-11-14T14:00:58,true,3,,49,,RUE,CHARLES DE GAULLE,77760,BOISSY-AUX-CAILLES,,,77041,,,,,,,,,,,,,,,,,,,2008-01-01,A,,,,,01.11Z,NAFRev2,N,2.507419,48.309792,0.93,housenumber,49 Rue Charles de Gaulle 77760 Boissy-aux-Cailles,77041_0020_00049,G,49 RUE CHARLES DE GAULLE,
329103329,00028,32910332900028,O,1991-07-01,NN,,,2019-11-14T14:00:58,true,6,,,,CHE,DES OUCHES DU COUCHANT,77760,BOISSY-AUX-CAILLES,,,77041,,,,,,,,,,,,,,,,,,,2018-11-27,F,,,,,01.49Z,NAFRev2,N,2.507801,48.308442,0.85,street,Chemin des Ouches du Couchant 77760 Boissy-aux-Cailles,77041_0055,G,CHEMIN DES OUCHES DU COUCHANT,
338468788,00017,33846878800017,O,,NN,,,2019-11-14T14:00:58,true,1,,,,,CD 16A,77760,BOISSY-AUX-CAILLES,,,77041,,,,,,,,,,,,,,,,,,,1987-12-31,F,,,,,77.12,NAP,N,,,0,,,,,,
340928308,00014,34092830800014,O,1986-11-01,NN,,,2019-11-14T14:00:58,true,4,,,,,,77760,BOISSY-AUX-CAILLES,,,77041,,,,,,,,,,,,,,,,,,,1994-12-25,F,,,,,01.1A,NAF1993,N,,,0,,,,,,
343136875,00022,34313687500022,O,1992-01-01,NN,,,2019-11-14T14:00:58,true,3,MAINBERVILLIERS,4,,RUE,DE LA LIBERATION,77760,BOISSY-AUX-CAILLES,,,77041,,,,,,,,,,,,,,,,,,,2008-01-01,A,,,,,01.11Z,NAFRev2,N,2.475361,48.305943,0.93,housenumber,4 Rue de la Liberation 77760 Boissy-aux-Cailles,77041_0080_00004,G,4 RUE DE LA LIBERATION,
347837650,00014,34783765000014,O,1988-08-09,NN,,,2019-11-14T14:00:58,true,4,HAMEAU DE MARLANVAL,31,,RUE,CHARLES DE GAULLE,77760,BOISSY-AUX-CAILLES,,,77041,,,,,,,,,,,,,,,,,,,2003-09-23,F,,,,,51.2G,NAFRev1,N,2.50886,48.308304,0.93,housenumber,31 Rue Charles de Gaulle 77760 Boissy-aux-Cailles,77041_0020_00031,G,31 RUE CHARLES DE GAULLE,
349981878,00029,34998187800029,O,2004-07-13,NN,,,2019-11-14T14:00:58,true,3,,11,,ALL,DU SOUVENIR,77760,BOISSY-AUX-CAILLES,,,77041,,,,,,,,,,,,,,,,,,,2008-01-01,A,,,,,41.10D,NAFRev2,N,2.505718,48.31793,0.84,housenumber,11 Allée du Souvenir 77760 Boissy-aux-Cailles,77041_0185_00011,G,11 ALLEE DU SOUVENIR,
351469374,00018,35146937400018,O,1989-06-01,02,2018,,2020-08-25T10:11:40,true,4,MAIMBERVILLIERS,21,,RUE,DE LA LIBERATION,77760,BOISSY-AUX-CAILLES,,,77041,,,,,,,,,,,,,,,,,,,2010-12-31,A,,,,,01.11Z,NAFRev2,O,2.472604,48.305893,0.93,housenumber,21 Rue de la Liberation 77760 Boissy-aux-Cailles,77041_0080_00021,G,21 RUE DE LA LIBERATION,
353325509,00019,35332550900019,O,1990-01-02,,,,2019-11-14T14:00:58,true,3,,31,,,MAINBERVILLIERS,77760,BOISSY-AUX-CAILLES,,,77041,,,,,,,,,,,,,,,,,,,2006-12-31,F,,,,,01.1A,NAFRev1,N,,,0,,,,,,
377642913,00018,37764291300018,O,,NN,,,2019-11-14T14:00:58,true,1,,27,,RUE,CHARLES DE GAULLE,77760,BOISSY-AUX-CAILLES,,,77041,,,,,,,,,,,,,,,,,,,1991-09-01,F,,,,,78.01,NAP,N,2.508426,48.307996,0.93,housenumber,27 Rue Charles de Gaulle 77760 Boissy-aux-Cailles,77041_0020_00027,G,27 RUE CHARLES DE GAULLE,
378336630,00033,37833663000033,O,2013-10-01,,,,2020-02-21T04:12:55,false,2,,73,,RUE,VEZU,77760,BOISSY-AUX-CAILLES,,,77041,,,,,,,,,,,,,,,,,,,2019-12-31,F,,,,,28.12Z,NAFRev2,O,2.498853,48.31746,0.92,housenumber,73 Rue de Vezu 77760 Boissy-aux-Cailles,77041_0194_00073,G,73 RUE DE VEZU,
379056229,00014,37905622900014,O,1990-08-15,NN,,,2019-11-14T14:00:58,true,4,,6,,RUE,DES VIGNES,77760,BOISSY-AUX-CAILLES,,,77041,,,,,,,,,,,,,,,,,,,1994-12-25,F,,,,,74.4B,NAF1993,O,2.474195,48.304758,0.93,housenumber,6 Rue des Vignes 77760 Boissy-aux-Cailles,77041_0196_00006,G,6 RUE DES VIGNES,
379212095,00010,37921209500010,O,1990-09-04,,,,2019-11-14T14:00:58,true,3,,,,,MAIRIE,77760,BOISSY-AUX-CAILLES,,,77041,,,,,,,,,,,,,,,,,,,2008-01-01,A,,,,,01.61Z,NAFRev2,N,3.0709671,50.6304695,0.92,poi.townhall,Hôtel de Ville Lille,https://osm.org/way/40917078,G,,
379386568,00016,37938656800016,O,1900-01-01,NN,,,2019-11-14T14:00:58,false,3,,6,,RUE,DES VIGNES,77760,BOISSY-AUX-CAILLES,,,77041,,,,,,,,,,,,,,,,,,,1994-03-31,F,,,,,74.1E,NAF1993,N,2.474195,48.304758,0.93,housenumber,6 Rue des Vignes 77760 Boissy-aux-Cailles,77041_0196_00006,G,6 RUE DES VIGNES,
379432636,00023,37943263600023,O,2005-02-25,,,,2019-11-14T14:00:58,true,3,,69,,RUE,ST ANDRE,77760,BOISSY-AUX-CAILLES,,,77041,,,,,,,,,,,,,,,,,,,2008-01-01,F,,,,,43.39Z,NAFRev2,O,2.499687,48.318389,0.82,housenumber,69 Rue Saint-andré 77760 Boissy-aux-Cailles,77041_0120_00069,G,69 RUE SAINT ANDRE,
388588402,00015,38858840200015,O,,NN,,,2019-11-14T14:00:58,true,1,,,,CHE,DES OUCHES AU COUCHANT,77760,BOISSY-AUX-CAILLES,,,77041,,,,,,,,,,,,,,,,,,,1995-10-31,F,,,,,51.2G,NAF1993,N,2.507801,48.308442,0.76,street,Chemin des Ouches du Couchant 77760 Boissy-aux-Cailles,77041_0055,G,CHEMIN DES OUCHES DU COUCHANT,
389590241,00011,38959024100011,O,1900-01-01,NN,,,2019-11-14T14:00:58,false,3,,,,CHE,DES OUCHES AU COUCHANT,77760,BOISSY-AUX-CAILLES,,,77041,,,,,,,,,,,,,,,,,,,1993-01-25,F,,,,,51.2G,NAF1993,N,2.507801,48.308442,0.76,street,Chemin des Ouches du Couchant 77760 Boissy-aux-Cailles,77041_0055,G,CHEMIN DES OUCHES DU COUCHANT,
389590241,00029,38959024100029,O,2010-02-01,,,,2019-11-14T14:00:58,true,2,,31,,RUE,CHARLESDE GAULLE - MARLANVAL,77760,BOISSY-AUX-CAILLES,,,77041,,,,,,,,,,,,,,,,,,,2014-12-31,F,,,,,46.19B,NAFRev2,N,2.50886,48.308304,0.66,housenumber,31 Rue Charles de Gaulle 77760 Boissy-aux-Cailles,77041_0020_00031,G,31 RUE CHARLES DE GAULLE,
389590860,00018,38959086000018,O,,NN,,,2019-11-14T14:00:58,true,1,,,,CHE,DES OUCHES AU COUCHANT,77760,BOISSY-AUX-CAILLES,,,77041,,,,,,,,,,,,,,,,,,,1992-09-30,F,,,,,51.2G,NAF1993,N,2.507801,48.308442,0.76,street,Chemin des Ouches du Couchant 77760 Boissy-aux-Cailles,77041_0055,G,CHEMIN DES OUCHES DU COUCHANT,
390780567,00017,39078056700017,O,1900-01-01,NN,,,2019-11-14T14:00:58,true,7,,35,B,RUE,DU GENERAL DE GAULLE,77760,BOISSY-AUX-CAILLES,,,77041,,,,,,,,,,,,,,,,,,,2018-12-31,F,,,,HISTOIRES D'ORIENT,47.89Z,NAFRev2,N,-1.4851775,47.2097242,0.9,poi,Rue du Général de Gaulle (Pont) Saint-Sébastien-sur-Loire,https://osm.org/way/30833209,G,,
391245990,00026,39124599000026,O,2004-06-01,NN,,,2019-11-14T14:00:58,true,4,,82,,RUE,SAINT ANDRE,77760,BOISSY-AUX-CAILLES,,,77041,,,,,,,,,,,,,,,,,,,2008-10-31,F,,,,,55.10Z,NAFRev2,N,2.499856,48.319022,0.93,housenumber,82 Rue Saint-andré 77760 Boissy-aux-Cailles,77041_0120_00082,G,82 RUE SAINT ANDRE,
392546917,00023,39254691700023,O,2007-04-23,,,,2019-11-14T14:00:58,true,3,MAINBERVILLIERS,9,B,RUE,DE LA LIBERATION,77760,BOISSY-AUX-CAILLES,,,77041,,,,,,,,,,,,,,,,,,,2008-06-26,F,,,,,43.21A,NAFRev2,N,2.474595,48.305603,0.83,housenumber,9 bis Rue de la Liberation 77760 Boissy-aux-Cailles,77041_0080_00009_bis,G,9 BIS RUE DE LA LIBERATION,
394828727,00013,39482872700013,O,1994-04-25,NN,,,2019-11-14T14:00:58,true,4,MAINBERVILLIERS,16,,AV,DE LA LIBERATION,77760,BOISSY-AUX-CAILLES,,,77041,,,,,,,,,,,,,,,,,,,1995-12-25,F,,,,,55.3A,NAF1993,O,2.473653,48.305977,0.77,housenumber,16 Rue de la Liberation 77760 Boissy-aux-Cailles,77041_0080_00016,G,16 RUE DE LA LIBERATION,
402194724,00025,40219472400025,O,2014-09-20,,,,2019-11-14T14:00:58,false,2,HAMEAU DE MAINBERVILLIERS,7,,RUE,DES VIGNES,77760,BOISSY-AUX-CAILLES,,,77041,,,,,,,,,,,,,,,,,,,2016-11-19,F,,,,,64.20Z,NAFRev2,O,2.473417,48.304788,0.93,housenumber,7 Rue des Vignes 77760 Boissy-aux-Cailles,77041_0196_00007,G,7 RUE DES VIGNES,
402331102,00036,40233110200036,O,2007-12-20,,,,2020-10-14T03:38:56,false,2,,34,,RUE,CHARLES DE GAULLE,77760,BOISSY-AUX-CAILLES,,,77041,,,,,,,,,,,,,,,,,,,2014-12-05,F,,,,,46.19B,NAFRev2,N,2.508836,48.308624,0.93,housenumber,34 Rue Charles de Gaulle 77760 Boissy-aux-Cailles,77041_0020_00034,G,34 RUE CHARLES DE GAULLE,
405115262,00017,40511526200017,O,1960-01-01,NN,,,2019-11-14T14:00:58,true,1,,22,,RUE,CH DE GAULLE MARLAN,77760,BOISSY-AUX-CAILLES,,,77041,,,,,,,,,,,,,,,,,,,2000-12-31,F,,,,,01.1A,NAF1993,N,2.509135,48.307796,0.66,housenumber,22 Rue Charles de Gaulle 77760 Boissy-aux-Cailles,77041_0020_00022,G,22 RUE CHARLES DE GAULLE,
405115270,00010,40511527000010,O,1969-11-01,NN,,,2019-11-14T14:00:58,true,3,,,,,MARLANVAL,77760,BOISSY-AUX-CAILLES,,,77041,,,,,,,,,,,,,,,,,,,2005-09-01,F,,,,,01.1A,NAFRev1,N,2.506734,48.310044,0.93,street,Marlanval 77760 Boissy-aux-Cailles,77041_a3mesc,G,MARLANVAL,
405115288,00020,40511528800020,O,2014-06-01,,,,2020-12-18T08:45:28,true,1,,36,,RUE,DE LA LIBERATION,77760,BOISSY-AUX-CAILLES,,,77041,,,,,,,,,,,,,,,,,,,2014-06-01,A,,,,,70.22Z,NAFRev2,N,2.470523,48.306581,0.93,housenumber,36 Rue de la Liberation 77760 Boissy-aux-Cailles,77041_0080_00036,G,36 RUE DE LA LIBERATION,
405115288,00038,40511528800038,O,2020-09-30,,,,2021-02-23T11:29:24,false,1,MAINBERVILLIERS,34,,RUE,DE LA LIBERATION,77760,BOISSY-AUX-CAILLES,,,77041,,,,,,,,,,,,,,,,,,,2020-09-30,A,,,,BOUTEILLE ERICK,35.11Z,NAFRev2,N,2.471516,48.306314,0.93,housenumber,34 Rue de la Liberation 77760 Boissy-aux-Cailles,77041_0080_00034,G,34 RUE DE LA LIBERATION,
408339018,00017,40833901800017,O,1996-07-19,,,,2019-11-14T14:00:58,false,4,MARLANVAL,1,B,RUE,CHARLES DE GAULLE,77760,BOISSY-AUX-CAILLES,,,77041,,,,,,,,,,,,,,,,,,,2006-10-13,F,,,,,74.7Z,NAFRev1,O,2.508897,48.305408,0.84,housenumber,1 bis Rue Charles de Gaulle 77760 Boissy-aux-Cailles,77041_0020_00001_bis,G,1 BIS RUE CHARLES DE GAULLE,
408695336,00011,40869533600011,O,1981-12-01,NN,,,2021-02-23T11:30:51,true,3,MARLANVAL,33,,RUE,CHARLES DE GAULLE,77760,BOISSY-AUX-CAILLES,,,77041,,,,,,,,,,,,,,,,,,,2008-01-01,A,,,,,01.11Z,NAFRev2,N,2.508754,48.308454,0.93,housenumber,33 Rue Charles de Gaulle 77760 Boissy-aux-Cailles,77041_0020_00033,G,33 RUE CHARLES DE GAULLE,
410548432,00021,41054843200021,O,1997-06-01,NN,,,2019-11-14T14:00:58,false,4,MAINBERVILLIERS,15,,RUE,DE LA LIBERATION,77760,BOISSY-AUX-CAILLES,,,77041,,,,,,,,,,,,,,,,,,,1999-11-12,F,,,,,45.4L,NAF1993,O,2.473765,48.305456,0.93,housenumber,15 Rue de la Liberation 77760 Boissy-aux-Cailles,77041_0080_00015,G,15 RUE DE LA LIBERATION,
410548432,00039,41054843200039,O,2000-06-27,NN,,,2019-11-14T14:00:58,true,4,,,,CHE,DES OUCHES DU COUTANT,77760,BOISSY-AUX-CAILLES,,,77041,,,,,,,,,,,,,,,,,,,2002-07-15,F,,,,,45.4L,NAF1993,N,2.507801,48.308442,0.75,street,Chemin des Ouches du Couchant 77760 Boissy-aux-Cailles,77041_0055,G,CHEMIN DES OUCHES DU COUCHANT,
420950909,00028,42095090900028,O,2000-05-15,NN,,,2019-11-14T14:00:58,true,4,,38,,RUE,ST MARTIN,77760,BOISSY-AUX-CAILLES,,,77041,,,,,,,,,,,,,,,,,,,2018-05-24,F,,,,,64.20Z,NAFRev2,N,2.503378,48.319698,0.82,housenumber,38 Rue Saint-martin 77760 Boissy-aux-Cailles,77041_0140_00038,G,38 RUE SAINT MARTIN,
421469982,00019,42146998200019,O,1999-01-04,NN,,,2019-11-14T14:00:58,false,4,,11,,RUE,LIBERATION MAINBERVILLIE,77760,BOISSY-AUX-CAILLES,,,77041,,,,,,,,,,,,,,,,,,,2003-06-24,F,TRANSPORTS VAL'BRUN,,,,60.2L,NAFRev1,N,2.474251,48.30559,0.58,housenumber,11 Rue de la Liberation 77760 Boissy-aux-Cailles,77041_0080_00011,G,11 RUE DE LA LIBERATION,
421469982,00027,42146998200027,O,2003-06-24,NN,,,2019-11-14T14:00:58,false,4,MAINBERVILLIERS,15,,RUE,DE LA LIBERATION,77760,BOISSY-AUX-CAILLES,,,77041,,,,,,,,,,,,,,,,,,,2008-01-01,F,,,,,49.41B,NAFRev2,N,2.473765,48.305456,0.93,housenumber,15 Rue de la Liberation 77760 Boissy-aux-Cailles,77041_0080_00015,G,15 RUE DE LA LIBERATION,
422383356,00025,42238335600025,O,2018-11-08,,,,2021-02-23T11:43:59,true,1,,30,,RUE,DE LA LIBERTE,77760,BOISSY-AUX-CAILLES,,,77041,,,,,,,,,,,,,,,,,,,2018-11-08,A,,,,,71.12B,NAFRev2,N,2.472176,48.306024,0.8,housenumber,30 Rue de la Liberation 77760 Boissy-aux-Cailles,77041_0080_00030,G,30 RUE DE LA LIBERATION,
428549745,00019,42854974500019,O,1990-01-01,,,,2019-11-14T14:00:58,true,1,,,,,,77760,BOISSY-AUX-CAILLES,,,77041,,,,,,,,,,,,,,,,,,,1999-12-31,F,,,,,92.3A,NAF1993,N,,,0,,,,,,
432643682,00045,43264368200045,O,2018-10-15,,,4399DC,2019-11-14T14:00:58,true,2,,44,,RUE,DU PERE BARD,77760,BOISSY-AUX-CAILLES,,,77041,,,,,,,,,,,,,,,,,,,2019-06-01,F,,,,IAN DELCOURT CORDES ET RENOVATION,43.99D,NAFRev2,N,2.502112,48.31942,0.93,housenumber,44 Rue du Père Bard 77760 Boissy-aux-Cailles,77041_0090_00044,G,44 RUE DU PERE BARD,
437746076,00011,43774607600011,O,2001-01-01,NN,,,2021-02-23T13:17:58,true,3,MARLANVAL,22,,RUE,CHARLES DE GAULLE,77760,BOISSY-AUX-CAILLES,,,77041,,,,,,,,,,,,,,,,,,,2008-01-01,A,,,,,01.11Z,NAFRev2,N,2.509135,48.307796,0.93,housenumber,22 Rue Charles de Gaulle 77760 Boissy-aux-Cailles,77041_0020_00022,G,22 RUE CHARLES DE GAULLE,
439733718,00019,43973371800019,O,2001-11-01,NN,,,2019-11-14T14:00:58,true,3,HAMEAU DE MAINBERVILLIERS,25,,RUE,DE LA LIBERATION,77760,BOISSY-AUX-CAILLES,,,77041,,,,,,,,,,,,,,,,,,,2008-01-01,A,,,,,68.20B,NAFRev2,N,2.471242,48.305924,0.93,housenumber,25 Rue de la Liberation 77760 Boissy-aux-Cailles,77041_0080_00025,G,25 RUE DE LA LIBERATION,
440537470,00039,44053747000039,O,2014-11-07,,,4321AB,2021-02-23T13:21:43,true,1,MAINBERVILLIERS,5,,,RUE DE LA LIBERATION,77760,BOISSY-AUX-CAILLES,,,77041,,,,,,,,,,,,,,,,,,,2014-11-07,A,,,,MYL FACONS,43.21A,NAFRev2,N,2.4756,48.305828,0.93,housenumber,5 Rue de la Liberation 77760 Boissy-aux-Cailles,77041_0080_00005,G,5 RUE DE LA LIBERATION,
440677722,00017,44067772200017,O,2002-01-24,NN,,,2019-11-14T14:00:58,false,3,HAMEAU DE MAINBERVILLIERS,25,,RUE,DE LA LIBERATION,77760,BOISSY-AUX-CAILLES,,,77041,,,,,,,,,,,,,,,,,,,2002-12-25,F,,,,,00.0Z,NAF1993,N,2.471242,48.305924,0.93,housenumber,25 Rue de la Liberation 77760 Boissy-aux-Cailles,77041_0080_00025,G,25 RUE DE LA LIBERATION,
441559614,00017,44155961400017,O,1999-09-01,NN,,,2019-11-14T14:00:58,false,4,,35,B,RUE,GENERAL DE GAULLE,77760,BOISSY-AUX-CAILLES,,,77041,,,,,,,,,,,,,,,,,,,2002-07-04,F,,,,,91.3E,NAF1993,N,5.1047139,47.2783266,0.9,poi,Rue Général de Gaulle (Pont) Neuilly-lès-Dijon,https://osm.org/way/37832985,G,,
445245962,00029,44524596200029,O,2009-04-01,,,,2021-02-23T13:28:26,true,1,MARLANVAL,42,,RUE,DU GENERAL DE GAULLE,77760,BOISSY-AUX-CAILLES,,,77041,,,,,,,,,,,,,,,,,,,2009-04-01,A,,,,,18.13Z,NAFRev2,N,-1.4851775,47.2097242,0.9,poi,Rue du Général de Gaulle (Pont) Saint-Sébastien-sur-Loire,https://osm.org/way/30833209,G,,
447788969,00015,44778896900015,O,2003-01-15,,,,2019-11-14T14:00:58,true,3,,30,,RUE,DE LA LIBERATION,77760,BOISSY-AUX-CAILLES,,,77041,,,,,,,,,,,,,,,,,,,2006-09-26,F,,,,,01.4B,NAFRev1,O,2.472176,48.306024,0.93,housenumber,30 Rue de la Liberation 77760 Boissy-aux-Cailles,77041_0080_00030,G,30 RUE DE LA LIBERATION,
447865890,00027,44786589000027,O,2011-07-01,,,,2019-11-14T14:00:58,true,2,MARLANVAL,60,,RUE,CHARLES DE GAULLE,77760,BOISSY-AUX-CAILLES,,,77041,,,,,,,,,,,,,,,,,,,2014-12-31,F,,,,,01.49Z,NAFRev2,N,2.505658,48.311011,0.93,housenumber,60 Rue Charles de Gaulle 77760 Boissy-aux-Cailles,77041_0020_00060,G,60 RUE CHARLES DE GAULLE,
448303511,00035,44830351100035,O,2006-02-01,,,,2019-11-14T14:00:58,false,4,MAINBERVILLIERS,15,,RUE,DE LA LIBERATION,77760,BOISSY-AUX-CAILLES,,,77041,,,,,,,,,,,,,,,,,,,2012-09-01,F,ECO PIECES AUTO / EPA,,,,45.32Z,NAFRev2,N,2.473765,48.305456,0.93,housenumber,15 Rue de la Liberation 77760 Boissy-aux-Cailles,77041_0080_00015,G,15 RUE DE LA LIBERATION,
451751291,00019,45175129100019,O,2001-01-04,NN,,,2019-11-14T14:00:58,true,3,,,,,MAIRIE,77760,BOISSY-AUX-CAILLES,,,77041,,,,,,,,,,,,,,,,,,,2008-01-01,A,,,,,94.99Z,NAFRev2,N,3.0709671,50.6304695,0.92,poi.townhall,Hôtel de Ville Lille,https://osm.org/way/40917078,G,,
482050374,00016,48205037400016,O,2004-07-08,NN,,,2019-11-14T14:00:58,false,5,CHEZ M. JEROME PELISSIER,44,,RUE,DU PERE BARD,77760,BOISSY-AUX-CAILLES,,,77041,,,,,,,,,,,,,,,,,,,2009-12-18,F,,,,,94.99Z,NAFRev2,O,2.502112,48.31942,0.93,housenumber,44 Rue du Père Bard 77760 Boissy-aux-Cailles,77041_0090_00044,G,44 RUE DU PERE BARD,
484108154,00010,48410815400010,O,2005-09-01,,,,2019-11-14T14:00:58,true,3,MARLANVAL,38,,RUE,DU GENERAL DE GAULLE,77760,BOISSY-AUX-CAILLES,,,77041,,,,,,,,,,,,,,,,,,,2014-05-31,F,,,,,01.11Z,NAFRev2,N,-1.4851775,47.2097242,0.9,poi,Rue du Général de Gaulle (Pont) Saint-Sébastien-sur-Loire,https://osm.org/way/30833209,G,,
489581959,00017,48958195900017,O,2005-11-10,NN,,,2019-11-14T14:00:58,false,4,,44,,RUE,DU PERE - BARD,77760,BOISSY-AUX-CAILLES,,,77041,,,,,,,,,,,,,,,,,,,2013-07-01,F,,,,,90.01Z,NAFRev2,O,2.502112,48.31942,0.93,housenumber,44 Rue du Père Bard 77760 Boissy-aux-Cailles,77041_0090_00044,G,44 RUE DU PERE BARD,