siren,nic,siret,statutDiffusionEtablissement,dateCreationEtablissement,trancheEffectifsEtablissement,anneeEffectifsEtablissement,activitePrincipaleRegistreMetiersEtablissement,dateDernierTraitementEtablissement,etablissementSiege,nombrePeriodesEtablissement,complementAdresseEtablissement,numeroVoieEtablissement,indiceRepetitionEtablissement,typeVoieEtablissement,libelleVoieEtablissement,codePostalEtablissement,libelleCommuneEtablissement,libelleCommuneEtrangerEtablissement,distributionSpecialeEtablissement,codeCommuneEtablissement,codeCedexEtablissement,libelleCedexEtablissement,codePaysEtrangerEtablissement,libellePaysEtrangerEtablissement,complementAdresse2Etablissement,numeroVoie2Etablissement,indiceRepetition2Etablissement,typeVoie2Etablissement,libelleVoie2Etablissement,codePostal2Etablissement,libelleCommune2Etablissement,libelleCommuneEtranger2Etablissement,distributionSpeciale2Etablissement,codeCommune2Etablissement,codeCedex2Etablissement,libelleCedex2Etablissement,codePaysEtranger2Etablissement,libellePaysEtranger2Etablissement,dateDebut,etatAdministratifEtablissement,enseigne1Etablissement,enseigne2Etablissement,enseigne3Etablissement,denominationUsuelleEtablissement,activitePrincipaleEtablissement,nomenclatureActivitePrincipaleEtablissement,caractereEmployeurEtablissement,longitude,latitude,geo_score,geo_type,geo_adresse,geo_id,geo_ligne,geo_l4,geo_l5
038837373,00018,03883737300018,O,1995-12-25,01,2018,,2020-08-25T10:10:56,true,2,S LE BEL REP PAR,15,,RUE,DE LA MAIRIE,95560,MAFFLIERS,,,95353,,,,,,,,,,,,,,,,,,,2008-01-01,A,,,,,81.10Z,NAFRev2,O,2.306611,49.077914,0.94,housenumber,15 Rue de la Mairie 95560 Maffliers,95353_0160_00015,G,15 RUE DE LA MAIRIE,
219503539,00013,21950353900013,O,1983-03-01,11,2018,,2020-08-25T10:19:48,true,4,,,,RUE,DE PARIS,95560,MAFFLIERS,,,95353,,,,,,,,,,,,,,,,,,,2008-01-01,A,MAIRIE,,,,84.11Z,NAFRev2,O,2.307769,49.077086,0.94,street,Rue de Paris 95560 Maffliers,95353_0240,G,RUE DE PARIS,
219503539,00039,21950353900039,O,1983-12-21,11,2018,,2020-08-25T10:19:48,false,3,,15,,RUE,DES PRES,95560,MAFFLIERS,,,95353,,,,,,,,,,,,,,,,,,,2008-01-01,A,ECOLE ELEMENTAIRE PUBLIQUE LE CEDRE,,,,85.20Z,NAFRev2,N,2.311404,49.077674,0.94,housenumber,15 Rue des Pres 95560 Maffliers,95353_0300_00015,G,15 RUE DES PRES,
219503539,00047,21950353900047,O,2000-12-25,NN,,,2008-01-04T18:45:55,false,2,MAIRIE,,,RUE,DE PARIS,95560,MAFFLIERS,,,95353,,,,,,,,,,,,,,,,,,,2008-01-01,A,SERVICE ASSAINISSEMENT,,,,37.00Z,NAFRev2,N,2.307769,49.077086,0.94,street,Rue de Paris 95560 Maffliers,95353_0240,G,RUE DE PARIS,
269500724,00019,26950072400019,O,1983-03-01,NN,,,2010-06-26T03:18:00,true,3,,,,,,95560,MAFFLIERS,,,95353,,,,,,,,,,,,,,,,,,,2008-01-01,A,CCAS,,,,88.99B,NAFRev2,N,,,0,,,,,,
269504668,00014,26950466800014,O,1995-12-25,,,,2010-06-26T03:18:05,true,2,,,,,,95560,MAFFLIERS,,,95353,,,,,,,,,,,,,,,,,,,2008-01-01,A,CDE,,,,88.99B,NAFRev2,N,,,0,,,,,,
301160750,00479,30116075000479,O,2007-03-01,NN,,,2013-05-18T02:24:41,false,2,1/3,1,,RUE,DE RICHEBOURG,95560,MAFFLIERS,,,95353,,,,,,,,,,,,,,,,,,,2011-06-01,F,MANOIR NOTRE DAME,,,,86.10Z,NAFRev2,O,2.307997,49.076265,0.94,housenumber,1 Rue de Richebourg 95560 Maffliers,95353_0340_00001,G,1 RUE DE RICHEBOURG,
302655303,00022,30265530300022,O,,,,,,true,1,,,,,MANOIR DE DELPHINIERE BP N,95560,MAFFLIERS,,,95353,,,,,,,,,,,,,,,,,,,1984-12-25,F,,,,,77.01,NAP,N,,,0,,,,,,
303729347,00011,30372934700011,O,,,,,,true,1,,,,,ROUTE NATIONALE 1,95560,MAFFLIERS,,,95353,,,,,,,,,,,,,,,,,,,1993-10-01,F,,,,,52.2E,NAF1993,N,2.318556,49.078389,0.94,street,Route Nationale 1 95560 Maffliers,95353_0341,G,ROUTE NATIONALE 1,
304090400,00017,30409040000017,O,1976-01-01,NN,,,2008-01-04T19:28:27,true,5,,28,,RTE,NATIONALE,95560,MAFFLIERS,,,95353,,,,,,,,,,,,,,,,,,,2008-01-01,A,,,,,68.20B,NAFRev2,N,2.321783,49.07491,0.83,housenumber,28 Route Nationale 1 95560 Maffliers,95353_0341_00028,G,28 ROUTE NATIONALE 1,
304234925,00028,30423492500028,O,1900-01-01,NN,,,2014-02-13T11:12:46,false,5,,1,,RUE,RICHEBOURG,95560,MAFFLIERS,,,95353,,,,,,,,,,,,,,,,,,,2012-11-28,F,,,,,86.10Z,NAFRev2,O,2.307997,49.076265,0.93,housenumber,1 Rue de Richebourg 95560 Maffliers,95353_0340_00001,G,1 RUE DE RICHEBOURG,
304308703,00038,30430870300038,O,1985-08-28,NN,,,2010-08-20T09:17:52,false,4,,2,,RUE,DE LA FERME,95560,MAFFLIERS,,,95353,,,,,,11,,RUE,DE NERVILLE,95560,MAFFLIERS,,,95353,,,,,2004-12-31,F,,,,,29.2F,NAFRev1,O,2.30654,49.07654,0.94,housenumber,2 Rue de la Ferme 95560 Maffliers,95353_0078_00002,G,2 RUE DE LA FERME,
305897100,00015,30589710000015,O,1976-01-01,NN,,,,true,1,,6,,RUE,008 DU VERGER,95560,MAFFLIERS,,,95353,,,,,,,,,,,,,,,,,,,2000-11-24,F,,,,,45.4J,NAF1993,O,2.312902,49.077684,0.74,housenumber,6 Rue du Verger 95560 Maffliers,95353_0375_00006,G,6 RUE DU VERGER,
305908246,00039,30590824600039,O,,,,,,true,1,,18,,RUE,DES SAULES,95560,MAFFLIERS,,,95353,,,,,,,,,,,,,,,,,,,1985-12-25,F,,,,,87.08,NAP,N,2.314515,49.081073,0.94,housenumber,18 Rue des Saules 95560 Maffliers,95353_0367_00018,G,18 RUE DES SAULES,
306327453,00016,30632745300016,O,1976-01-01,NN,,,,true,1,,1,,RUE,DE LA FERME,95560,MAFFLIERS,,,95353,,,,,,,,,,,,,,,,,,,2001-11-01,F,,,,,36.1K,NAF1993,N,2.306742,49.076478,0.94,housenumber,1 Rue de la Ferme 95560 Maffliers,95353_0078_00001,G,1 RUE DE LA FERME,
307923516,00024,30792351600024,O,,NN,,,,true,1,,1,,RTE,DE PRESLES,95560,MAFFLIERS,,,95353,,,,,,,,,,,,,,,,,,,1990-12-25,F,,,,,67.01,NAP,N,2.313083,49.095828,0.71,locality,Route de Presles l'Hermitage 95560 Maffliers,95353_0302,G,ROUTE DE PRESLES L HERMITAGE,
307923524,00010,30792352400010,O,,NN,,,,true,1,,1,,RUE,DE BEAUMONT,95560,MAFFLIERS,,,95353,,,,,,,,,,,,,,,,,,,1993-03-14,F,,,,,55.71,NAP,N,2.307353,49.077967,0.94,housenumber,1 Rue de Beaumont 95560 Maffliers,95353_0020_00001,G,1 RUE DE BEAUMONT,
309355436,00028,30935543600028,O,1985-05-01,NN,,4776ZP,2016-05-13T19:37:57,true,4,,1,,RUE,DE LA MAIRIE,95560,MAFFLIERS,,,95353,,,,,,,,,,,,,,,,,,,2015-06-01,F,,,,,47.89Z,NAFRev2,N,2.306663,49.076987,0.94,housenumber,1 Rue de la Mairie 95560 Maffliers,95353_0160_00001,G,1 RUE DE LA MAIRIE,
310825476,00032,31082547600032,O,,NN,,,,true,1,,17,,RTE,NATIONALE 1,95560,MAFFLIERS,,,95353,,,,,,,,,,,,,,,,,,,1993-05-23,F,,,,,52.4L,NAF1993,N,2.314254,49.083517,0.85,housenumber,17 Route Nationale 1 95560 Maffliers,95353_0341_00017,G,17 ROUTE NATIONALE 1,
311402382,00015,31140238200015,O,,,,,,true,1,,13,B,RTE,NATIONALE 1,95560,MAFFLIERS,,,95353,,,,,,,,,,,,,,,,,,,1984-12-25,F,,,,,65.02,NAP,N,2.314903,49.081911,0.72,housenumber,13 bis Route Nationale 1 95560 Maffliers,95353_0341_00013_bis,G,13 BIS ROUTE NATIONALE 1,
313015497,00032,31301549700032,O,1989-06-15,NN,,,,true,1,,12,,RTE,NATIONALE 1,95560,MAFFLIERS,,,95353,,,,,,,,,,,,,,,,,,,1998-12-22,F,,,,,74.4B,NAF1993,O,2.322948,49.073505,0.85,housenumber,12 Route Nationale 1 95560 Maffliers,95353_0341_00012,G,12 ROUTE NATIONALE 1,
313155103,00028,31315510300028,O,,NN,,,,true,1,,1,,RUE,FOND DU BASSIN,95560,MAFFLIERS,,,95353,,,,,,,,,,,,,,,,,,,1990-01-27,F,,,,,81.11,NAP,N,2.319047,49.079145,0.9,housenumber,1 Rue du Fond du Bassin 95560 Maffliers,95353_6zjb5j_00001,G,1 RUE DU FOND DU BASSIN,
313446205,00061,31344620500061,O,2013-04-01,,,,2020-12-02T09:01:14,false,2,,,,RUE,DE NERVILLE,95560,MAFFLIERS,,,95353,,,,,,,,,,,,,,,,,,,2020-09-30,F,,,,,01.62Z,NAFRev2,N,2.307405,49.076882,0.94,street,Rue de Nerville 95560 Maffliers,95353_0220,G,RUE DE NERVILLE,
313733974,00015,31373397400015,O,1963-01-01,NN,,,,true,1,,,,RUE,BOIS CARREAU,95560,MAFFLIERS,,,95353,,,,,,,,,,,,,,,,,,,1999-03-31,F,,,,,45.4C,NAF1993,O,2.307205,49.078101,0.88,street,Rue du Bois Carreau 95560 Maffliers,95353_0040,G,RUE DU BOIS CARREAU,
313971426,00017,31397142600017,O,1978-01-01,,,,2006-10-27T00:40:27,true,3,,,,RUE,DE LA FERME,95560,MAFFLIERS,,,95353,,,,,,,,,,,,,,,,,,,2004-01-14,F,,,,,01.1A,NAFRev1,N,2.306742,49.076478,0.94,street,Rue de la Ferme 95560 Maffliers,95353_0078,G,RUE DE LA FERME,
314634023,00035,31463402300035,O,1991-12-23,NN,,,,true,1,,12,,RTE,NATIONALE,95560,MAFFLIERS,,,95353,,,,,,,,,,,,,,,,,,,2000-10-01,F,,,,,74.3B,NAF1993,O,2.322948,49.073505,0.83,housenumber,12 Route Nationale 1 95560 Maffliers,95353_0341_00012,G,12 ROUTE NATIONALE 1,
315200089,00011,31520008900011,O,,NN,,,,true,1,,8,,RUE,DE LA MAIRIE,95560,MAFFLIERS,,,95353,,,,,,,,,,,,,,,,,,,1988-12-25,F,,,,,51.20,NAP,N,2.30682,49.077258,0.94,housenumber,8 Rue de la Mairie 95560 Maffliers,95353_0160_00008,G,8 RUE DE LA MAIRIE,
315226340,00034,31522634000034,O,2002-03-20,,,,2008-11-07T00:30:37,false,3,,27,,,RN1,95560,MAFFLIERS,,,95353,,,,,,,,,,,,,,,,,,,2003-12-31,F,RELAIS DE BELLOY EURAUTOS 4X4,,,,50.1Z,NAFRev1,O,2.31311,49.084828,0.52,housenumber,27 Route Nationale 1 95560 Maffliers,95353_0341_00027,G,27 ROUTE NATIONALE 1,
317914224,00017,31791422400017,O,1900-01-01,NN,,,,true,4,,10,,RUE,DE BEAUMONT,95560,MAFFLIERS,,,95353,,,,,,,,,,,,,,,,,,,1994-12-31,F,,,,,52.6D,NAF1993,N,2.307797,49.07804,0.94,housenumber,10 Rue de Beaumont 95560 Maffliers,95353_0020_00010,G,10 RUE DE BEAUMONT,
318959426,00012,31895942600012,O,,,,,,true,1,,,,RTE,NATIONALE,95560,MAFFLIERS,,,95353,,,,,,,,,,,,,,,,,,,1985-12-25,F,,,,,67.08,NAP,N,2.318556,49.078389,0.81,street,Route Nationale 1 95560 Maffliers,95353_0341,G,ROUTE NATIONALE 1,
319173787,00031,31917378700031,O,,,,,,true,1,,7,,RUE,DE LA FERME,95560,MAFFLIERS,,,95353,,,,,,,,,,,,,,,,,,,1997-09-30,F,,,,,52.6E,NAF1993,N,2.306962,49.07619,0.94,housenumber,7 Rue de la Ferme 95560 Maffliers,95353_0078_00007,G,7 RUE DE LA FERME,
320798697,00019,32079869700019,O,1981-01-02,01,2018,,2020-08-25T10:28:54,true,3,,,,RTE,NATIONALE 1,95560,MAFFLIERS,,,95353,,,,,,,,,,,,,,,,,,,2008-01-01,A,,,,,01.11Z,NAFRev2,N,2.318556,49.078389,0.83,street,Route Nationale 1 95560 Maffliers,95353_0341,G,ROUTE NATIONALE 1,
321406308,00015,32140630800015,O,,NN,,,,true,1,,4,,RUE,DE LA MAIRIE,95560,MAFFLIERS,,,95353,,,,,,,,,,,,,,,,,,,1996-10-02,F,,,,,45.3E,NAF1993,N,2.307053,49.077071,0.94,housenumber,4 Rue de la Mairie 95560 Maffliers,95353_0160_00004,G,4 RUE DE LA MAIRIE,
321590655,00023,32159065500023,O,1987-03-21,NN,,,2008-11-07T00:37:51,true,4,,1,,RUE,DES RES,95560,MAFFLIERS,,,95353,,,,,,,,,,,,,,,,,,,2004-12-31,F,,,,,45.3A,NAFRev1,O,2.310113,49.077641,0.8,housenumber,1 Rue des Pres 95560 Maffliers,95353_0300_00001,G,1 RUE DES PRES,
323264507,00019,32326450700019,O,,NN,,,,true,1,,6,,RUE,DE LA MAIRIE,95560,MAFFLIERS,,,95353,,,,,,,,,,,,,,,,,,,1993-12-31,F,,,,,74.1A,NAF1993,N,2.306938,49.077138,0.94,housenumber,6 Rue de la Mairie 95560 Maffliers,95353_0160_00006,G,6 RUE DE LA MAIRIE,
323762427,00017,32376242700017,O,,,,,,true,1,,13,B,RTE,RN 1,95560,MAFFLIERS,,,95353,,,,,,,,,,,,,,,,,,,1987-01-01,F,,,,,50.1Z,NAF1993,N,2.314903,49.081911,0.32,housenumber,13 bis Route Nationale 1 95560 Maffliers,95353_0341_00013_bis,G,13 BIS ROUTE NATIONALE 1,
324085133,00019,32408513300019,O,1981-10-01,NN,,,2008-01-04T18:53:12,true,3,ECOLE PUBLIQUE,,,RUE,DES PRES,95560,MAFFLIERS,,,95353,,,,,,,,,,,,,,,,,,,2008-01-01,A,,,,,93.12Z,NAFRev2,N,2.310113,49.077641,0.94,street,Rue des Pres 95560 Maffliers,95353_0300,G,RUE DES PRES,
324164235,00016,32416423500016,O,,NN,,,,true,1,,7,,RUE,DE LA FERME,95560,MAFFLIERS,,,95353,,,,,,,,,,,,,,,,,,,1988-10-23,F,,,,,64.11,NAP,N,2.306962,49.07619,0.94,housenumber,7 Rue de la Ferme 95560 Maffliers,95353_0078_00007,G,7 RUE DE LA FERME,
326136835,00039,32613683500039,O,,NN,,,,true,1,,2,,RUE,DE LA FERME,95560,MAFFLIERS,,,95353,,,,,,,,,,,,,,,,,,,1994-12-12,F,,,,,74.1J,NAF1993,N,2.30654,49.07654,0.94,housenumber,2 Rue de la Ferme 95560 Maffliers,95353_0078_00002,G,2 RUE DE LA FERME,
326393808,00018,32639380800018,O,,,,,,true,1,,16,,RUE,DE BEAUMONT,95560,MAFFLIERS,,,95353,,,,,,,,,,,,,,,,,,,1985-12-25,F,,,,,62.41,NAP,N,2.308807,49.078235,0.94,housenumber,16 Rue de Beaumont 95560 Maffliers,95353_0020_00016,G,16 RUE DE BEAUMONT,
326444213,00028,32644421300028,O,1900-01-01,,,,2011-04-28T00:22:41,false,4,,43,,RUE,DE PARIS,95560,MAFFLIERS,,,95353,,,,,,,,,,,,,,,,,,,1991-12-25,F,,,,,74.08,NAP,N,2.317155,49.079296,0.94,housenumber,43 Rue de Paris 95560 Maffliers,95353_0240_00043,G,43 RUE DE PARIS,
327746350,00054,32774635000054,O,2009-11-16,NN,,,2015-05-14T06:05:30,true,2,,4,,RUE,DE BRUXELLES,95560,MAFFLIERS,,,95353,,,,,,,,,,,,,,,,,,,2013-12-16,F,,,,,46.65Z,NAFRev2,O,2.309083,49.078987,0.94,housenumber,4 Rue de Bruxelles 95560 Maffliers,95353_0060_00004,G,4 RUE DE BRUXELLES,
327948782,00013,32794878200013,O,1983-06-18,NN,,,,false,3,,22,,RUE,DE RICHEBOURG,95560,MAFFLIERS,,,95353,,,,,,,,,,,,,,,,,,,1992-01-27,F,,,,,70.2C,NAF1993,N,2.309567,49.073329,0.94,housenumber,22 Rue de Richebourg 95560 Maffliers,95353_0340_00022,G,22 RUE DE RICHEBOURG,
328140710,00018,32814071000018,O,1983-08-01,NN,,,,true,4,,13,,RTE,NATIONALE 1,95560,MAFFLIERS,,,95353,,,,,,,,,,,,,,,,,,,1992-12-30,F,,,,,50.5Z,NAF1993,N,2.314963,49.082678,0.85,housenumber,13 Route Nationale 1 95560 Maffliers,95353_0341_00013,G,13 ROUTE NATIONALE 1,
328249867,00024,32824986700024,O,1997-03-17,,,,2011-04-28T00:23:57,false,3,,7,,RUE,DE LA MAIRIE,95560,MAFFLIERS,,,95353,,,,,,,,,,,,,,,,,,,2000-12-31,F,,,,,60.2L,NAF1993,N,2.306402,49.077303,0.94,housenumber,7 Rue de la Mairie 95560 Maffliers,95353_0160_00007,G,7 RUE DE LA MAIRIE,
328282371,00074,32828237100074,O,2018-12-01,,,,2021-02-23T10:49:32,true,1,,1,,CHE,DU FOND DU BASSIN,95560,MAFFLIERS,,,95353,,,,,,,,,,,,,,,,,,,2018-12-01,A,,,,MIROIR PHOTO,53.20Z,NAFRev2,N,2.319047,49.079145,0.78,housenumber,1 Rue du Fond du Bassin 95560 Maffliers,95353_6zjb5j_00001,G,1 RUE DU FOND DU BASSIN,
328776307,00022,32877630700022,O,1900-01-01,NN,,,2014-11-24T09:50:27,false,3,,1,,RTE,NATIONALE,95560,MAFFLIERS,,,95353,,,,,,,,,,,,,,,,,,,1990-12-25,F,,,,,67.08,NAP,N,2.318556,49.078389,0.83,housenumber,1 Route Nationale 1 95560 Maffliers,95353_0341_00001,G,1 ROUTE NATIONALE 1,
329480883,00068,32948088300068,O,1993-05-01,,,,2006-11-25T10:10:59,false,4,,6,,,RN1,95560,MAFFLIERS,,,95353,,,,,,,,,,,,,,,,,,,2004-02-03,F,ANNE MARIE BEAUTE,,,,74.1J,NAFRev1,N,2.323232,49.073182,0.44,housenumber,6 Route Nationale 1 95560 Maffliers,95353_0341_00006,G,6 ROUTE NATIONALE 1,
330123514,00045,33012351400045,O,2000-01-01,01,2018,,2021-02-23T10:50:42,true,3,,6,,RTE,NATIONALE 1,95560,MAFFLIERS,,,95353,,,,,,,,,,,,,,,,,,,2008-01-01,A,,,,,47.81Z,NAFRev2,O,2.323232,49.073182,0.84,housenumber,6 Route Nationale 1 95560 Maffliers,95353_0341_00006,G,6 ROUTE NATIONALE 1,
331270397,00010,33127039700010,O,,NN,,,,true,1,,43,,RUE,DE PARIS,95560,MAFFLIERS,,,95353,,,,,,,,,,,,,,,,,,,1987-01-01,F,,,,,72.5Z,NAF1993,N,2.317155,49.079296,0.94,housenumber,43 Rue de Paris 95560 Maffliers,95353_0240_00043,G,43 RUE DE PARIS,
332028133,00038,33202813300038,O,1992-02-01,NN,,,2019-07-19T03:55:43,true,4,,16,B,RTE,NATIONALE 1,95560,MAFFLIERS,,,95353,,,,,,,,,,,,,,,,,,,2017-12-31,F,,,,,68.20B,NAFRev2,N,2.322502,49.07402,0.72,housenumber,16 bis Route Nationale 1 95560 Maffliers,95353_0341_00016_bis,G,16 BIS ROUTE NATIONALE 1,
332028133,00046,33202813300046,O,2015-04-01,,,,2019-07-17T10:08:14,false,2,,16,B,RTE,NATIONALE 1,95560,MAFFLIERS,,,95353,,,,,,,,,,,,,,,,,,,2017-12-31,F,,,,,77.40Z,NAFRev2,N,2.322502,49.07402,0.72,housenumber,16 bis Route Nationale 1 95560 Maffliers,95353_0341_00016_bis,G,16 BIS ROUTE NATIONALE 1,
332046275,00027,33204627500027,O,2017-09-11,,,,2018-12-06T15:36:40,true,2,,6,,RUE,PERE GORIOT,95560,MAFFLIERS,,,95353,,,,,,,,,,,,,,,,,,,2018-10-26,F,,,,,43.39Z,NAFRev2,N,2.312256,49.077635,0.89,housenumber,6 Rue du Père Goriot 95560 Maffliers,95353_0271_00006,G,6 RUE DU PERE GORIOT,
332361997,00015,33236199700015,O,1985-05-01,NN,,,2008-04-05T00:34:37,true,3,,15,,RUE,DE LA MAIRIE,95560,MAFFLIERS,,,95353,,,,,,,,,,,,,,,,,,,2008-01-01,A,,,,,68.20B,NAFRev2,N,2.306611,49.077914,0.94,housenumber,15 Rue de la Mairie 95560 Maffliers,95353_0160_00015,G,15 RUE DE LA MAIRIE,
333631653,00016,33363165300016,O,,NN,,,,true,1,,11,,RUE,DE BEAUMONT,95560,MAFFLIERS,,,95353,,,,,,,,,,,,,,,,,,,1987-09-28,F,,,,,64.43,NAP,N,2.309089,49.078395,0.94,housenumber,11 Rue de Beaumont 95560 Maffliers,95353_0020_00011,G,11 RUE DE BEAUMONT,
333825024,00016,33382502400016,O,,,,,,true,1,,15,,RUE,DE LA MAIRIE,95560,MAFFLIERS,,,95353,,,,,,,,,,,,,,,,,,,1990-12-21,F,,,,,55.60,NAP,N,2.306611,49.077914,0.94,housenumber,15 Rue de la Mairie 95560 Maffliers,95353_0160_00015,G,15 RUE DE LA MAIRIE,
334294642,00023,33429464200023,O,1991-07-09,NN,,,2006-12-12T16:32:21,true,3,,,,,DOMAINE DE MONTBRUN,95560,MAFFLIERS,,,95353,,,,,,,,,,,,,,,,,,,2006-03-02,F,,,,,92.3A,NAFRev1,N,5.0707754,44.2388623,0.79,poi.steps,Montée de la Tour de Montbrun (Escalier) Vaison-la-Romaine,https://osm.org/way/40112544,G,,
334415031,00023,33441503100023,O,1994-10-01,NN,,,,true,1,,6,,RUE,DE LA FERME,95560,MAFFLIERS,,,95353,,,,,,,,,,,,,,,,,,,2001-07-06,F,,,,,51.4S,NAF1993,O,2.306879,49.076043,0.94,housenumber,6 Rue de la Ferme 95560 Maffliers,95353_0078_00006,G,6 RUE DE LA FERME,
334988516,00020,33498851600020,O,2009-01-14,,,,2010-04-14T11:21:56,false,2,,16,,RUE,DE NERVILLE,95560,MAFFLIERS,,,95353,,,,,,,,,,,,,,,,,,,2010-04-13,F,,,,,46.19B,NAFRev2,N,2.305501,49.076557,0.94,housenumber,16 Rue de Nerville 95560 Maffliers,95353_0220_00016,G,16 RUE DE NERVILLE,
338709090,00033,33870909000033,O,2007-09-20,03,2018,4399CZ,2021-02-23T10:55:10,true,3,,15,,RUE,DE LA MAIRIE,95560,MAFFLIERS,,,95353,,,,,,,,,,,,,,,,,,,2009-11-09,A,,,,,41.20A,NAFRev2,O,2.306611,49.077914,0.94,housenumber,15 Rue de la Mairie 95560 Maffliers,95353_0160_00015,G,15 RUE DE LA MAIRIE,
338944572,00027,33894457200027,O,2003-07-18,NN,,,2006-12-15T00:29:03,false,3,,13,,RUE,DE LA MAIRIE,95560,MAFFLIERS,,,95353,,,,,,,,,,,,,,,,,,,2004-09-30,F,,,,,74.1G,NAFRev1,N,2.30629,49.077663,0.94,housenumber,13 Rue de la Mairie 95560 Maffliers,95353_0160_00013,G,13 RUE DE LA MAIRIE,
339691693,00016,33969169300016,O,1986-12-03,,,,2006-12-12T16:34:21,true,4,,,,PL,TALLEYRAND,95560,MAFFLIERS,,,95353,,,,,,,,,,,,,,,,,,,2006-03-02,F,,,,,72.3Z,NAFRev1,N,4.0296679,49.2547514,0.71,poi.pharmacy,Pharmacie Talleyrand Reims,https://osm.org/node/5159373104,G,,
339691966,00016,33969196600016,O,,,,,,true,1,,,,PL,TALLEYRAND,95560,MAFFLIERS,,,95353,,,,,,,,,,,,,,,,,,,1988-06-24,F,,,,,80.02,NAP,N,4.0296679,49.2547514,0.71,poi.pharmacy,Pharmacie Talleyrand Reims,https://osm.org/node/5159373104,G,,
339999252,00036,33999925200036,O,1992-07-24,NN,,,2008-11-07T00:59:54,true,3,,43,,RUE,DE PARIS,95560,MAFFLIERS,,,95353,,,,,,,,,,,,,,,,,,,2007-03-31,F,,,,,01.4B,NAFRev1,N,2.317155,49.079296,0.94,housenumber,43 Rue de Paris 95560 Maffliers,95353_0240_00043,G,43 RUE DE PARIS,
340018852,01168,34001885201168,O,1992-10-01,NN,,,,false,4,,13,B,RTE,NATIONALE 1,95560,MAFFLIERS,,,95353,,,,,,,,,,,,,,,,,,,1999-06-21,F,STATION BP RELAIS DE MAFFLIERS,,,,50.5Z,NAF1993,O,2.314903,49.081911,0.72,housenumber,13 bis Route Nationale 1 95560 Maffliers,95353_0341_00013_bis,G,13 BIS ROUTE NATIONALE 1,
340519990,00014,34051999000014,O,1987-01-01,NN,,,,false,3,,,,PL,TALLEYRAND,95560,MAFFLIERS,,,95353,,,,,,,,,,,,,,,,,,,1995-04-01,F,,,,,52.6D,NAF1993,O,4.0296679,49.2547514,0.71,poi.pharmacy,Pharmacie Talleyrand Reims,https://osm.org/node/5159373104,G,,
340568930,00010,34056893000010,O,1987-01-01,,,,,true,1,,13,B,RTE,NATIONALE 1,95560,MAFFLIERS,,,95353,,,,,,,,,,,,,,,,,,,1991-07-22,F,,,,,52.4W,NAF1993,N,2.314903,49.081911,0.72,housenumber,13 bis Route Nationale 1 95560 Maffliers,95353_0341_00013_bis,G,13 BIS ROUTE NATIONALE 1,
341037620,00034,34103762000034,O,1989-09-01,NN,,,,true,1,,17,,RUE,DE PARIS,95560,MAFFLIERS,,,95353,,,,,,,,,,,,,,,,,,,2002-12-31,F,,,,,45.3E,NAF1993,N,2.313675,49.078627,0.94,housenumber,17 Rue de Paris 95560 Maffliers,95353_0240_00017,G,17 RUE DE PARIS,
341118008,00034,34111800800034,O,1992-01-18,NN,,,,true,4,,27,,RTE,NATIONALE N 1,95560,MAFFLIERS,,,95353,,,,,,,,,,,,,,,,,,,1995-12-25,F,,,,,45.3A,NAF1993,O,2.31311,49.084828,0.75,housenumber,27 Route Nationale 1 95560 Maffliers,95353_0341_00027,G,27 ROUTE NATIONALE 1,
341751469,00022,34175146900022,O,1990-09-24,NN,,,2008-11-07T01:02:31,false,3,,64,B,RTE,NATIONALE,95560,MAFFLIERS,,,95353,,,,,,,,,,,,,,,,,,,1995-12-31,F,,,,,45.4C,NAF1993,N,1.2279812,49.230352,0.77,poi,Route Nationale (Pont) Saint-Pierre-du-Vauvray,https://osm.org/way/95838375,G,,
342424538,00011,34242453800011,O,,NN,,,,true,1,,6,B,RUE,DE PARIS,95560,MAFFLIERS,,,95353,,,,,,,,,,,,,,,,,,,1993-09-21,F,,,,,60.2E,NAF1993,N,2.310604,49.077857,0.79,housenumber,6 bis Rue de Paris 95560 Maffliers,95353_0240_00006_bis,G,6 BIS RUE DE PARIS,
342763893,00019,34276389300019,O,1987-09-15,NN,,,2017-04-14T04:09:31,true,4,,16,,RTE,NATIONALE,95560,MAFFLIERS,,,95353,,,,,,,,,,,,,,,,,,,2008-01-01,A,,,,,68.20B,NAFRev2,O,2.322711,49.073791,0.83,housenumber,16 Route Nationale 1 95560 Maffliers,95353_0341_00016,G,16 ROUTE NATIONALE 1,
343214979,00027,34321497900027,O,1998-08-01,02,2018,7120AZ,2020-08-25T10:41:08,true,3,ZAC DES COUTURELLES,4,,ALL,DE CALAIS,95560,MAFFLIERS,,,95353,,,,,,,,,,,,,,,,,,,2008-01-01,A,,,,,71.12B,NAFRev2,O,2.316428,49.080391,0.83,housenumber,4 Allee de Calais 95560 Maffliers,95353_0062_00004,G,4 ALLEE DE CALAIS,
343441283,00029,34344128300029,O,2010-11-08,,,,2012-11-09T00:37:04,true,2,,3,,RUE,DES LILAS,95560,MAFFLIERS,,,95353,,,,,,,,,,,,,,,,,,,2012-05-15,F,,,,,71.11Z,NAFRev2,N,2.310389,49.078109,0.94,housenumber,3 Rue des Lilas 95560 Maffliers,95353_0115_00003,G,3 RUE DES LILAS,
343875522,00017,34387552200017,O,1988-02-19,NN,,,2008-01-04T22:21:17,true,3,,13,B,,NATIONALE 1,95560,MAFFLIERS,,,95353,,,,,,,,,,,,,,,,,,,2008-01-01,A,,,,,68.20A,NAFRev2,N,2.314903,49.081911,0.76,housenumber,13 bis Route Nationale 1 95560 Maffliers,95353_0341_00013_bis,G,13 BIS ROUTE NATIONALE 1,
344795349,00028,34479534900028,O,1998-07-01,NN,,,2008-01-04T22:32:38,true,3,,8,,RUE,DES LILAS,95560,MAFFLIERS,,,95353,,,,,,,,,,,,,,,,,,,2008-01-01,A,,,,,70.10Z,NAFRev2,N,2.310046,49.078165,0.94,housenumber,8 Rue des Lilas 95560 Maffliers,95353_0115_00008,G,8 RUE DES LILAS,
347686669,00024,34768666900024,O,,NN,,,,true,1,,7,,ALL,DES FRAMBOISIERS,95560,MAFFLIERS,,,95353,,,,,,,,,,,,,,,,,,,1993-12-31,F,,,,,60.2L,NAF1993,N,2.31292,49.078203,0.86,housenumber,7 Allée des Framboisiers 95560 Maffliers,95353_0102_00007,G,7 ALLEE DES FRAMBOISIERS,
347883860,00012,34788386000012,O,,,,,,true,1,,23,,RUE,DES FOUGERES,95560,MAFFLIERS,,,95353,,,,,,,,,,,,,,,,,,,1997-12-31,F,,,,,45.4F,NAF1993,N,2.312386,49.078734,0.94,housenumber,23 Rue des Fougères 95560 Maffliers,95353_0101_00023,G,23 RUE DES FOUGERES,
348399759,00011,34839975900011,O,1988-10-18,NN,,,,true,1,,1,,RUE,DE NERVILLE,95560,MAFFLIERS,,,95353,,,,,,,,,,,,,,,,,,,2002-11-30,F,,,,,15.8C,NAF1993,O,2.307405,49.076882,0.94,housenumber,1 Rue de Nerville 95560 Maffliers,95353_0220_00001,G,1 RUE DE NERVILLE,
348454075,00022,34845407500022,O,2001-03-05,NN,,,2008-11-08T00:22:50,true,3,,35,,RUE,DE PARIS,95560,MAFFLIERS,,,95353,,,,,,,,,,,,,,,,,,,2007-11-30,F,,,,,74.7Z,NAFRev1,N,2.316437,49.07915,0.94,housenumber,35 Rue de Paris 95560 Maffliers,95353_0240_00035,G,35 RUE DE PARIS,
348706706,00028,34870670600028,O,,NN,,,,true,1,,1,,RUE,DU BOIS CARREAUX,95560,MAFFLIERS,,,95353,,,,,,,,,,,,,,,,,,,1991-11-20,F,,,,,55.73,NAP,N,2.307205,49.078101,0.87,housenumber,1 Rue du Bois Carreau 95560 Maffliers,95353_0040_00001,G,1 RUE DU BOIS CARREAU,
348788555,00012,34878855500012,O,1988-10-10,NN,,,2012-09-04T09:31:53,true,5,,23,,RTE,NATIONALE 1,95560,MAFFLIERS,,,95353,,,,,,,,,,,,,,,,,,,2011-12-27,F,,,,,56.10A,NAFRev2,O,2.313492,49.084459,0.85,housenumber,23 Route Nationale 1 95560 Maffliers,95353_0341_00023,G,23 ROUTE NATIONALE 1,
349020792,00017,34902079200017,O,1988-12-09,NN,,,2015-01-29T04:12:28,true,3,,6,,RUE,DE LA FERME,95560,MAFFLIERS,,,95353,,,,,,,,,,,,,,,,,,,2008-01-01,A,,,,,68.20B,NAFRev2,N,2.306879,49.076043,0.94,housenumber,6 Rue de la Ferme 95560 Maffliers,95353_0078_00006,G,6 RUE DE LA FERME,
349327569,00027,34932756900027,O,1995-09-01,NN,,,2008-11-08T00:24:11,false,3,LE RICHEBOURG,2,,ALL,DES MARRONNIERS,95560,MAFFLIERS,,,95353,,,,,,,,,,,,,,,,,,,2005-06-14,F,,,,,93.0E,NAFRev1,N,2.309273,49.073552,0.86,housenumber,2 Allee des Marronniers 95560 Maffliers,95353_0272_00002,G,2 ALLEE DES MARRONNIERS,