siren,nic,siret,statutDiffusionEtablissement,dateCreationEtablissement,trancheEffectifsEtablissement,anneeEffectifsEtablissement,activitePrincipaleRegistreMetiersEtablissement,dateDernierTraitementEtablissement,etablissementSiege,nombrePeriodesEtablissement,complementAdresseEtablissement,numeroVoieEtablissement,indiceRepetitionEtablissement,typeVoieEtablissement,libelleVoieEtablissement,codePostalEtablissement,libelleCommuneEtablissement,libelleCommuneEtrangerEtablissement,distributionSpecialeEtablissement,codeCommuneEtablissement,codeCedexEtablissement,libelleCedexEtablissement,codePaysEtrangerEtablissement,libellePaysEtrangerEtablissement,complementAdresse2Etablissement,numeroVoie2Etablissement,indiceRepetition2Etablissement,typeVoie2Etablissement,libelleVoie2Etablissement,codePostal2Etablissement,libelleCommune2Etablissement,libelleCommuneEtranger2Etablissement,distributionSpeciale2Etablissement,codeCommune2Etablissement,codeCedex2Etablissement,libelleCedex2Etablissement,codePaysEtranger2Etablissement,libellePaysEtranger2Etablissement,dateDebut,etatAdministratifEtablissement,enseigne1Etablissement,enseigne2Etablissement,enseigne3Etablissement,denominationUsuelleEtablissement,activitePrincipaleEtablissement,nomenclatureActivitePrincipaleEtablissement,caractereEmployeurEtablissement,longitude,latitude,geo_score,geo_type,geo_adresse,geo_id,geo_ligne,geo_l4,geo_l5
212803498,00014,21280349800014,O,1983-03-01,02,2018,,2020-08-25T10:16:32,true,4,,1,,RUE,DE LA TOUR,28210,SAINT-LUCIEN,,,28349,,,,,,,,,,,,,,,,,,,2008-01-01,A,MAIRIE,,,,84.11Z,NAFRev2,O,1.625272,48.648504,0.93,housenumber,1 Rue de la Tour 28210 Saint-Lucien,28349_0109_00001,G,1 RUE DE LA TOUR,
262802630,00018,26280263000018,O,1995-12-25,NN,,,2019-11-14T14:00:29,true,3,MAIRIE,1,,RUE,DE LA TOUR,28210,SAINT-LUCIEN,,,28349,,,,,,,,,,,,,,,,,,,2016-01-01,F,CCAS,,,,88.99B,NAFRev2,N,1.625272,48.648504,0.93,housenumber,1 Rue de la Tour 28210 Saint-Lucien,28349_0109_00001,G,1 RUE DE LA TOUR,
300421658,00018,30042165800018,O,,,,,2019-11-14T14:00:29,true,1,,,,,,28210,SAINT-LUCIEN,,,28349,,,,,,,,,,,,,,,,,,,1984-12-25,F,,,,,53.05,NAP,N,,,0,,,,,,
306569948,00046,30656994800046,O,,NN,,,2019-11-14T14:00:29,true,1,,1,,PL,DES TILLEULS,28210,SAINT-LUCIEN,,,28349,,,,,,,,,,,,,,,,,,,1994-06-30,F,,,,,55.4B,NAF1993,N,1.623899,48.647721,0.83,housenumber,1 Place des Tilleuls 28210 Saint-Lucien,28349_0116_00001,G,1 PLACE DES TILLEULS,
309894400,00014,30989440000014,O,,,,,2019-11-14T14:00:29,true,1,,,,RUE,DE L'EGLISE,28210,SAINT-LUCIEN,,,28349,,,,,,,,,,,,,,,,,,,1985-12-25,F,,,,,64.25,NAP,N,2.190649,48.5867276,0.9,poi,Rue de l'Église (Pont) Bruyères-le-Châtel,https://osm.org/way/56259060,G,,
313080939,00058,31308093900058,O,1996-01-08,NN,,,2019-11-14T14:00:29,false,4,LA LOUVIERE,8,,RTE,DE LA BUTTE NOIRE,28210,SAINT-LUCIEN,,,28349,,,,,,,,,,,,,,,,,,,2008-01-01,F,,,,,43.21A,NAFRev2,N,1.624962,48.630059,0.85,housenumber,8 Rue de la Butte Noire 28210 Saint-Lucien,28349_0133_00008,G,8 RUE DE LA BUTTE NOIRE,
317762557,00013,31776255700013,O,,,,,2019-11-14T14:00:29,true,1,,,,,,28210,SAINT-LUCIEN,,,28349,,,,,,,,,,,,,,,,,,,1984-12-25,F,,,,,02.20,NAP,N,,,0,,,,,,
320568777,00017,32056877700017,O,,NN,,,2019-11-14T14:00:29,true,1,,,,,,28210,SAINT-LUCIEN,,,28349,,,,,,,,,,,,,,,,,,,1991-01-01,F,,,,,01.00,NAP,N,,,0,,,,,,
320580004,00036,32058000400036,O,2005-11-02,,,,2019-11-14T14:00:29,false,3,LA LOUVIERE,1,,RUE,DE LA BUTTE NOIRE,28210,SAINT-LUCIEN,,,28349,,,,,,,,,,,,,,,,,,,2016-07-01,F,,,,,82.91Z,NAFRev2,N,1.625394,48.629835,0.93,housenumber,1 Rue de la Butte Noire 28210 Saint-Lucien,28349_0133_00001,G,1 RUE DE LA BUTTE NOIRE,
322762964,00029,32276296400029,O,2001-03-14,NN,,,2019-11-14T14:00:29,true,1,,16,,RUE,DES PRESSOIRS,28210,SAINT-LUCIEN,,,28349,,,,,,,,,,,,,,,,,,,2001-03-14,F,,,,,52.6E,NAF1993,N,1.62408,48.647559,0.93,housenumber,16 Rue des Pressoirs 28210 Saint-Lucien,28349_0113_00016,G,16 RUE DES PRESSOIRS,
322794900,00017,32279490000017,O,2002-02-15,NN,,,2019-11-14T14:00:29,true,4,,1,,RUE,DES PRESSOIRS,28210,SAINT-LUCIEN,,,28349,,,,,,,,,,,,,,,,,,,2015-01-01,F,,,,,85.59B,NAFRev2,N,1.626197,48.649689,0.93,housenumber,1 Rue des Pressoirs 28210 Saint-Lucien,28349_0113_00001,G,1 RUE DES PRESSOIRS,
324261296,00051,32426129600051,O,2010-09-01,02,2018,1072ZZ,2021-02-23T10:47:19,true,2,,1,,RUE,DU CLOCHER,28210,SAINT-LUCIEN,,,28349,,,,,,,,,,,,,,,,,,,2010-10-16,A,,,,,10.72Z,NAFRev2,O,1.623148,48.648048,0.93,housenumber,1 Rue du Clocher 28210 Saint-Lucien,28349_0114_00001,G,1 RUE DU CLOCHER,
325914851,00010,32591485100010,O,,,,,2019-11-14T14:00:29,true,1,,,,RUE,DU PRESBYTERE,28210,SAINT-LUCIEN,,,28349,,,,,,,,,,,,,,,,,,,1989-03-10,F,,,,,02.20,NAP,N,1.623059,48.646265,0.93,street,Rue du Presbytere 28210 Saint-Lucien,28349_0112,G,RUE DU PRESBYTERE,
328839006,00017,32883900600017,O,,,,,2019-11-14T14:00:29,true,1,,,,LD,SAUGIS,28210,SAINT-LUCIEN,,,28349,,,,,,,,,,,,,,,,,,,1985-12-25,F,,,,,81.21,NAP,N,1.630704,48.638627,0.9,street,Route de la Croix de Saugis 28210 Saint-Lucien,28349_0131,G,ROUTE DE LA CROIX DE SAUGIS,
329454599,00013,32945459900013,O,1984-03-24,NN,,,2019-11-14T14:00:29,true,4,,,,LD,LE PARC AUX ROUX,28210,SAINT-LUCIEN,,,28349,,,,,,,,,,,,,,,,,,,2003-01-23,F,,,,,45.1A,NAFRev1,N,,,0,,,,,,
329852834,00020,32985283400020,O,1988-11-07,NN,,,2019-11-14T14:00:29,true,3,,,,,SENTE DU VIEUX LAVOIR,28210,SAINT-LUCIEN,,,28349,,,,,,,,,,,,,,,,,,,2008-01-01,A,,,,,90.03B,NAFRev2,N,5.679699,45.5324905,0.78,poi.steps,Sentier du Vieux Lavoir (Escalier) Le Pont-de-Beauvoisin,https://osm.org/way/197819322,G,,
330685983,00018,33068598300018,O,,NN,,,2019-11-14T14:00:29,true,1,,,,,,28210,SAINT-LUCIEN,,,28349,,,,,,,,,,,,,,,,,,,,F,,,,,79.06,NAP,N,,,0,,,,,,
332065564,00012,33206556400012,O,,NN,,,2019-11-14T14:00:29,true,1,,,,LD,SAUGIS,28210,SAINT-LUCIEN,,,28349,,,,,,,,,,,,,,,,,,,1988-07-11,F,,,,,01.00,NAP,N,1.630704,48.638627,0.9,street,Route de la Croix de Saugis 28210 Saint-Lucien,28349_0131,G,ROUTE DE LA CROIX DE SAUGIS,
333119980,00014,33311998000014,O,1985-06-21,NN,,,2019-11-14T14:00:29,false,4,,4,,PL,DES TILLEULS,28210,SAINT-LUCIEN,,,28349,,,,,,,,,,,,,,,,,,,1994-08-01,F,,,,,70.1C,NAF1993,N,1.623798,48.648343,0.83,housenumber,4 Place des Tilleuls 28210 Saint-Lucien,28349_0116_00004,G,4 PLACE DES TILLEULS,
337658157,00058,33765815700058,O,1998-10-01,NN,,,2019-11-14T14:00:29,false,4,,3,,RUE,DU PRESBYTERE,28210,SAINT-LUCIEN,,,28349,,,,,,,,,,,,,,,,,,,2008-12-07,F,,,,,62.02A,NAFRev2,N,1.622173,48.646654,0.93,housenumber,3 Rue du Presbytere 28210 Saint-Lucien,28349_0112_00003,G,3 RUE DU PRESBYTERE,
338952104,00028,33895210400028,O,1998-07-01,,,,2019-11-14T14:00:29,true,1,,6,,RTE,PETIT ORME,28210,SAINT-LUCIEN,,,28349,,,,,,,,,,,,,,,,,,,1999-03-31,F,,,,,45.4J,NAF1993,N,1.624382,48.64575,0.72,housenumber,6 Rue du Petit Orme 28210 Saint-Lucien,28349_0115_00006,G,6 RUE DU PETIT ORME,
343822938,00027,34382293800027,O,1993-02-01,NN,,,2019-11-14T14:00:29,false,4,,6,,RUE,DES PRESSOIRS,28210,SAINT-LUCIEN,,,28349,,,,,,,,,,,,,,,,,,,1994-12-25,F,,,,,60.2L,NAF1993,O,1.625455,48.649089,0.93,housenumber,6 Rue des Pressoirs 28210 Saint-Lucien,28349_0113_00006,G,6 RUE DES PRESSOIRS,
347876765,00012,34787676500012,O,1988-07-11,NN,,,2019-11-14T14:00:29,true,4,,,,LD,SAUGY,28210,SAINT-LUCIEN,,,28349,,,,,,,,,,,,,,,,,,,2011-12-31,F,,,,,01.11Z,NAFRev2,N,2.1211145,46.9694464,0.89,poi,(Pont) Saugy,https://osm.org/way/182749353,G,,
348422536,00014,34842253600014,O,1988-10-01,,,,2019-11-14T14:00:29,true,4,,,,LD,LA LOUVRIERE,28210,SAINT-LUCIEN,,,28349,,,,,,,,,,,,,,,,,,,1993-10-29,F,,,,,45.2V,NAF1993,N,1.626982,48.629793,0.71,street,Route de la Louviere 28210 Saint-Lucien,28349_zel2wc,G,ROUTE DE LA LOUVIERE,
351963632,00010,35196363200010,O,,,,,2019-11-14T14:00:29,true,1,,6,,RUE,DES PRESSOIRS,28210,SAINT-LUCIEN,,,28349,,,,,,,,,,,,,,,,,,,1991-02-21,F,,,,,69.12,NAP,N,1.625455,48.649089,0.93,housenumber,6 Rue des Pressoirs 28210 Saint-Lucien,28349_0113_00006,G,6 RUE DES PRESSOIRS,
352747745,00011,35274774500011,O,1989-12-04,NN,,,2019-11-14T14:00:29,true,3,SAUGIS,13,,CHE,DE LA BUTTE BLANCHE,28210,SAINT-LUCIEN,,,28349,,,,,,,,,,,,,,,,,,,2008-01-01,A,,,,,68.20B,NAFRev2,N,1.634563,48.638011,0.89,housenumber,13 Chemin de la Butte Blanche 28210 Saint-Lucien,28349_0132_00013,G,13 CHEMIN DE LA BUTTE BLANCHE,
353389315,00030,35338931500030,O,2012-07-01,,,,2019-11-14T14:00:29,true,2,,10,,PL,DES TILLEULS,28210,SAINT-LUCIEN,,,28349,,,,,,,,,,,,,,,,,,,2017-12-31,F,,,,,86.90F,NAFRev2,N,1.623432,48.648082,0.84,housenumber,10 Place des Tilleuls 28210 Saint-Lucien,28349_0116_00010,G,10 PLACE DES TILLEULS,
377894563,00016,37789456300016,O,1990-04-19,NN,,,2019-11-14T14:00:29,false,4,LA LOUVIERE,2,,RUE,DE LA BUTTE NOIRE,28210,SAINT-LUCIEN,,,28349,,,,,,,,,,,,,,,,,,,2000-12-31,F,,,,,45.2V,NAF1993,O,1.624196,48.631032,0.93,housenumber,2 Rue de la Butte Noire 28210 Saint-Lucien,28349_0133_00002,G,2 RUE DE LA BUTTE NOIRE,
379534852,00015,37953485200015,O,1990-10-02,NN,,,2019-11-14T14:00:29,true,1,,7,,RUE,DU PRESBYTERE,28210,SAINT-LUCIEN,,,28349,,,,,,,,,,,,,,,,,,,1999-04-30,F,,,,,45.1A,NAF1993,O,1.621393,48.646744,0.93,housenumber,7 Rue du Presbytere 28210 Saint-Lucien,28349_0112_00007,G,7 RUE DU PRESBYTERE,
381881416,00014,38188141600014,O,1991-05-15,NN,,,2019-11-14T14:00:29,true,3,,4,,RUE,DU CLOCHER,28210,SAINT-LUCIEN,,,28349,,,,,,,,,,,,,,,,,,,1999-12-31,F,,,,,51.4S,NAF1993,N,1.622517,48.648265,0.93,housenumber,4 Rue du Clocher 28210 Saint-Lucien,28349_0114_00004,G,4 RUE DU CLOCHER,
384250247,00028,38425024700028,O,2009-10-29,,,,2019-11-14T14:00:29,true,2,,,,LD,SAUGIS,28210,SAINT-LUCIEN,,,28349,,,,,,,,,,,,,,,,,,,2011-12-31,F,,,,,01.45Z,NAFRev2,N,1.630704,48.638627,0.9,street,Route de la Croix de Saugis 28210 Saint-Lucien,28349_0131,G,ROUTE DE LA CROIX DE SAUGIS,
384361168,00014,38436116800014,O,1991-12-01,,,,2019-11-14T14:00:29,true,3,,13,,RUE,DES PRESSOIRS,28210,SAINT-LUCIEN,,,28349,,,,,,,,,,,,,,,,,,,2008-01-01,A,,,,,01.11Z,NAFRev2,N,1.624321,48.647821,0.93,housenumber,13 Rue des Pressoirs 28210 Saint-Lucien,28349_0113_00013,G,13 RUE DES PRESSOIRS,
384580833,00026,38458083300026,O,1995-09-20,NN,,,2020-03-27T14:53:47,true,3,SAUGIS,10,,CHE,DE LA BUTTE BLANCHE,28210,SAINT-LUCIEN,,,28349,,,,,,,,,,,,,,,,,,,2008-01-01,A,,,,,68.20B,NAFRev2,N,1.634696,48.63785,0.89,housenumber,10 Chemin de la Butte Blanche 28210 Saint-Lucien,28349_0132_00010,G,10 CHEMIN DE LA BUTTE BLANCHE,
392095899,00028,39209589900028,O,1997-07-15,NN,,,2019-11-14T14:00:29,true,3,FERME DE LA LOUVIERE,3,,CHE,DES GARENNES,28210,SAINT-LUCIEN,,,28349,,,,,,,,,,,,,,,,,,,2008-01-01,A,,,,,68.20B,NAFRev2,N,1.626379,48.630182,0.83,housenumber,3 Chemin des Garennes 28210 Saint-Lucien,28349_0128_00003,G,3 CHEMIN DES GARENNES,
393305792,00011,39330579200011,O,1993-10-25,NN,,1813ZB,2019-11-14T14:00:29,true,4,,9,,RUE,DU PRESBYTERE,28210,SAINT-LUCIEN,,,28349,,,,,,,,,,,,,,,,,,,2005-02-17,F,,,,,22.2J,NAFRev1,O,1.62121,48.647083,0.93,housenumber,9 Rue du Presbytere 28210 Saint-Lucien,28349_0112_00009,G,9 RUE DU PRESBYTERE,
394191837,00027,39419183700027,O,1980-01-01,NN,,,2019-11-14T14:00:29,true,4,ANGLE 5 9 29 R PDT F. MITTERAND,5,,RUE,PDT FRANCOIS MITTERRAND,28210,SAINT-LUCIEN,,,28349,,,,,,,,,,,,,,,,,,,2008-01-01,A,,,,,01.43Z,NAFRev2,O,2.2945275,48.6953917,0.77,poi,Rue du Président François Mitterrand (Pont) Longjumeau,https://osm.org/way/102639744,G,,
394663173,00018,39466317300018,O,1994-04-07,NN,,,2019-11-14T14:00:29,true,3,,3,,CHE,DU RENARD,28210,SAINT-LUCIEN,,,28349,,,,,,,,,,,,,,,,,,,2008-01-01,A,,,,,70.10Z,NAFRev2,N,6.8674911,48.0638055,0.89,poi.footway,Chemin de la Roche du Renard (Chemin piéton) Gérardmer,https://osm.org/way/34954580,G,,
399097872,00010,39909787200010,O,1994-11-01,NN,,,2019-11-14T14:00:29,true,1,,5,,CHE,DE LA BUTTE BLANCHE,28210,SAINT-LUCIEN,,,28349,,,,,,,,,,,,,,,,,,,1999-12-20,F,,,,,74.2C,NAF1993,O,1.631813,48.639343,0.89,housenumber,5 Chemin de la Butte Blanche 28210 Saint-Lucien,28349_0132_00005,G,5 CHEMIN DE LA BUTTE BLANCHE,
400391942,00010,40039194200010,O,,NN,,,2019-11-14T14:00:29,true,1,,,,,LA LOUVIERE,28210,SAINT-LUCIEN,,,28349,,,,,,,,,,,,,,,,,,,1996-12-04,F,,,,,92.6C,NAF1993,N,1.626982,48.629793,0.91,street,Route de la Louviere 28210 Saint-Lucien,28349_zel2wc,G,ROUTE DE LA LOUVIERE,
401849310,00016,40184931000016,O,1995-07-07,NN,,,2019-11-14T14:00:29,false,3,,12,,RUE,DU CLOCHER,28210,SAINT-LUCIEN,,,28349,,,,,,,,,,,,,,,,,,,1997-01-03,F,COMME UN SOLEIL,,,,74.1G,NAF1993,N,1.619091,48.647686,0.93,housenumber,12 Rue du Clocher 28210 Saint-Lucien,28349_0114_00012,G,12 RUE DU CLOCHER,
402746606,00027,40274660600027,O,1997-09-15,NN,,,2019-11-14T14:00:29,false,4,LA LOUVIERE,4,,CHE,DES ROCHES PETIT PAVILLON,28210,SAINT-LUCIEN,,,28349,,,,,,,,,,,,,,,,,,,2001-05-01,F,,,,,01.2C,NAF1993,N,1.627657,48.630091,0.45,housenumber,4 Chemin des Roches 28210 Saint-Lucien,28349_0134_00004,G,4 CHEMIN DES ROCHES,
403467160,00012,40346716000012,O,1996-01-02,NN,,,2019-11-14T14:00:29,false,4,,3,,RUE,DES MARNONS,28210,SAINT-LUCIEN,,,28349,,,,,,,,,,,,,,,,,,,1998-06-30,F,,,,,51.1R,NAF1993,N,1.59704,48.641554,0.93,housenumber,3 Rue des Marnons 28210 Saint-Lucien,28349_0111_00003,G,3 RUE DES MARNONS,
404828592,00034,40482859200034,O,2008-01-01,NN,,9602BA,2021-02-23T11:29:08,true,3,,5,,RUE,DU PRESBYTERE,28210,SAINT-LUCIEN,,,28349,,,,,,,,,,,,,,,,,,,2016-09-30,A,,,,,96.02B,NAFRev2,N,1.621895,48.646776,0.93,housenumber,5 Rue du Presbytere 28210 Saint-Lucien,28349_0112_00005,G,5 RUE DU PRESBYTERE,
407710193,00019,40771019300019,O,1981-09-01,NN,,,2019-11-14T14:00:29,true,6,CHENICOURT,3,,RUE,DE LA MARE,28210,SAINT-LUCIEN,,,28349,,,,,,,,,,,,,,,,,,,2008-01-01,A,,,,,68.20B,NAFRev2,N,1.598578,48.640449,0.93,housenumber,3 Rue de la Mare 28210 Saint-Lucien,28349_0122_00003,G,3 RUE DE LA MARE,
411502479,00016,41150247900016,O,1993-10-01,NN,,,2019-11-14T14:00:29,true,3,,2,,RUE,DES PRESSOIRS,28210,SAINT-LUCIEN,,,28349,,,,,,,,,,,,,,,,,,,2008-01-01,A,,,,,01.50Z,NAFRev2,N,1.625734,48.649335,0.93,housenumber,2 Rue des Pressoirs 28210 Saint-Lucien,28349_0113_00002,G,2 RUE DES PRESSOIRS,
411745664,00010,41174566400010,O,1997-02-25,NN,,,2019-11-14T14:00:29,true,4,LA LOUVIERE,4,,CHE,DES ROCHES,28210,SAINT-LUCIEN,,,28349,,,,,,,,,,,,,,,,,,,2008-01-01,A,,,,,68.20B,NAFRev2,O,1.627657,48.630091,0.81,housenumber,4 Chemin des Roches 28210 Saint-Lucien,28349_0134_00004,G,4 CHEMIN DES ROCHES,
412541658,00032,41254165800032,O,2004-01-01,01,2018,3299ZG,2021-02-23T11:34:52,true,5,,5,,RUE,DU PRESBYTERE,28210,SAINT-LUCIEN,,,28349,,,,,,,,,,,,,,,,,,,2017-01-01,A,,,,,25.99B,NAFRev2,O,1.621895,48.646776,0.93,housenumber,5 Rue du Presbytere 28210 Saint-Lucien,28349_0112_00005,G,5 RUE DU PRESBYTERE,
415370444,00010,41537044400010,O,1998-01-16,,,,2019-11-14T14:00:29,true,1,,9,,RUE,DE LA MARE-CHENICOURT,28210,SAINT-LUCIEN,,,28349,,,,,,,,,,,,,,,,,,,1999-12-31,F,,,,,71.3G,NAF1993,N,1.597737,48.639497,0.62,housenumber,9 Rue de la Mare 28210 Saint-Lucien,28349_0122_00009,G,9 RUE DE LA MARE,
417689650,00014,41768965000014,O,1998-01-01,NN,,,2019-11-14T14:00:29,true,3,,9,,RUE,DU PRESBYTERE,28210,SAINT-LUCIEN,,,28349,,,,,,,,,,,,,,,,,,,2008-01-01,A,,,,,01.62Z,NAFRev2,N,1.62121,48.647083,0.93,housenumber,9 Rue du Presbytere 28210 Saint-Lucien,28349_0112_00009,G,9 RUE DU PRESBYTERE,
420142416,00015,42014241600015,O,,NN,,,2019-11-14T14:00:29,true,1,,13,,RUE,DES PRESSOIRS,28210,SAINT-LUCIEN,,,28349,,,,,,,,,,,,,,,,,,,1992-01-01,F,,,,,01.1A,NAF1993,N,1.624321,48.647821,0.93,housenumber,13 Rue des Pressoirs 28210 Saint-Lucien,28349_0113_00013,G,13 RUE DES PRESSOIRS,
421654344,00017,42165434400017,O,1998-12-14,NN,,,2021-02-23T11:43:02,true,5,,10,,CHE,DE LA BUTTE BLANCHE,28210,SAINT-LUCIEN,,,28349,,,,,,,,,,,,,,,,,,,2013-04-18,A,,,,,55.90Z,NAFRev2,N,1.634696,48.63785,0.89,housenumber,10 Chemin de la Butte Blanche 28210 Saint-Lucien,28349_0132_00010,G,10 CHEMIN DE LA BUTTE BLANCHE,
422646315,00024,42264631500024,O,2020-01-01,,,4932ZB,2021-02-23T11:44:20,true,1,CHENICOURT,13,,RUE,DES MARNONS,28210,SAINT-LUCIEN,,,28349,,,,,,,,,,,,,,,,,,,2020-01-01,A,,,,R. M. RICHARD MARQUER,49.32Z,NAFRev2,N,1.599814,48.64155,0.93,housenumber,13 Rue des Marnons 28210 Saint-Lucien,28349_0111_00013,G,13 RUE DES MARNONS,
422688960,00018,42268896000018,O,1999-03-12,NN,,,2019-11-14T14:00:29,true,3,FERME DE LA LOUVIERE,3,,CHE,DE GARENNES,28210,SAINT-LUCIEN,,,28349,,,,,,,,,,,,,,,,,,,2008-01-01,A,,,,,68.20B,NAFRev2,N,1.626379,48.630182,0.73,housenumber,3 Chemin des Garennes 28210 Saint-Lucien,28349_0128_00003,G,3 CHEMIN DES GARENNES,
424732931,00011,42473293100011,O,1999-10-07,02,2018,,2020-08-25T10:15:55,true,6,CHENICOURT ST LUCIEN,7,,RUE,DES MARNONS,28210,SAINT-LUCIEN,,,28349,,,,,,,,,,,,,,,,,,,2019-01-31,F,,,,,85.59A,NAFRev2,N,1.598125,48.641383,0.93,housenumber,7 Rue des Marnons 28210 Saint-Lucien,28349_0111_00007,G,7 RUE DES MARNONS,
425336096,00010,42533609600010,O,1997-03-20,NN,,,2019-11-14T14:00:29,true,3,LA LOUVIERE,,,,,28210,SAINT-LUCIEN,,,28349,,,,,,,,,,,,,,,,,,,2008-01-01,A,,,,,94.99Z,NAFRev2,N,1.626982,48.629793,0.91,street,Route de la Louviere 28210 Saint-Lucien,28349_zel2wc,D,ROUTE DE LA LOUVIERE,
428114300,00018,42811430000018,O,1999-11-24,NN,,,2019-11-14T14:00:29,false,3,,1,,RUE,DU CLOCHER,28210,SAINT-LUCIEN,,,28349,,,,,,,,,,,,,,,,,,,2008-01-01,A,,,,,68.20B,NAFRev2,N,1.623148,48.648048,0.93,housenumber,1 Rue du Clocher 28210 Saint-Lucien,28349_0114_00001,G,1 RUE DU CLOCHER,
428278170,00017,42827817000017,O,1999-12-01,,,,2019-11-14T14:00:29,true,1,,8,,CHE,DES GARENNES,28210,SAINT-LUCIEN,,,28349,,,,,,,,,,,,,,,,,,,2000-09-29,F,,,,,74.1G,NAF1993,N,1.626524,48.62953,0.83,housenumber,8 Chemin des Garennes 28210 Saint-Lucien,28349_0128_00008,G,8 CHEMIN DES GARENNES,
432880037,00010,43288003700010,O,2000-09-01,NN,,,2019-11-14T14:00:29,false,6,,,,IMP,DE LA FERME,28210,SAINT-LUCIEN,,,28349,,,,,,,,,,,,,,,,,,,2003-12-25,F,LOTS EN STOCK,,,,51.9B,NAFRev1,N,1.620893,48.64735,0.82,street,Impasse de la Ferme 28210 Saint-Lucien,28349_0125,G,IMPASSE DE LA FERME,
433939345,00016,43393934500016,O,2000-12-01,NN,,,2019-11-14T14:00:29,true,3,CHENICOURT,3,,RUE,DE LA MARE,28210,SAINT-LUCIEN,,,28349,,,,,,,,,,,,,,,,,,,2008-01-01,A,,,,,01.11Z,NAFRev2,N,1.598578,48.640449,0.93,housenumber,3 Rue de la Mare 28210 Saint-Lucien,28349_0122_00003,G,3 RUE DE LA MARE,
434632337,00011,43463233700011,O,2001-01-01,01,2018,,2020-08-25T10:23:11,true,4,FERME DE LA LOUVIERE,3,,CHE,DES GARENNES,28210,SAINT-LUCIEN,,,28349,,,,,,,,,,,,,,,,,,,2013-12-31,A,,,,,01.43Z,NAFRev2,O,1.626379,48.630182,0.83,housenumber,3 Chemin des Garennes 28210 Saint-Lucien,28349_0128_00003,G,3 CHEMIN DES GARENNES,
434844569,00013,43484456900013,O,2001-01-01,NN,,,2019-11-14T14:00:29,true,3,FERME DE LA LOUVIERE,3,,CHE,DES GARENNES,28210,SAINT-LUCIEN,,,28349,,,,,,,,,,,,,,,,,,,2005-09-30,F,,,,,51.2E,NAFRev1,N,1.626379,48.630182,0.83,housenumber,3 Chemin des Garennes 28210 Saint-Lucien,28349_0128_00003,G,3 CHEMIN DES GARENNES,
442522876,00030,44252287600030,O,2004-06-01,NN,,,2019-11-14T14:00:29,false,5,,7,,CHE,DE LA BUTTE BLANCHE,28210,SAINT-LUCIEN,,,28349,,,,,,,,,,,,,,,,,,,2010-03-31,F,,,,,49.41C,NAFRev2,O,1.632177,48.63934,0.89,housenumber,7 Chemin de la Butte Blanche 28210 Saint-Lucien,28349_0132_00007,G,7 CHEMIN DE LA BUTTE BLANCHE,
444881601,00025,44488160100025,O,2019-07-22,,,,2021-02-23T13:27:52,true,1,,6,,RTE,DE LA CROIX DE SAUGIS,28210,SAINT-LUCIEN,,,28349,,,,,,,,,,,,,,,,,,,2019-07-22,A,,,,,70.22Z,NAFRev2,N,1.629764,48.638532,0.86,housenumber,6 Route de la Croix de Saugis 28210 Saint-Lucien,28349_0131_00006,G,6 ROUTE DE LA CROIX DE SAUGIS,
448713867,00019,44871386700019,O,2003-05-28,01,2018,,2020-08-25T10:12:43,true,3,,,,RUE,DU CLOCHER,28210,SAINT-LUCIEN,,,28349,,,,,,,,,,,,,,,,,,,2008-01-01,A,,,,,81.30Z,NAFRev2,O,1.623148,48.648048,0.93,street,Rue du Clocher 28210 Saint-Lucien,28349_0114,G,RUE DU CLOCHER,
452405533,00020,45240553300020,O,2010-11-08,,,,2021-02-23T13:36:17,true,1,,1,,RUE,DU CLOCHER,28210,SAINT-LUCIEN,,,28349,,,,,,,,,,,,,,,,,,,2010-11-08,A,,,,,68.20A,NAFRev2,N,1.623148,48.648048,0.93,housenumber,1 Rue du Clocher 28210 Saint-Lucien,28349_0114_00001,G,1 RUE DU CLOCHER,
477739643,00021,47773964300021,O,2013-01-28,,,,2019-11-14T14:00:29,false,2,,10,,CHE,DE LA BUTTE BLANCHE,28210,SAINT-LUCIEN,,,28349,,,,,,,,,,,,,,,,,,,2017-09-08,F,,,,,70.22Z,NAFRev2,N,1.634696,48.63785,0.89,housenumber,10 Chemin de la Butte Blanche 28210 Saint-Lucien,28349_0132_00010,G,10 CHEMIN DE LA BUTTE BLANCHE,
478179534,00027,47817953400027,O,2011-02-24,01,2018,,2021-02-23T13:39:56,true,1,,6,,RTE,DE LA BUTTE NOIRE,28210,SAINT-LUCIEN,,,28349,,,,,,,,,,,,,,,,,,,2011-02-24,A,,,,,43.34Z,NAFRev2,O,1.624541,48.630509,0.85,housenumber,6 Rue de la Butte Noire 28210 Saint-Lucien,28349_0133_00006,G,6 RUE DE LA BUTTE NOIRE,
483514600,00012,48351460000012,O,1994-11-16,NN,,,2019-11-14T14:00:29,true,3,,1,,RUE,DES PRESSOIRS,28210,SAINT-LUCIEN,,,28349,,,,,,,,,,,,,,,,,,,2008-01-01,A,,,,,93.12Z,NAFRev2,N,1.626197,48.649689,0.93,housenumber,1 Rue des Pressoirs 28210 Saint-Lucien,28349_0113_00001,G,1 RUE DES PRESSOIRS,
488750191,00014,48875019100014,O,2006-03-01,,,,2019-11-14T14:00:29,true,3,,1,,RUE,DES PRESSOIRS,28210,SAINT-LUCIEN,,,28349,,,,,,,,,,,,,,,,,,,2012-12-18,F,LE CORMIER ACADEMIE,,,,85.51Z,NAFRev2,N,1.626197,48.649689,0.93,housenumber,1 Rue des Pressoirs 28210 Saint-Lucien,28349_0113_00001,G,1 RUE DES PRESSOIRS,
488851635,00018,48885163500018,O,2005-01-01,,,,2019-11-14T14:00:29,false,3,,4,,CHE,DE LA TOUR,28210,SAINT-LUCIEN,,,28349,,,,,,,,,,,,,,,,,,,2008-01-01,F,,,,,90.03B,NAFRev2,N,1.626246,48.648644,0.82,housenumber,4 Chemin de la Tour 28210 Saint-Lucien,28349_pxng82_00004,G,4 CHEMIN DE LA TOUR,
488859794,00015,48885979400015,O,2005-10-01,,,,2019-11-14T14:00:29,true,3,CHEMIN DES GARENNES HARAS,,,,HARAS DE LA TOURIERE,28210,SAINT-LUCIEN,,,28349,,,,,,,,,,,,,,,,,,,2011-12-31,F,,,,,01.62Z,NAFRev2,N,,,0,,,,,,
493733646,00019,49373364600019,O,2007-01-15,,,,2019-11-14T14:00:29,true,2,,9,,RUE,DE LA MARE,28210,SAINT-LUCIEN,,,28349,,,,,,,,,,,,,,,,,,,2008-01-01,A,,,,,27.40Z,NAFRev2,N,1.597737,48.639497,0.93,housenumber,9 Rue de la Mare 28210 Saint-Lucien,28349_0122_00009,G,9 RUE DE LA MARE,
497993089,00026,49799308900026,O,2011-03-01,,,,2019-11-14T14:00:29,true,2,,14,,RUE,DU CLOCHER,28210,SAINT-LUCIEN,,,28349,,,,,,,,,,,,,,,,,,,2011-08-06,F,,,,,46.19B,NAFRev2,N,1.61829,48.64803,0.93,housenumber,14 Rue du Clocher 28210 Saint-Lucien,28349_0114_00014,G,14 RUE DU CLOCHER,
498428754,00010,49842875400010,O,2007-06-08,,,4329BD,2019-11-14T14:00:29,true,6,,14,,RUE,DES PRESSOIRS,28210,SAINT-LUCIEN,,,28349,,,,,,,,,,,,,,,,,,,2019-05-02,A,,,,,47.89Z,NAFRev2,N,1.62461,48.648195,0.93,housenumber,14 Rue des Pressoirs 28210 Saint-Lucien,28349_0113_00014,G,14 RUE DES PRESSOIRS,
500126602,00019,50012660200019,O,2007-10-01,,,,2019-11-14T14:00:29,true,3,CHENICOURT,2,,CHE,DE L EPINE DU GRES,28210,SAINT-LUCIEN,,,28349,,,,,,,,,,,,,,,,,,,2011-12-31,F,DOGYCAT,,,,47.99A,NAFRev2,N,1.600379,48.64148,0.89,housenumber,2 Chemin de l'Epine du Grés 28210 Saint-Lucien,28349_0121_00002,G,2 CHEMIN DE L EPINE DU GRES,
502701691,00011,50270169100011,O,2006-11-29,,,,2019-11-14T14:00:29,true,1,MAIRIE,1,,CHE,DE LA TOUR,28210,SAINT-LUCIEN,,,28349,,,,,,,,,,,,,,,,,,,2006-11-29,A,,,,,94.99Z,NAFRev2,N,1.625271,48.648504,0.82,housenumber,1 Chemin de la Tour 28210 Saint-Lucien,28349_pxng82_00001,G,1 CHEMIN DE LA TOUR,
503217481,00012,50321748100012,O,2008-04-01,,,,2019-11-14T14:00:29,true,1,CHENICOURT,9,,RUE,DE LA MARE,28210,SAINT-LUCIEN,,,28349,,,,,,,,,,,,,,,,,,,2008-04-01,A,,,,,63.11Z,NAFRev2,N,1.597737,48.639497,0.93,housenumber,9 Rue de la Mare 28210 Saint-Lucien,28349_0122_00009,G,9 RUE DE LA MARE,
503547036,00015,50354703600015,O,2008-03-01,,,,2019-11-14T14:00:29,true,1,,6,,CHE,DE LA TOUR,28210,SAINT-LUCIEN,,,28349,,,,,,,,,,,,,,,,,,,2008-03-01,A,,,,,64.20Z,NAFRev2,N,1.627186,48.64883,0.82,housenumber,6 Chemin de la Tour 28210 Saint-Lucien,28349_pxng82_00006,G,6 CHEMIN DE LA TOUR,