siren,nic,siret,statutDiffusionEtablissement,dateCreationEtablissement,trancheEffectifsEtablissement,anneeEffectifsEtablissement,activitePrincipaleRegistreMetiersEtablissement,dateDernierTraitementEtablissement,etablissementSiege,nombrePeriodesEtablissement,complementAdresseEtablissement,numeroVoieEtablissement,indiceRepetitionEtablissement,typeVoieEtablissement,libelleVoieEtablissement,codePostalEtablissement,libelleCommuneEtablissement,libelleCommuneEtrangerEtablissement,distributionSpecialeEtablissement,codeCommuneEtablissement,codeCedexEtablissement,libelleCedexEtablissement,codePaysEtrangerEtablissement,libellePaysEtrangerEtablissement,complementAdresse2Etablissement,numeroVoie2Etablissement,indiceRepetition2Etablissement,typeVoie2Etablissement,libelleVoie2Etablissement,codePostal2Etablissement,libelleCommune2Etablissement,libelleCommuneEtranger2Etablissement,distributionSpeciale2Etablissement,codeCommune2Etablissement,codeCedex2Etablissement,libelleCedex2Etablissement,codePaysEtranger2Etablissement,libellePaysEtranger2Etablissement,dateDebut,etatAdministratifEtablissement,enseigne1Etablissement,enseigne2Etablissement,enseigne3Etablissement,denominationUsuelleEtablissement,activitePrincipaleEtablissement,nomenclatureActivitePrincipaleEtablissement,caractereEmployeurEtablissement,longitude,latitude,geo_score,geo_type,geo_adresse,geo_id,geo_ligne,geo_l4,geo_l5
180070039,01878,18007003901878,O,1987-11-17,11,2018,,2020-08-25T10:13:47,false,5,,,,,LA BOISSELIERE,49250,LES BOIS D'ANJOU,,,49138,,,,,,,,,,,,,,,,,,,2018-01-30,A,UNITE EXPERIMENTALE DU GEVES,,,,72.19Z,NAFRev2,O,-0.221675,47.496843,0.68,street,Rue de la Chapelière (Saint-Georges-du-Bois) 49250 Les Bois d'Anjou,49280_0315,G,RUE DE LA CHAPELIERE,SAINT GEORGES DU BOIS
180089286,00025,18008928600025,O,1989-05-11,03,2018,,2020-08-25T10:13:48,false,5,UNITE EXPERIMENTALE DE BRION,,,,DOMAINE DE LA BOISSELIERE,49250,LES BOIS D'ANJOU,,,49138,,,,,,,,,,,,,,,,,,,2015-01-18,A,GEVES BRION,,,,72.19Z,NAFRev2,O,-0.134894,47.437111,0.49,street,Domaine des Hayes 49250 Les Bois d'Anjou,49049_b942,G,DOMAINE DES HAYES,
200053213,00019,20005321300019,O,2016-01-01,12,2018,,2020-08-25T10:14:57,true,1,,11,,RUE,DE LA MAIRIE,49250,LES BOIS D'ANJOU,,,49138,,,,,,,,,,,,,,,,,,,2016-01-01,A,MAIRIE,,,,84.11Z,NAFRev2,O,-0.189893,47.485328,0.94,housenumber,11 Rue de la Mairie 49250 Les Bois d'Anjou,49138_0073_00011,G,11 RUE DE LA MAIRIE,
200053213,00027,20005321300027,O,2016-01-01,,,,2016-01-12T12:17:28,false,1,,1,,PL,DE L'EGLISE,49250,LES BOIS D'ANJOU,,,49138,,,,,,,,,,,,,,,,,,,2016-01-01,A,COMMUNE DELEGUEE DE BRION,,,,84.11Z,NAFRev2,N,-0.226779,47.497142,0.82,housenumber,1 Place de l'Eglise (st Georges) 49250 Les Bois d'Anjou,49280_0004_00001,G,1 PLACE DE L EGLISE,ST GEORGES
200053213,00035,20005321300035,O,2016-01-01,,,,2015-09-08T08:42:48,false,1,,11,,RUE,DE LA MAIRIE,49250,LES BOIS D'ANJOU,,,49138,,,,,,,,,,,,,,,,,,,2016-01-01,A,COMMUNE DELEGUEE DE FONTAINE GUERIN,,,,84.11Z,NAFRev2,N,-0.189893,47.485328,0.94,housenumber,11 Rue de la Mairie 49250 Les Bois d'Anjou,49138_0073_00011,G,11 RUE DE LA MAIRIE,
200053213,00043,20005321300043,O,2016-01-01,,,,2016-01-12T11:30:55,false,1,,1,,RUE,DE LA MAIRIE,49250,LES BOIS D'ANJOU,,,49138,,,,,,,,,,,,,,,,,,,2016-01-01,A,COMMUNE DELEGUEE DE SAINT GEORGES DU BOIS,,,,84.11Z,NAFRev2,N,-0.189533,47.486491,0.94,housenumber,1 Rue de la Mairie 49250 Les Bois d'Anjou,49138_0073_00001,G,1 RUE DE LA MAIRIE,
200053213,00050,20005321300050,O,2016-01-01,03,2018,,2020-08-25T10:14:57,false,1,,11,,RUE,DE LA MAIRIE,49250,LES BOIS D'ANJOU,,,49138,,,,,,,,,,,,,,,,,,,2016-01-01,A,ECOLE PRIMAIRE PUBLIQUE FONTAINE GUERIN,,,,85.20Z,NAFRev2,N,-0.189893,47.485328,0.94,housenumber,11 Rue de la Mairie 49250 Les Bois d'Anjou,49138_0073_00011,G,11 RUE DE LA MAIRIE,
200053213,00068,20005321300068,O,2016-01-01,03,2018,,2020-08-25T10:14:57,false,1,,6,,,GRANDE RUE,49250,LES BOIS D'ANJOU,,,49138,,,,,,,,,,,,,,,,,,,2016-01-01,A,ECOLE DU TERTRE,,,,85.20Z,NAFRev2,N,-0.183488,47.477319,0.52,locality,La Grande Fouraudiere (Fontaine-Guérin) 49250 Les Bois d'Anjou,49138_b223,G,LA GRANDE FOURAUDIERE,FONTAINE GUERIN
200053213,00076,20005321300076,O,2016-01-01,03,2018,,2020-08-25T10:14:57,false,1,,5,,RUE,DE SAINT SICOT,49250,LES BOIS D'ANJOU,,,49138,,,,,,,,,,,,,,,,,,,2016-01-01,A,ECOLE PRIMAIRE PUBLIQUE DU BOIS MILON,,,,85.20Z,NAFRev2,N,-0.226108,47.497956,0.94,housenumber,5 Rue de Saint Sicot 49250 Les Bois d'Anjou,49280_0019_00005,G,5 RUE DE SAINT SICOT,
200053213,00084,20005321300084,O,2016-01-01,,,,2015-09-29T16:49:00,false,1,CAMPING LE CHAMP DU MOULIN,,,RTE,DE SAINT GEORGES DU BOIS,49250,LES BOIS D'ANJOU,,,49138,,,,,,,,,,,,,,,,,,,2016-01-01,A,HOTELLERIE DE PLEIN AIR,,,,55.30Z,NAFRev2,N,-0.224492,47.497245,0.85,street,Rue de Saint Georges (Saint-Georges-du-Bois) 49250 Les Bois d'Anjou,49280_0011,G,RUE DE SAINT GEORGES,SAINT GEORGES DU BOIS
200053221,00012,20005322100012,O,2016-01-01,,,,2015-09-08T09:45:41,true,1,,,,RUE,DE L'HOTEL DE VILLE,49250,LES BOIS D'ANJOU,,,49138,,,,,,,,,,,,,,,,,,,2016-01-01,A,,,,,88.99B,NAFRev2,N,-0.158386,47.443556,0.43,street,Rue de l'Union 49250 Les Bois d'Anjou,49049_0070,G,RUE DE L UNION,
200054773,00011,20005477300011,O,2016-01-01,,,,2015-10-20T15:54:49,true,1,MAIRIE,11,,RUE,DE LA MAIRIE,49250,LES BOIS D'ANJOU,,,49138,,,,,,,,,,,,,,,,,,,2016-01-01,A,,,,,88.99B,NAFRev2,N,-0.189893,47.485328,0.94,housenumber,11 Rue de la Mairie 49250 Les Bois d'Anjou,49138_0073_00011,G,11 RUE DE LA MAIRIE,
214900490,00019,21490049000019,O,1983-03-01,NN,,,2017-05-04T01:26:25,true,5,,1,,PL,DE L'EGLISE,49250,LES BOIS D'ANJOU,,,49138,,,,,,,,,,,,,,,,,,,2016-01-01,F,MAIRIE,,,,84.11Z,NAFRev2,O,-0.226779,47.497142,0.82,housenumber,1 Place de l'Eglise (st Georges) 49250 Les Bois d'Anjou,49280_0004_00001,G,1 PLACE DE L EGLISE,ST GEORGES
214900490,00027,21490049000027,O,1983-12-21,NN,,,2017-05-04T01:26:26,false,5,,6,,,GRANDE RUE,49250,LES BOIS D'ANJOU,,,49138,,,,,,,,,,,,,,,,,,,2016-01-01,F,ECOLE DU TERTRE,,,,85.20Z,NAFRev2,N,-0.183488,47.477319,0.52,locality,La Grande Fouraudiere (Fontaine-Guérin) 49250 Les Bois d'Anjou,49138_b223,G,LA GRANDE FOURAUDIERE,FONTAINE GUERIN
214900490,00035,21490049000035,O,1995-01-01,NN,,,2016-02-13T12:34:40,false,4,MAIRIE,,,PL,DE L EGLISE,49250,LES BOIS D'ANJOU,,,49138,,,,,,,,,,,,,,,,,,,2016-01-01,F,SCE ASSAINISSEMENT DE BRION,,,,37.00Z,NAFRev2,N,-0.226779,47.497142,0.81,street,Place de l'Eglise (st Georges) 49250 Les Bois d'Anjou,49280_0004,G,PLACE DE L EGLISE,ST GEORGES
214901381,00019,21490138100019,O,1983-03-01,NN,,,2017-05-04T01:26:27,true,4,,11,,RUE,DE LA MAIRIE,49250,LES BOIS D'ANJOU,,,49138,,,,,,,,,,,,,,,,,,,2016-01-01,F,MAIRIE,,,,84.11Z,NAFRev2,O,-0.189893,47.485328,0.94,housenumber,11 Rue de la Mairie 49250 Les Bois d'Anjou,49138_0073_00011,G,11 RUE DE LA MAIRIE,
214901381,00027,21490138100027,O,1983-12-21,NN,,,2017-05-04T01:26:27,false,4,,11,,RUE,DE LA MAIRIE,49250,LES BOIS D'ANJOU,,,49138,,,,,,,,,,,,,,,,,,,2016-01-01,F,ECOLE PRIMAIRE PUBLIQUE,,,,85.20Z,NAFRev2,N,-0.189893,47.485328,0.94,housenumber,11 Rue de la Mairie 49250 Les Bois d'Anjou,49138_0073_00011,G,11 RUE DE LA MAIRIE,
214901381,00035,21490138100035,O,1994-04-30,NN,,,,false,4,,,,,LE CHAMP DU MOULIN,49250,LES BOIS D'ANJOU,,,49138,,,,,,,,,,,,,,,,,,,2000-01-01,F,CAMPING MUNICIPAL LE MOULIN DE FONTAINE,,,,55.2C,NAF1993,N,-0.187151,47.49777,0.65,locality,Le Champ du Pont (Fontaine-Guérin) 49250 Les Bois d'Anjou,49138_b099,G,LE CHAMP DU PONT,FONTAINE GUERIN
214901381,00043,21490138100043,O,1997-01-01,NN,,,2011-07-21T16:05:56,false,4,MAIRIE,11,,RUE,DE LA MAIRIE,49250,LES BOIS D'ANJOU,,,49138,,,,,,,,,,,,,,,,,,,2011-07-13,F,LOTISSEMENT COMMUNAL,,,,42.99Z,NAFRev2,N,-0.189893,47.485328,0.94,housenumber,11 Rue de la Mairie 49250 Les Bois d'Anjou,49138_0073_00011,G,11 RUE DE LA MAIRIE,
214901381,00050,21490138100050,O,1999-01-01,NN,,,2016-02-13T12:38:12,false,4,MAIRIE,11,,RUE,DE LA MAIRIE,49250,LES BOIS D'ANJOU,,,49138,,,,,,,,,,,,,,,,,,,2016-01-01,F,ATELIER RELAIS NÂ¿2,,,,68.20B,NAFRev2,N,-0.189893,47.485328,0.94,housenumber,11 Rue de la Mairie 49250 Les Bois d'Anjou,49138_0073_00011,G,11 RUE DE LA MAIRIE,
214901381,00068,21490138100068,O,2004-01-19,NN,,,2016-02-13T12:38:12,false,4,MAIRIE,11,,RUE,DE LA MAIRIE,49250,LES BOIS D'ANJOU,,,49138,,,,,,,,,,,,,,,,,,,2016-01-01,F,HOTELLERIE PLEIN AIR FONTAINE GUERIN,,,,55.30Z,NAFRev2,N,-0.189893,47.485328,0.94,housenumber,11 Rue de la Mairie 49250 Les Bois d'Anjou,49138_0073_00011,G,11 RUE DE LA MAIRIE,
214902801,00015,21490280100015,O,1983-03-01,NN,,,2017-05-04T01:26:30,true,5,,1,,RUE,DE LA MAIRIE,49250,LES BOIS D'ANJOU,,,49138,,,,,,,,,,,,,,,,,,,2016-01-01,F,MAIRIE,,,,84.11Z,NAFRev2,O,-0.189533,47.486491,0.94,housenumber,1 Rue de la Mairie 49250 Les Bois d'Anjou,49138_0073_00001,G,1 RUE DE LA MAIRIE,
214902801,00023,21490280100023,O,1983-12-21,NN,,,2017-05-04T01:26:30,false,4,,5,,RUE,DE SAINT SICOT,49250,LES BOIS D'ANJOU,,,49138,,,,,,,,,,,,,,,,,,,2016-01-01,F,ECOLE PRIMAIRE PUBLIQUE,,,,85.20Z,NAFRev2,N,-0.226108,47.497956,0.94,housenumber,5 Rue de Saint Sicot 49250 Les Bois d'Anjou,49280_0019_00005,G,5 RUE DE SAINT SICOT,
214902801,00031,21490280100031,O,1999-12-25,NN,,,2016-02-13T12:45:14,false,3,MAIRIE,1,,RUE,DE LA MAIRIE,49250,LES BOIS D'ANJOU,,,49138,,,,,,,,,,,,,,,,,,,2016-01-01,F,SERVICE D'ASSAINISSEMENT,,,,37.00Z,NAFRev2,N,-0.189533,47.486491,0.94,housenumber,1 Rue de la Mairie 49250 Les Bois d'Anjou,49138_0073_00001,G,1 RUE DE LA MAIRIE,
244900031,00034,24490003100034,O,2000-12-25,NN,,,2006-10-26T23:42:32,false,2,MAIRIE,1,,PL,NOTRE DAME,49250,LES BOIS D'ANJOU,,,49138,,,,,,,,,,,,,,,,,,,2006-01-01,F,SERVICE D'ASSAINISSEMENT FONTAINE GUERIN,,,,90.0A,NAFRev1,N,4.7710858,48.4780232,0.77,poi.park,Place Notre-Dame (Parc) La Porte du Der,https://osm.org/way/85794392,G,,
244900882,00030,24490088200030,O,2000-01-01,NN,,,2017-02-06T14:47:47,false,4,,,,,LE MOULIN DE FONTAINE,49250,LES BOIS D'ANJOU,,,49138,,,,,,,,,,,,,,,,,,,2016-01-01,F,VILLAGE VACANCES DE FONTAINE GUERIN,,,,84.13Z,NAFRev2,N,-0.194159,47.488593,0.83,locality,Moulin de Fontaine (Fontaine-Guérin) 49250 Les Bois d'Anjou,49138_b315,G,MOULIN DE FONTAINE,FONTAINE GUERIN
254902596,00017,25490259600017,O,2004-06-04,03,2018,,2020-08-25T10:20:27,true,4,MAIRIE,1,,RUE,DE LA MAIRIE,49250,LES BOIS D'ANJOU,,,49138,,,,,,,,,,,,,,,,,,,2008-01-01,A,,,,,84.12Z,NAFRev2,O,-0.189533,47.486491,0.94,housenumber,1 Rue de la Mairie 49250 Les Bois d'Anjou,49138_0073_00001,G,1 RUE DE LA MAIRIE,
264903428,00011,26490342800011,O,1995-12-25,NN,,,2016-02-13T12:37:25,true,3,,1,,PL,DE L'EGLISE,49250,LES BOIS D'ANJOU,,,49138,,,,,,,,,,,,,,,,,,,2016-01-01,F,CDE,,,,88.99B,NAFRev2,N,-0.226779,47.497142,0.82,housenumber,1 Place de l'Eglise (st Georges) 49250 Les Bois d'Anjou,49280_0004_00001,G,1 PLACE DE L EGLISE,ST GEORGES
264903527,00010,26490352700010,O,1995-12-25,NN,,,2016-02-13T12:37:26,true,3,MAIRIE,1,,RUE,DE LA MAIRIE,49250,LES BOIS D'ANJOU,,,49138,,,,,,,,,,,,,,,,,,,2016-01-01,F,CCAS,,,,88.99B,NAFRev2,N,-0.189533,47.486491,0.94,housenumber,1 Rue de la Mairie 49250 Les Bois d'Anjou,49138_0073_00001,G,1 RUE DE LA MAIRIE,
264903550,00012,26490355000012,O,1995-12-25,NN,,,2016-02-13T12:37:28,true,3,,,,RUE,DE L'HOTEL DE VILLE,49250,LES BOIS D'ANJOU,,,49138,,,,,,,,,,,,,,,,,,,2016-01-01,F,CCAS,,,,88.99B,NAFRev2,N,-0.158386,47.443556,0.43,street,Rue de l'Union 49250 Les Bois d'Anjou,49049_0070,G,RUE DE L UNION,
264903576,00017,26490357600017,O,1995-12-25,NN,,,2016-02-13T12:37:29,true,3,MAIRIE,1,,PL,DE L'EGLISE,49250,LES BOIS D'ANJOU,,,49138,,,,,,,,,,,,,,,,,,,2016-01-01,F,CCAS,,,,88.99B,NAFRev2,N,-0.226779,47.497142,0.82,housenumber,1 Place de l'Eglise (st Georges) 49250 Les Bois d'Anjou,49280_0004_00001,G,1 PLACE DE L EGLISE,ST GEORGES
264905670,00016,26490567000016,O,1995-12-25,NN,,,2016-02-13T12:46:31,true,3,MAIRIE,1,,RUE,DE LA MAIRIE,49250,LES BOIS D'ANJOU,,,49138,,,,,,,,,,,,,,,,,,,2016-01-01,F,CDE,,,,88.99B,NAFRev2,N,-0.189533,47.486491,0.94,housenumber,1 Rue de la Mairie 49250 Les Bois d'Anjou,49138_0073_00001,G,1 RUE DE LA MAIRIE,
264905696,00011,26490569600011,O,1995-12-25,NN,,,2016-02-13T12:46:33,true,3,,,,,MAIRIE,49250,LES BOIS D'ANJOU,,,49138,,,,,,,,,,,,,,,,,,,2016-01-01,F,CDE,,,,88.99B,NAFRev2,N,-0.189533,47.486491,0.91,street,Rue de la Mairie 49250 Les Bois d'Anjou,49138_0073,G,RUE DE LA MAIRIE,
294900527,00010,29490052700010,O,1983-08-10,NN,,,2016-01-12T12:44:52,true,3,MAIRIE,1,,PL,DE L'EGLISE,49250,LES BOIS D'ANJOU,,,49138,,,,,,,,,,,,,,,,,,,2004-08-27,F,,,,,70.1C,NAFRev1,N,-0.226779,47.497142,0.82,housenumber,1 Place de l'Eglise (st Georges) 49250 Les Bois d'Anjou,49280_0004_00001,G,1 PLACE DE L EGLISE,ST GEORGES
294901889,00013,29490188900013,O,1982-11-26,NN,,,2006-10-26T23:46:23,true,3,MAIRIE,,,RUE,DE LA MAIRIE,49250,LES BOIS D'ANJOU,,,49138,,,,,,,,,,,,,,,,,,,2006-12-31,F,,,,,70.1C,NAFRev1,N,-0.189533,47.486491,0.94,street,Rue de la Mairie 49250 Les Bois d'Anjou,49138_0073,G,RUE DE LA MAIRIE,
294901947,00019,29490194700019,O,1996-04-10,NN,,,2016-01-12T11:20:58,true,4,MAIRIE,1,,RUE,DE LA MAIRIE,49250,LES BOIS D'ANJOU,,,49138,,,,,,,,,,,,,,,,,,,2013-03-11,F,,,,,42.99Z,NAFRev2,N,-0.189533,47.486491,0.94,housenumber,1 Rue de la Mairie 49250 Les Bois d'Anjou,49138_0073_00001,G,1 RUE DE LA MAIRIE,
302625256,00052,30262525600052,O,2001-04-04,NN,,,2006-12-15T00:15:19,false,4,,,,,LES GAUVELLIERES,49250,LES BOIS D'ANJOU,,,49138,,,,,,,,,,,,,,,,,,,2003-06-30,F,,,,,60.2L,NAFRev1,N,-0.100633,47.452948,0.48,street,Lieu Dit les Naudieres 49250 Les Bois d'Anjou,49138_oizh7o,G,LIEU DIT LES NAUDIERES,
303868277,00011,30386827700011,O,,,,,,true,1,,,,,BOURG,49250,LES BOIS D'ANJOU,,,49138,,,,,,,,,,,,,,,,,,,1984-12-25,F,,,,,62.11,NAP,N,-0.155702,47.44172,0.91,locality,Le Bourg (brion) (Brion) 49250 Les Bois d'Anjou,49049_b098,G,LE BOURG,BRION
305056681,00029,30505668100029,O,,NN,,,,true,1,,,,,LA COQUERIE,49250,LES BOIS D'ANJOU,,,49138,,,,,,,,,,,,,,,,,,,1994-09-14,F,,,,,45.3A,NAF1993,N,1.7650134,48.8467985,0.89,poi.track,Chemin de la Coquerie Flexanville,https://osm.org/way/67202593,G,,
306438672,00058,30643867200058,O,2005-05-13,,,,2021-02-23T10:37:27,true,2,,,,,DOMAINE DES HAYES,49250,LES BOIS D'ANJOU,,,49138,,,,,,,,,,,,,,,,,,,2008-01-01,A,,,,,90.01Z,NAFRev2,N,-0.134894,47.437111,0.94,street,Domaine des Hayes 49250 Les Bois d'Anjou,49049_b942,G,DOMAINE DES HAYES,
307338079,00030,30733807900030,O,1982-01-01,NN,,,2016-01-12T12:44:43,true,6,,,,CHE,DE LA LIGNE,49250,LES BOIS D'ANJOU,,,49138,,,,,,,,,,,,,,,,,,,2009-05-31,F,,,,,82.99Z,NAFRev2,O,7.4606276,49.036006,0.84,poi.track,Chemin de la Longue Ligne Bitche,https://osm.org/way/233767885,G,,
308854884,00027,30885488400027,O,1988-09-24,NN,,,2016-01-12T00:10:50,true,3,LA BARRIERE,3,,RUE,DES EPINETTES,49250,LES BOIS D'ANJOU,,,49138,,,,,,,,,,,,,,,,,,,2008-01-01,A,,,,,01.41Z,NAFRev2,N,-0.191365,47.487041,0.7,housenumber,3 Chemin des Epinettes 49250 Les Bois d'Anjou,49138_0026_00003,G,3 CHEMIN DES EPINETTES,
308865757,00014,30886575700014,O,1976-01-01,NN,,,2016-01-12T12:44:48,true,4,,,,,LES CONTREVENTS VERTS,49250,LES BOIS D'ANJOU,,,49138,,,,,,,,,,,,,,,,,,,2004-06-30,F,,,,,55.3A,NAFRev1,O,-0.168732,47.416438,0.93,locality,Les Contrevents Verts (Brion) 49250 Les Bois d'Anjou,49049_b292,G,LES CONTREVENTS VERTS,BRION
309931640,00069,30993164000069,O,1998-05-01,NN,,,2009-06-27T03:51:58,false,5,,,,,ZA DU CLOS DE VILLIERS,49250,LES BOIS D'ANJOU,,,49138,,,,,,,,,,,,,,,,,,,2007-06-04,F,,,,,51.8P,NAFRev1,O,-0.1890729,47.480762,0.78,poi.industrial,Zone Artisanale du Clos de Villiers (Zone industrielle) Les Bois-d'Anjou,https://osm.org/way/262529839,G,,
310006754,00025,31000675400025,O,1998-01-01,NN,,,2008-01-04T19:58:27,true,3,,,,,LE BORDAGE,49250,LES BOIS D'ANJOU,,,49138,,,,,,,,,,,,,,,,,,,2007-08-05,F,,,,,01.1A,NAFRev1,N,-1.162019,47.2477976,0.89,poi.farmyard,Le Bordage (Corps de ferme) Montrevault-sur-Èvre,https://osm.org/way/404451616,G,,
310006762,00028,31000676200028,O,1998-01-01,NN,,,2017-04-02T04:00:24,true,4,,,,,LE BORDAGE,49250,LES BOIS D'ANJOU,,,49138,,,,,,,,,,,,,,,,,,,2015-10-31,F,,,,,01.11Z,NAFRev2,N,-1.162019,47.2477976,0.89,poi.farmyard,Le Bordage (Corps de ferme) Montrevault-sur-Èvre,https://osm.org/way/404451616,G,,
310300405,00043,31030040500043,O,1998-04-04,NN,,,2016-01-12T13:21:33,true,4,LES CONTREVENTS VERTS,,,,LE PRE BRIDIER,49250,LES BOIS D'ANJOU,,,49138,,,,,,,,,,,,,,,,,,,2008-10-31,F,,,,,43.34Z,NAFRev2,N,-0.137619,47.464202,0.46,locality,Moulin de la Riviere Brion (Brion) 49250 Les Bois d'Anjou,49049_b510,G,MOULIN DE LA RIVIERE BRION,BRION
310530118,00069,31053011800069,O,1991-07-01,NN,,,2016-01-12T13:29:29,false,4,,,,,LA PETITE BELLANGERIE,49250,LES BOIS D'ANJOU,,,49138,,,,,,,,,,,,,,,,,,,1994-12-25,F,,,,,21.2B,NAF1993,O,-0.152462,47.417793,0.85,locality,La Petite Belangerie (Brion) 49250 Les Bois d'Anjou,49049_b626,G,LA PETITE BELANGERIE,BRION
310530118,00101,31053011800101,O,1994-03-31,02,2018,1039BP,2020-08-25T10:24:39,false,4,,,,,ZAC DES TROIS ORMEAUX,49250,LES BOIS D'ANJOU,,,49138,,,,,,,,,,,,,,,,,,,2008-01-01,A,,,,,46.31Z,NAFRev2,O,-0.157915,47.4508,0.71,street,Les Trois Ormeaux 49250 Les Bois d'Anjou,49049_b900,G,LES TROIS ORMEAUX,
310850219,00018,31085021900018,O,,NN,,,,true,1,,27,,RUE,DE LA MAIRIE,49250,LES BOIS D'ANJOU,,,49138,,,,,,,,,,,,,,,,,,,1995-05-16,F,,,,,45.2B,NAF1993,O,-0.190298,47.483773,0.94,housenumber,27 Rue de la Mairie 49250 Les Bois d'Anjou,49138_0073_00027,G,27 RUE DE LA MAIRIE,
311327035,00011,31132703500011,O,1900-01-01,NN,,,2016-01-12T13:12:25,true,3,,,,,MAIRIE,49250,LES BOIS D'ANJOU,,,49138,,,,,,,,,,,,,,,,,,,2008-01-01,A,,,,,93.12Z,NAFRev2,N,-0.189533,47.486491,0.91,street,Rue de la Mairie 49250 Les Bois d'Anjou,49138_0073,G,RUE DE LA MAIRIE,
311493621,00016,31149362100016,O,1964-01-01,NN,,,2016-01-12T12:55:08,true,7,,,,LD,LA FONTAINE,49250,LES BOIS D'ANJOU,,,49138,,,,,,,,,,,,,,,,,,,2010-01-31,F,,,,,43.31Z,NAFRev2,O,-0.153153,47.438294,0.93,street,Rue de la Fontaine 49250 Les Bois d'Anjou,49049_0054,G,RUE DE LA FONTAINE,
314432188,00048,31443218800048,O,1986-09-01,NN,,4331ZB,2020-04-07T03:49:31,true,4,,5,,RUE,DE LA MAIRIE,49250,LES BOIS D'ANJOU,,,49138,,,,,,,,,,,,,,,,,,,2020-03-31,F,,,,,43.31Z,NAFRev2,N,-0.189684,47.485931,0.94,housenumber,5 Rue de la Mairie 49250 Les Bois d'Anjou,49138_0073_00005,G,5 RUE DE LA MAIRIE,
314959529,00038,31495952900038,O,1994-07-12,NN,,,2016-01-12T13:29:35,true,3,CHEZ MME ROBERT MARIANNE,,,PL,DE L'EGLISE,49250,LES BOIS D'ANJOU,,,49138,,,,,,,,,,,,,,,,,,,2006-02-23,F,,,,,45.4A,NAFRev1,N,-0.226779,47.497142,0.81,street,Place de l'Eglise (st Georges) 49250 Les Bois d'Anjou,49280_0004,G,PLACE DE L EGLISE,ST GEORGES
315525642,00023,31552564200023,O,1980-05-01,NN,,,2021-04-02T03:34:59,true,6,,22,,RTE,DE BRION,49250,LES BOIS D'ANJOU,,,49138,,,,,,,,,,,,,,,,,,,2013-09-01,F,,,,,43.22B,NAFRev2,N,-0.186108,47.483399,0.83,housenumber,22 Route de Brion 49250 Les Bois d'Anjou,49138_0009_00022,G,22 ROUTE DE BRION,
316019173,00020,31601917300020,O,,NN,,,,true,1,,,,IMP,DE LA FORET,49250,LES BOIS D'ANJOU,,,49138,,,,,,,,,,,,,,,,,,,,F,,,,,87.08,NAP,N,-0.184696,47.484192,0.83,street,Impasse de la Forêt 49250 Les Bois d'Anjou,49138_0039,G,IMPASSE DE LA FORET,
316233238,00070,31623323800070,O,2008-02-25,NN,,,2014-06-14T00:47:22,true,2,,3,,RUE,CELESTINE GARNIER,49250,LES BOIS D'ANJOU,,,49138,,,,,,,,,,,,,,,,,,,2012-02-29,F,,,,,47.29Z,NAFRev2,O,-0.187739,47.485853,0.94,housenumber,3 Rue Célestine Garnier 49250 Les Bois d'Anjou,49138_0013_00003,G,3 RUE CELESTINE GARNIER,
316233238,00088,31623323800088,O,2009-05-01,NN,,,2013-05-18T02:52:17,false,2,MOULIN DE FONTAINE,,,,PLAN D'EAU FONTAINE GUERIN,49250,LES BOIS D'ANJOU,,,49138,,,,,,,,,,,,,,,,,,,2012-02-29,F,,,,,47.29Z,NAFRev2,O,-0.1973827,47.4884519,0.87,poi.fishing,Plan d'Eau de Fontaine-Guérin (Zone de pêche) Les Bois-d'Anjou,https://osm.org/way/171127659,G,,
316549922,00029,31654992200029,O,1900-01-01,NN,,,2016-01-12T12:35:03,false,3,,,,,LA LANDE DE GRUAU,49250,LES BOIS D'ANJOU,,,49138,,,,,,,,,,,,,,,,,,,2008-01-01,A,,,,,90.04Z,NAFRev2,N,-0.105318,47.457418,0.92,locality,Sous la Lande de Gruau (Brion) 49250 Les Bois d'Anjou,49049_b931,G,SOUS LA LANDE DE GRUAU,BRION
316773001,00029,31677300100029,O,1983-10-01,NN,,,2016-01-12T13:21:33,true,4,,,,,DOMAINE DES HAYES,49250,LES BOIS D'ANJOU,,,49138,,,,,,,,,,,,,,,,,,,2004-12-31,F,,,,,70.2C,NAFRev1,N,-0.134894,47.437111,0.94,street,Domaine des Hayes 49250 Les Bois d'Anjou,49049_b942,G,DOMAINE DES HAYES,
317263663,00039,31726366300039,O,1984-07-01,NN,,,2016-01-12T11:21:00,true,3,,,,,LA ROCHE ABILEN,49250,LES BOIS D'ANJOU,,,49138,,,,,,,,,,,,,,,,,,,2000-12-31,F,,,,,74.8K,NAF1993,N,-0.215514,47.489789,0.32,street,La Robinière 49250 Les Bois d'Anjou,49138_onifwy,G,LA ROBINIERE,
317918092,00048,31791809200048,O,2005-05-01,,,,2016-01-12T11:30:49,true,2,,3,,RUE,DES ROSIERS,49250,LES BOIS D'ANJOU,,,49138,,,,,,,,,,,,,,,,,,,2007-03-31,F,,,,,55.3A,NAFRev1,N,-0.224653,47.497908,0.94,housenumber,3 Rue des Rosiers 49250 Les Bois d'Anjou,49280_0017_00003,G,3 RUE DES ROSIERS,
319289021,00010,31928902100010,O,1977-12-01,NN,,,,true,1,,,,,LES CHEMINEES,49250,LES BOIS D'ANJOU,,,49138,,,,,,,,,,,,,,,,,,,2000-01-31,F,,,,,01.3Z,NAF1993,N,-0.190992,47.487342,0.7,street,Chemin des Epinettes 49250 Les Bois d'Anjou,49138_0026,G,CHEMIN DES EPINETTES,
320692825,00039,32069282500039,O,2004-08-04,NN,,,2009-07-07T04:03:17,true,4,,,,,LES HUBINIERES,49250,LES BOIS D'ANJOU,,,49138,,,,,,,,,,,,,,,,,,,2008-01-01,F,,,,,90.01Z,NAFRev2,N,-0.215514,47.489789,0.6,street,La Robinière 49250 Les Bois d'Anjou,49138_onifwy,G,LA ROBINIERE,
321012403,00028,32101240300028,O,1988-01-01,NN,,,2016-01-12T12:26:20,false,4,,,,,CLOSERIE DE LA VISSELIERE,49250,LES BOIS D'ANJOU,,,49138,,,,,,,,,,,,,,,,,,,1999-06-21,F,,,,,01.2J,NAF1993,N,-0.221675,47.496843,0.46,street,Rue de la Chapelière (Saint-Georges-du-Bois) 49250 Les Bois d'Anjou,49280_0315,G,RUE DE LA CHAPELIERE,SAINT GEORGES DU BOIS
321283210,00037,32128321000037,O,2010-12-01,,,,2013-09-13T08:22:32,true,2,,,,,LA TOUR DU PIN,49250,LES BOIS D'ANJOU,,,49138,,,,,,,,,,,,,,,,,,,2012-06-01,F,,,,,70.22Z,NAFRev2,N,-0.162593,47.496928,0.92,locality,La Tour du Pin (Fontaine-Guérin) 49250 Les Bois d'Anjou,49138_b530,G,LA TOUR DU PIN,FONTAINE GUERIN
321322059,00023,32132205900023,O,,NN,,,,true,1,,,,RUE,CELESTINE GARNIER,49250,LES BOIS D'ANJOU,,,49138,,,,,,,,,,,,,,,,,,,1995-05-31,F,,,,,52.1B,NAF1993,N,-0.188396,47.486403,0.94,street,Rue Célestine Garnier 49250 Les Bois d'Anjou,49138_0013,G,RUE CELESTINE GARNIER,
321948762,00018,32194876200018,O,,NN,,,,true,1,,,,,BOURG,49250,LES BOIS D'ANJOU,,,49138,,,,,,,,,,,,,,,,,,,1987-06-30,F,,,,,55.10,NAP,N,-0.155702,47.44172,0.91,locality,Le Bourg (brion) (Brion) 49250 Les Bois d'Anjou,49049_b098,G,LE BOURG,BRION
322893066,00033,32289306600033,O,2009-11-13,,,,2021-02-23T10:46:24,true,1,LIEUDIT CHAMP DE LA PREE,,,CHE,DE LA LIGNE,49250,LES BOIS D'ANJOU,,,49138,,,,,,,,,,,,,,,,,,,2009-11-13,A,,,,,68.20B,NAFRev2,N,7.4606276,49.036006,0.84,poi.track,Chemin de la Longue Ligne Bitche,https://osm.org/way/233767885,G,,
322999897,00018,32299989700018,O,,,,,,true,1,,,,,LA PIELLERIE,49250,LES BOIS D'ANJOU,,,49138,,,,,,,,,,,,,,,,,,,1984-12-25,F,,,,,84.13,NAP,N,-0.152462,47.417793,0.52,locality,La Petite Belangerie (Brion) 49250 Les Bois d'Anjou,49049_b626,G,LA PETITE BELANGERIE,BRION
323628859,00049,32362885900049,O,2019-02-08,,,,2020-10-02T03:42:13,true,3,BRION,5,,,GRANDE RUE,49250,LES BOIS D'ANJOU,,,49138,,,,,,,,,,,,,,,,,,,2020-09-29,F,,,,DESIGN KITCHEN,47.89Z,NAFRev2,N,2.6167712,49.8237911,0.9,poi.forest,Grande Rue (Forêt) Cayeux-en-Santerre,https://osm.org/way/42197994,G,,
324170232,00023,32417023200023,O,1992-03-27,NN,,,2006-10-27T01:27:45,false,3,,,,,LA TOUR DU PIN,49250,LES BOIS D'ANJOU,,,49138,,,,,,,,,,,,,,,,,,,2004-01-01,F,,,,,92.3A,NAFRev1,N,-0.162593,47.496928,0.92,locality,La Tour du Pin (Fontaine-Guérin) 49250 Les Bois d'Anjou,49138_b530,G,LA TOUR DU PIN,FONTAINE GUERIN