siren,nic,siret,statutDiffusionEtablissement,dateCreationEtablissement,trancheEffectifsEtablissement,anneeEffectifsEtablissement,activitePrincipaleRegistreMetiersEtablissement,dateDernierTraitementEtablissement,etablissementSiege,nombrePeriodesEtablissement,complementAdresseEtablissement,numeroVoieEtablissement,indiceRepetitionEtablissement,typeVoieEtablissement,libelleVoieEtablissement,codePostalEtablissement,libelleCommuneEtablissement,libelleCommuneEtrangerEtablissement,distributionSpecialeEtablissement,codeCommuneEtablissement,codeCedexEtablissement,libelleCedexEtablissement,codePaysEtrangerEtablissement,libellePaysEtrangerEtablissement,complementAdresse2Etablissement,numeroVoie2Etablissement,indiceRepetition2Etablissement,typeVoie2Etablissement,libelleVoie2Etablissement,codePostal2Etablissement,libelleCommune2Etablissement,libelleCommuneEtranger2Etablissement,distributionSpeciale2Etablissement,codeCommune2Etablissement,codeCedex2Etablissement,libelleCedex2Etablissement,codePaysEtranger2Etablissement,libellePaysEtranger2Etablissement,dateDebut,etatAdministratifEtablissement,enseigne1Etablissement,enseigne2Etablissement,enseigne3Etablissement,denominationUsuelleEtablissement,activitePrincipaleEtablissement,nomenclatureActivitePrincipaleEtablissement,caractereEmployeurEtablissement,longitude,latitude,geo_score,geo_type,geo_adresse,geo_id,geo_ligne,geo_l4,geo_l5
216501312,00013,21650131200013,O,1983-03-01,NN,,,2018-09-29T12:06:02,true,3,,,,,,65350,CASTELVIEILH,,,65131,,,,,,,,,,,,,,,,,,,2008-01-01,A,MAIRIE,,,,84.11Z,NAFRev2,N,,,0,,,,,,
216501312,00021,21650131200021,O,1983-12-21,01,2018,,2020-08-25T10:18:30,false,3,,5,,RUE,DE L'EGLISE,65350,CASTELVIEILH,,,65131,,,,,,,,,,,,,,,,,,,2008-01-01,A,ECOLE PRIMAIRE PUBLIQUE,,,,85.20Z,NAFRev2,N,0.196238,43.284878,0.93,housenumber,5 Rue de l'Eglise 65350 Castelvieilh,65131_0015_00005,G,5 RUE DE L EGLISE,
266502467,00019,26650246700019,O,1984-11-20,NN,,,2010-06-26T03:14:02,true,3,,,,,MAIRIE,65350,CASTELVIEILH,,,65131,,,,,,,,,,,,,,,,,,,2008-01-01,A,CCAS,,,,88.99B,NAFRev2,N,3.0709671,50.6304695,0.92,poi.townhall,Hôtel de Ville Lille,https://osm.org/way/40917078,G,,
300259074,00015,30025907400015,O,2005-07-01,NN,,4312BA,2015-03-17T00:10:47,true,2,,12,,RTE,DE BOUILH PEREUILH,65350,CASTELVIEILH,,,65131,,,,,,,,,,,,,,,,,,,2008-01-01,A,,,,,43.12B,NAFRev2,N,0.192766,43.288867,0.85,housenumber,12 Route de Bouilh-pereuilh 65350 Castelvieilh,65131_0005_00012,G,12 ROUTE DE BOUILH PEREUILH,
300334059,00015,30033405900015,O,,NN,,,,true,1,,,,,IMM DOUCET,65350,CASTELVIEILH,,,65131,,,,,,,,,,,,,,,,,,,1988-12-25,F,,,,,73.05,NAP,N,,,0,,,,,,
309494110,00013,30949411000013,O,1900-01-01,NN,,,2016-04-26T01:57:45,true,4,,,,,MAIRIE,65350,CASTELVIEILH,,,65131,,,,,,,,,,,,,,,,,,,2013-12-08,A,,,,,93.12Z,NAFRev2,O,3.0709671,50.6304695,0.92,poi.townhall,Hôtel de Ville Lille,https://osm.org/way/40917078,G,,
310951991,00028,31095199100028,O,,NN,,,,true,1,,,,,,65350,CASTELVIEILH,,,65131,,,,,,,,,,,,,,,,,,,1988-12-31,F,,,,,55.73,NAP,N,,,0,,,,,,
311674717,00013,31167471700013,O,1969-01-01,,,,2008-11-07T00:26:37,true,4,,15,,RTE,DE BOUILH PERREUILH,65350,CASTELVIEILH,,,65131,,,,,,,,,,,,,,,,,,,2005-08-31,F,,,,,45.2V,NAFRev1,N,0.192271,43.288227,0.78,housenumber,15 Route de Bouilh-pereuilh 65350 Castelvieilh,65131_0005_00015,G,15 ROUTE DE BOUILH PEREUILH,
318902145,00016,31890214500016,O,1980-05-02,NN,,,2008-11-07T00:34:46,false,4,,,,,,65350,CASTELVIEILH,,,65131,,,,,,,,,,,,,,,,,,,1993-07-31,F,,,,,45.3E,NAF1993,N,,,0,,,,,,
319377404,00011,31937740400011,O,,,,,,true,1,,,,,,65350,CASTELVIEILH,,,65131,,,,,,,,,,,,,,,,,,,1985-12-25,F,,,,,55.60,NAP,N,,,0,,,,,,
320384100,00014,32038410000014,O,,,,,,true,1,,,,,,65350,CASTELVIEILH,,,65131,,,,,,,,,,,,,,,,,,,1984-12-25,F,,,,,55.60,NAP,N,,,0,,,,,,
324575679,00018,32457567900018,O,,,,,,true,1,,,,,,65350,CASTELVIEILH,,,65131,,,,,,,,,,,,,,,,,,,1984-12-25,F,,,,,62.46,NAP,N,,,0,,,,,,
327843033,00017,32784303300017,O,1983-07-18,NN,,,2012-12-07T11:36:47,false,4,,,,,,65350,CASTELVIEILH,,,65131,,,,,,,,,,,,,,,,,,,2012-11-20,F,,,,,68.20B,NAFRev2,N,,,0,,,,,,
331463612,00019,33146361200019,O,,NN,,,,true,1,,,,,,65350,CASTELVIEILH,,,65131,,,,,,,,,,,,,,,,,,,1988-12-31,F,,,,,55.73,NAP,N,,,0,,,,,,
334203544,00013,33420354400013,O,,NN,,,,true,1,,,,,,65350,CASTELVIEILH,,,65131,,,,,,,,,,,,,,,,,,,1990-06-26,F,,,,,64.47,NAP,N,,,0,,,,,,
335294872,00015,33529487200015,O,1986-04-03,NN,,,2008-01-04T21:09:32,true,3,,,,,QUARTIER LASBORDES,65350,CASTELVIEILH,,,65131,,,,,,,,,,,,,,,,,,,2008-01-01,A,,,,,41.20A,NAFRev2,N,0.193886,43.28333,0.49,street,Chemin de Lasbordes 65350 Castelvieilh,65131_0035,G,CHEMIN DE LASBORDES,
343409785,00015,34340978500015,O,,NN,,,,true,1,,,,,,65350,CASTELVIEILH,,,65131,,,,,,,,,,,,,,,,,,,1989-12-31,F,,,,,65.06,NAP,N,,,0,,,,,,
351925540,00012,35192554000012,O,1989-01-01,NN,,,2016-01-12T00:13:21,false,3,,,,,,65350,CASTELVIEILH,,,65131,,,,,,,,,,,,,,,,,,,2008-01-01,A,,,,,68.20B,NAFRev2,N,,,0,,,,,,
351925540,00020,35192554000020,O,1990-05-01,NN,,,2008-01-04T23:36:26,true,3,,,,,,65350,CASTELVIEILH,,,65131,,,,,,,,,,,,,,,,,,,2008-01-01,A,,,,,01.11Z,NAFRev2,N,,,0,,,,,,
390756534,00017,39075653400017,O,1993-04-06,NN,,,2018-06-22T08:23:06,true,3,,22,,CHE,LASBORDES,65350,CASTELVIEILH,,,65131,,,,,,,,,,,,,,,,,,,2008-01-01,A,,,,,68.20A,NAFRev2,N,0.192995,43.280412,0.87,housenumber,22 Chemin de Lasbordes 65350 Castelvieilh,65131_0035_00022,G,22 CHEMIN DE LASBORDES,
391885399,00017,39188539900017,O,1993-06-05,NN,,,2008-01-04T23:58:14,true,3,,,,,PRESBYTERE,65350,CASTELVIEILH,,,65131,,,,,,,,,,,,,,,,,,,2008-01-01,A,,,,,93.12Z,NAFRev2,N,-4.4890765,48.2459539,0.9,poi.community_centre,Presbytère (Salle des fêtes) Crozon,https://osm.org/way/53987643,G,,
395002611,00014,39500261100014,O,1994-05-03,NN,,4333ZZ,2019-02-07T19:33:25,true,7,,15,,CHE,DE BOUILH-PEREUILH,65350,CASTELVIEILH,,,65131,,,,,,,,,,,,,,,,,,,2017-11-30,F,,,,,43.33Z,NAFRev2,N,0.192271,43.288227,0.77,housenumber,15 Route de Bouilh-pereuilh 65350 Castelvieilh,65131_0005_00015,G,15 ROUTE DE BOUILH PEREUILH,
395076300,00015,39507630000015,O,1994-04-20,NN,,,2008-01-04T18:19:50,true,3,,,,,,65350,CASTELVIEILH,,,65131,,,,,,,,,,,,,,,,,,,2008-01-01,A,,,,,01.11Z,NAFRev2,N,,,0,,,,,,
395289549,00010,39528954900010,O,1993-01-01,NN,,,2008-08-17T05:51:19,true,3,,,,,,65350,CASTELVIEILH,,,65131,,,,,,,,,,,,,,,,,,,2008-01-01,A,,,,,01.11Z,NAFRev2,N,,,0,,,,,,
399223528,00049,39922352800049,O,2009-01-01,,,,2010-04-13T08:18:12,false,2,,2,,RUE,DE L'EGLISE,65350,CASTELVIEILH,,,65131,,,,,,,,,,,,,,,,,,,2009-12-31,F,,,,,71.12B,NAFRev2,N,0.194085,43.283863,0.93,housenumber,2 Rue de l'Eglise 65350 Castelvieilh,65131_0015_00002,G,2 RUE DE L EGLISE,
400094785,00013,40009478500013,O,1992-12-31,NN,,,2014-03-12T08:28:46,false,5,,,,,,65350,CASTELVIEILH,,,65131,,,,,,,,,,,,,,,,,,,2011-06-01,F,,,,,01.11Z,NAFRev2,N,,,0,,,,,,
400094785,00021,40009478500021,O,2004-01-15,NN,,,2008-01-04T19:22:24,false,3,,3,,,ROUTE DE TRIE,65350,CASTELVIEILH,,,65131,,,,,,,,,,,,,,,,,,,2008-01-01,A,,,,,81.30Z,NAFRev2,N,0.193364,43.286153,0.93,housenumber,3 Route de Trie 65350 Castelvieilh,65131_0055_00003,G,3 ROUTE DE TRIE,
400094785,00039,40009478500039,O,2011-01-01,,,,2021-02-23T11:23:57,true,1,,3,,RTE,DE TRIE,65350,CASTELVIEILH,,,65131,,,,,,,,,,,,,,,,,,,2011-01-01,A,,,,,01.11Z,NAFRev2,N,0.193364,43.286153,0.8,housenumber,3 Route de Trie 65350 Castelvieilh,65131_0055_00003,G,3 ROUTE DE TRIE,
400535944,00013,40053594400013,O,1995-04-01,NN,,,2012-12-07T13:32:52,false,5,,,,,,65350,CASTELVIEILH,,,65131,,,,,,,,,,,,,,,,,,,2008-01-01,F,,,,,90.02Z,NAFRev2,O,,,0,,,,,,
400535944,00021,40053594400021,O,1997-10-01,,,,,false,3,,,,,,65350,CASTELVIEILH,,,65131,,,,,,,,,,,,,,,,,,,2000-09-11,F,,,,,01.3Z,NAF1993,N,,,0,,,,,,
400535944,00039,40053594400039,O,1992-01-01,,,,2012-12-17T15:08:02,true,5,,58,,CHE,DE LASBORDES,65350,CASTELVIEILH,,,65131,,,,,,,,,,,,,,,,,,,2012-12-20,A,,,,,93.29Z,NAFRev2,N,0.200613,43.277563,0.84,housenumber,58 Chemin de Lasbordes 65350 Castelvieilh,65131_0035_00058,G,58 CHEMIN DE LASBORDES,
400825105,00010,40082510500010,O,,NN,,,,true,1,,,,,,65350,CASTELVIEILH,,,65131,,,,,,,,,,,,,,,,,,,1995-01-01,F,,,,,01.3Z,NAF1993,N,,,0,,,,,,
410826200,00017,41082620000017,O,1997-01-01,NN,,,2008-01-04T21:49:34,true,3,,4,,CHE,DE LASBORDES,65350,CASTELVIEILH,,,65131,,,,,,,,,,,,,,,,,,,2008-01-01,A,,,,,01.11Z,NAFRev2,N,0.193379,43.282948,0.84,housenumber,4 Chemin de Lasbordes 65350 Castelvieilh,65131_0035_00004,G,4 CHEMIN DE LASBORDES,
413871500,00042,41387150000042,O,2021-03-26,,,,2021-06-28T17:34:11,true,1,,18,,CHE,DE MAURILLOU,65350,CASTELVIEILH,,,65131,,,,,,,,,,,,,,,,,,,2021-03-26,A,SCRIPT,,,SCRIPT,62.01Z,NAFRev2,N,0.202883,43.288293,0.84,housenumber,18 Chemin de Maurillou 65350 Castelvieilh,65131_0045_00018,G,18 CHEMIN DE MAURILLOU,
419139746,00012,41913974600012,O,1990-01-01,NN,,,2008-01-04T23:31:39,true,3,,,,,,65350,CASTELVIEILH,,,65131,,,,,,,,,,,,,,,,,,,2008-01-01,A,,,,,01.11Z,NAFRev2,N,,,0,,,,,,
420354987,00018,42035498700018,O,1987-12-31,NN,,,,true,4,,,,,,65350,CASTELVIEILH,,,65131,,,,,,,,,,,,,,,,,,,2003-02-23,F,,,,,01.1A,NAFRev1,N,,,0,,,,,,
420354995,00011,42035499500011,O,1982-12-31,NN,,,2008-01-04T23:50:42,true,3,,,,,,65350,CASTELVIEILH,,,65131,,,,,,,,,,,,,,,,,,,2008-01-01,A,,,,,01.11Z,NAFRev2,N,,,0,,,,,,
420355000,00019,42035500000019,O,1987-12-31,NN,,,2008-08-18T15:49:36,true,4,,,,,,65350,CASTELVIEILH,,,65131,,,,,,,,,,,,,,,,,,,2008-01-01,A,,,,,56.10A,NAFRev2,N,,,0,,,,,,
421706714,00035,42170671400035,O,2009-02-25,NN,,,2011-04-23T10:11:06,false,2,,2,,RTE,DE BOUILH PEREUILH,65350,CASTELVIEILH,,,65131,,,,,,,,,,,,,,,,,,,2009-06-30,F,,,,,49.32Z,NAFRev2,O,0.193108,43.286606,0.85,housenumber,2 Route de Bouilh-pereuilh 65350 Castelvieilh,65131_0005_00002,G,2 ROUTE DE BOUILH PEREUILH,
422160887,00010,42216088700010,O,1999-01-01,NN,,,2017-10-06T04:08:15,true,4,,,,,,65350,CASTELVIEILH,,,65131,,,,,,,,,,,,,,,,,,,2017-12-31,F,,,,,01.11Z,NAFRev2,N,,,0,,,,,,
423114206,00042,42311420600042,O,2012-01-16,,,,2017-11-20T15:08:50,false,2,,22,,CHE,DE CABANAC,65350,CASTELVIEILH,,,65131,,,,,,,,,,,,,,,,,,,2017-06-01,F,,,,,86.90F,NAFRev2,N,0.201571,43.284479,0.83,housenumber,22 Chemin de Cabanac 65350 Castelvieilh,65131_0010_00022,G,22 CHEMIN DE CABANAC,
424720373,00036,42472037300036,O,2003-07-01,NN,,,,false,3,,11,,CHE,DE CABANAC,65350,CASTELVIEILH,,,65131,,,,,,,,,,,,,,,,,,,2003-12-25,F,,,,,85.1C,NAFRev1,N,0.201202,43.284511,0.83,housenumber,11 Chemin de Cabanac 65350 Castelvieilh,65131_0010_00011,G,11 CHEMIN DE CABANAC,
425274198,00018,42527419800018,O,1987-01-01,NN,,,2007-01-18T09:41:07,true,3,,,,,,65350,CASTELVIEILH,,,65131,,,,,,,,,,,,,,,,,,,2003-01-08,F,,,,,01.3Z,NAFRev1,N,,,0,,,,,,
430530717,00015,43053071700015,O,1974-01-01,NN,,,2008-01-05T01:54:11,true,3,,,,,,65350,CASTELVIEILH,,,65131,,,,,,,,,,,,,,,,,,,2008-01-01,A,,,,,01.41Z,NAFRev2,N,,,0,,,,,,
431653369,00014,43165336900014,O,2000-05-06,NN,,,2019-11-18T16:40:34,true,3,,15,,CHE,DE CABANAC,65350,CASTELVIEILH,,,65131,,,,,,,,,,,,,,,,,,,2008-01-01,A,,,,,68.20A,NAFRev2,N,0.202243,43.284519,0.83,housenumber,15 Chemin de Cabanac 65350 Castelvieilh,65131_0010_00015,G,15 CHEMIN DE CABANAC,
432900355,00012,43290035500012,O,2000-09-11,NN,,,2018-09-29T12:14:40,true,3,,58,,CHE,DE LASBORDES,65350,CASTELVIEILH,,,65131,,,,,,,,,,,,,,,,,,,2008-01-01,A,,,,,01.47Z,NAFRev2,N,0.200613,43.277563,0.84,housenumber,58 Chemin de Lasbordes 65350 Castelvieilh,65131_0035_00058,G,58 CHEMIN DE LASBORDES,
440223469,00014,44022346900014,O,2001-07-02,NN,,,2017-10-11T15:24:32,false,6,,3,,RTE,DE TRIE,65350,CASTELVIEILH,,,65131,,,,,,,,,,,,,,,,,,,2017-10-11,F,,,,,70.10Z,NAFRev2,N,0.193364,43.286153,0.8,housenumber,3 Route de Trie 65350 Castelvieilh,65131_0055_00003,G,3 ROUTE DE TRIE,
443569926,00019,44356992600019,O,2002-10-01,NN,,,,true,4,,,,,,65350,CASTELVIEILH,,,65131,,,,,,,,,,,,,,,,,,,2003-01-10,F,,,,,92.3A,NAFRev1,N,,,0,,,,,,
447682543,00015,44768254300015,O,2003-02-13,NN,,,2008-01-05T21:22:45,true,3,,54,,CHE,DE LASBORDES,65350,CASTELVIEILH,,,65131,,,,,,,,,,,,,,,,,,,2008-01-01,A,,,,,68.20B,NAFRev2,N,0.199468,43.277717,0.84,housenumber,54 Chemin de Lasbordes 65350 Castelvieilh,65131_0035_00054,G,54 CHEMIN DE LASBORDES,
447721606,00013,44772160600013,O,1995-11-13,NN,,,2008-01-04T22:59:49,true,3,,,,,MAIRIE,65350,CASTELVIEILH,,,65131,,,,,,,,,,,,,,,,,,,2008-01-01,A,,,,,93.12Z,NAFRev2,N,3.0709671,50.6304695,0.92,poi.townhall,Hôtel de Ville Lille,https://osm.org/way/40917078,G,,
447805201,00012,44780520100012,O,2003-03-04,NN,,,2020-02-08T03:48:36,true,3,CHEZ MR JACQUES THEZE,23,,CHE,DE LARNAUD,65350,CASTELVIEILH,,,65131,,,,,,,,,,,,,,,,,,,2008-01-01,A,,,,,68.20B,NAFRev2,N,0.20048,43.28353,0.83,housenumber,23 Chemin de Larnaud 65350 Castelvieilh,65131_0031_00023,G,23 CHEMIN DE LARNAUD,
477484265,00020,47748426500020,O,2008-02-16,,,,2014-10-31T08:40:13,false,2,,26,B,CHE,LASBORDES,65350,CASTELVIEILH,,,65131,,,,,,,,,,,,,,,,,,,2010-08-31,F,,,,,86.90D,NAFRev2,N,0.194287,43.279591,0.73,housenumber,26 bis Chemin de Lasbordes 65350 Castelvieilh,65131_0035_00026_bis,G,26 BIS CHEMIN DE LASBORDES,
478373772,00019,47837377200019,O,2004-07-01,,,,2008-01-05T03:41:47,true,3,,36,,CHE,LASBORDES,65350,CASTELVIEILH,,,65131,,,,,,,,,,,,,,,,,,,2008-01-01,A,,,,,01.11Z,NAFRev2,N,0.195724,43.278674,0.87,housenumber,36 Chemin de Lasbordes 65350 Castelvieilh,65131_0035_00036,G,36 CHEMIN DE LASBORDES,
479298994,00019,47929899400019,O,2004-11-02,NN,,,2021-05-26T08:52:42,true,4,,23,,,CHEMIN DE LARNAUD,65350,CASTELVIEILH,,,65131,,,,,,,,,,,,,,,,,,,2021-04-30,F,,,,,66.19A,NAFRev2,N,0.20048,43.28353,0.93,housenumber,23 Chemin de Larnaud 65350 Castelvieilh,65131_0031_00023,G,23 CHEMIN DE LARNAUD,
480799204,00015,48079920400015,O,2005-02-09,NN,,,2012-07-20T04:54:31,true,2,,,,RTE,DE BOUILH PEREUILH,65350,CASTELVIEILH,,,65131,,,,,,,,,,,,,,,,,,,2007-03-05,F,,,,,45.2V,NAFRev1,O,0.193108,43.286606,0.84,street,Route de Bouilh-pereuilh 65350 Castelvieilh,65131_0005,G,ROUTE DE BOUILH PEREUILH,
489359851,00016,48935985100016,O,2006-04-03,02,2018,4322BA,2020-08-25T10:33:56,true,3,,6,,RTE,DE TRIE,65350,CASTELVIEILH,,,65131,,,,,,,,,,,,,,,,,,,2008-02-10,A,,,,,43.22B,NAFRev2,O,0.193454,43.28556,0.8,housenumber,6 Route de Trie 65350 Castelvieilh,65131_0055_00006,G,6 ROUTE DE TRIE,
491876587,00016,49187658700016,O,2006-07-19,,,,2019-04-05T11:33:16,true,1,,3,,RTE,DE TRIE,65350,CASTELVIEILH,,,65131,,,,,,,,,,,,,,,,,,,2006-07-19,A,,,,,68.20A,NAFRev2,N,0.193364,43.286153,0.8,housenumber,3 Route de Trie 65350 Castelvieilh,65131_0055_00003,G,3 ROUTE DE TRIE,
509941803,00017,50994180300017,O,2009-01-01,,,,2009-03-03T08:14:44,true,1,,21,,CHE,DE CABANAC,65350,CASTELVIEILH,,,65131,,,,,,,,,,,,,,,,,,,2009-01-01,A,,,,,01.19Z,NAFRev2,N,0.204373,43.284637,0.83,housenumber,21 Chemin de Cabanac 65350 Castelvieilh,65131_0010_00021,G,21 CHEMIN DE CABANAC,
509941803,00025,50994180300025,O,2009-02-27,,,,2021-02-23T15:16:52,false,1,,21,,CHE,DE CABANAC,65350,CASTELVIEILH,,,65131,,,,,,,,,,,,,,,,,,,2009-02-27,A,,,,,01.61Z,NAFRev2,N,0.204373,43.284637,0.83,housenumber,21 Chemin de Cabanac 65350 Castelvieilh,65131_0010_00021,G,21 CHEMIN DE CABANAC,
510081896,00019,51008189600019,O,2009-01-01,,,,2015-11-19T16:37:36,true,1,,11,,CHE,DE LASBORDES,65350,CASTELVIEILH,,,65131,,,,,,,,,,,,,,,,,,,2009-01-01,A,,,,,55.20Z,NAFRev2,N,0.192322,43.282294,0.84,housenumber,11 Chemin de Lasbordes 65350 Castelvieilh,65131_0035_00011,G,11 CHEMIN DE LASBORDES,
510529399,00014,51052939900014,O,2009-03-01,,,,2010-02-04T08:50:18,false,1,,13,,CHE,DE CABANAC,65350,CASTELVIEILH,,,65131,,,,,,,,,,,,,,,,,,,2009-03-01,F,LOCANEIGE,,,,77.29Z,NAFRev2,N,0.201846,43.284524,0.83,housenumber,13 Chemin de Cabanac 65350 Castelvieilh,65131_0010_00013,G,13 CHEMIN DE CABANAC,
512281163,00018,51228116300018,O,2009-04-01,,,,2009-05-07T04:24:42,true,1,,,,RTE,DE LARNAUD,65350,CASTELVIEILH,,,65131,,,,,,,,,,,,,,,,,,,2009-04-01,A,,,,,68.20B,NAFRev2,N,5.4612455,46.7182103,0.72,poi,Route de Villevieux (Pont) Larnaud,https://osm.org/way/321640307,G,,
517651816,00012,51765181600012,O,2009-05-20,,,,2013-01-11T05:03:28,true,2,,20,,,CHEMIN DE LARNAUD,65350,CASTELVIEILH,,,65131,,,,,,,,,,,,,,,,,,,2012-12-27,F,,,,,43.33Z,NAFRev2,N,0.200361,43.28345,0.93,housenumber,20 Chemin de Larnaud 65350 Castelvieilh,65131_0031_00020,G,20 CHEMIN DE LARNAUD,
517729935,00018,51772993500018,O,2009-09-10,,,,2010-12-13T14:58:20,false,2,,3,,RTE,DE TRIE,65350,CASTELVIEILH,,,65131,,,,,,,,,,,,,,,,,,,2010-10-01,F,,,,,68.20A,NAFRev2,N,0.193364,43.286153,0.8,housenumber,3 Route de Trie 65350 Castelvieilh,65131_0055_00003,G,3 ROUTE DE TRIE,
520342577,00019,52034257700019,O,2010-02-20,,,,2016-05-06T11:59:51,true,1,,4,,CHE,DE LA FONTAINE,65350,CASTELVIEILH,,,65131,,,,,,,,,,,,,,,,,,,2010-02-20,A,,,,,01.45Z,NAFRev2,N,0.191704,43.283596,0.85,housenumber,4 Chemin de la Fontaine 65350 Castelvieilh,65131_0020_00004,G,4 CHEMIN DE LA FONTAINE,
520950726,00056,52095072600056,O,2015-06-16,,,,2019-01-23T09:11:58,false,2,LE CHALET,24,,CHE,DE LARNAUD,65350,CASTELVIEILH,,,65131,,,,,,,,,,,,,,,,,,,2018-11-16,F,,,,,46.49Z,NAFRev2,N,0.201052,43.284104,0.83,housenumber,24 Chemin de Larnaud 65350 Castelvieilh,65131_0031_00024,G,24 CHEMIN DE LARNAUD,
521178558,00016,52117855800016,O,2010-03-22,,,,2021-02-09T10:04:45,true,2,,14,,CHE,DE CABANAC,65350,CASTELVIEILH,,,65131,,,,,,,,,,,,,,,,,,,2020-09-30,F,MILPIECES 4X4,,,,45.32Z,NAFRev2,N,0.198322,43.284327,0.83,housenumber,14 Chemin de Cabanac 65350 Castelvieilh,65131_0010_00014,G,14 CHEMIN DE CABANAC,
534731286,00017,53473128600017,O,2011-10-01,,,,2018-06-22T04:22:13,true,1,,8,,CHE,DE LARNAUD,65350,CASTELVIEILH,,,65131,,,,,,,,,,,,,,,,,,,2011-10-01,A,,,,,68.20B,NAFRev2,N,0.197566,43.282915,0.82,housenumber,8 Chemin de Larnaud 65350 Castelvieilh,65131_0031_00008,G,8 CHEMIN DE LARNAUD,
539347120,00013,53934712000013,O,2012-01-02,,,,2018-12-12T04:18:14,true,1,,10,,RUE,DE L'EGLISE,65350,CASTELVIEILH,,,65131,,,,,,,,,,,,,,,,,,,2012-01-02,A,,,,,68.20B,NAFRev2,N,0.196518,43.285146,0.93,housenumber,10 Rue de l'Eglise 65350 Castelvieilh,65131_0015_00010,G,10 RUE DE L EGLISE,
777115775,00010,77711577500010,O,1966-01-01,NN,,,2012-11-10T04:04:10,true,4,,3,,RTE,DE TRIE,65350,CASTELVIEILH,,,65131,,,,,,,,,,,,,,,,,,,2011-10-01,A,,,,,43.12A,NAFRev2,N,0.193364,43.286153,0.8,housenumber,3 Route de Trie 65350 Castelvieilh,65131_0055_00003,G,3 ROUTE DE TRIE,
777115783,00014,77711578300014,O,,NN,,,,true,1,,,,,,65350,CASTELVIEILH,,,65131,,,,,,,,,,,,,,,,,,,1993-06-30,F,,,,,45.4J,NAF1993,N,,,0,,,,,,
777115791,00017,77711579100017,O,,NN,,,,true,1,,,,,,65350,CASTELVIEILH,,,65131,,,,,,,,,,,,,,,,,,,,F,,,,,55.71,NAP,N,,,0,,,,,,
777115817,00010,77711581700010,O,1900-01-01,NN,,,2009-06-27T15:11:28,true,5,,,,,,65350,CASTELVIEILH,,,65131,,,,,,,,,,,,,,,,,,,2008-01-01,A,,,,,85.32Z,NAFRev2,O,,,0,,,,,,
793163262,00017,79316326200017,O,2013-05-07,,,2562BZ,2020-02-14T19:33:54,true,2,,18,,CHE,DES MAURILLOU,65350,CASTELVIEILH,,,65131,,,,,,,,,,,,,,,,,,,2019-12-31,F,,,,ETS JPM65,25.62B,NAFRev2,N,0.202883,43.288293,0.72,housenumber,18 Chemin de Maurillou 65350 Castelvieilh,65131_0045_00018,G,18 CHEMIN DE MAURILLOU,
795104504,00019,79510450400019,O,2013-09-05,,,,2013-09-06T09:44:48,true,1,,66,,CHE,LASBORDES,65350,CASTELVIEILH,,,65131,,,,,,,,,,,,,,,,,,,2013-09-05,A,,,,,01.11Z,NAFRev2,N,0.201189,43.277677,0.87,housenumber,66 Chemin de Lasbordes 65350 Castelvieilh,65131_0035_00066,G,66 CHEMIN DE LASBORDES,
797822897,00014,79782289700014,O,2013-10-04,,,,2014-01-30T08:38:05,false,2,,11,,CHE,DE CABANAC,65350,CASTELVIEILH,,,65131,,,,,,,,,,,,,,,,,,,2014-01-07,F,,,,,74.30Z,NAFRev2,N,0.201202,43.284511,0.83,housenumber,11 Chemin de Cabanac 65350 Castelvieilh,65131_0010_00011,G,11 CHEMIN DE CABANAC,
799108667,00020,79910866700020,O,2021-02-01,,,4391AZ,2021-02-23T16:28:00,true,1,,7,,CHE,DE CABANAC,65350,CASTELVIEILH,,,65131,,,,,,,,,,,,,,,,,,,2021-02-01,A,,,,CARRENO TOITURE,43.91A,NAFRev2,N,0.2180019,43.2834403,0.79,poi.track,Chemin de Cabanac Castelvieilh,https://osm.org/way/579564576,G,,
803746296,00026,80374629600026,O,2021-04-01,,,,2021-06-22T07:33:52,true,1,,3,,CHE,DU MOURILLON,65350,CASTELVIEILH,,,65131,,,,,,,,,,,,,,,,,,,2021-04-01,A,,,,,01.41Z,NAFRev2,N,0.200585,43.28779,0.46,housenumber,3 Chemin de Maurillou 65350 Castelvieilh,65131_0045_00003,G,3 CHEMIN DE MAURILLOU,
809361983,00012,80936198300012,O,2015-02-01,NN,,,2018-09-29T13:49:22,true,1,,18,,CHE,DE CABANAC,65350,CASTELVIEILH,,,65131,,,,,,,,,,,,,,,,,,,2015-02-01,A,,,,,68.20A,NAFRev2,O,0.199978,43.284275,0.83,housenumber,18 Chemin de Cabanac 65350 Castelvieilh,65131_0010_00018,G,18 CHEMIN DE CABANAC,
811138445,00010,81113844500010,O,2015-04-01,,,,2015-04-30T04:09:58,true,1,,12,,CHE,DE LARNAUD,65350,CASTELVIEILH,,,65131,,,,,,,,,,,,,,,,,,,2015-04-01,A,,,,GF TOIT SUR,43.91B,NAFRev2,N,0.198099,43.282874,0.83,housenumber,12 Chemin de Larnaud 65350 Castelvieilh,65131_0031_00012,G,12 CHEMIN DE LARNAUD,
812034320,00018,81203432000018,O,2015-06-01,,,,2018-03-21T03:40:22,true,2,CHEZ MONSIEUR DALLIER,,,CHE,MARQUERIE,65350,CASTELVIEILH,,,65131,,,,,,,,,,,,,,,,,,,2017-03-30,F,,,,NUTRITION SERVICES,47.99B,NAFRev2,N,0.193268,43.279178,0.86,street,Chemin de Marquerie 65350 Castelvieilh,65131_0040,G,CHEMIN DE MARQUERIE,
818002719,00024,81800271900024,O,2019-10-05,,,,2019-11-25T10:42:56,true,1,,39,,CHE,DE LASBORDES,65350,CASTELVIEILH,,,65131,,,,,,,,,,,,,,,,,,,2019-10-05,A,,,,,71.12B,NAFRev2,N,0.197179,43.278264,0.84,housenumber,39 Chemin de Lasbordes 65350 Castelvieilh,65131_0035_00039,G,39 CHEMIN DE LASBORDES,
820762466,00010,82076246600010,O,2016-05-31,,,,2016-06-07T05:19:28,true,1,,8,,CHE,DE LASBORDES,65350,CASTELVIEILH,,,65131,,,,,,,,,,,,,,,,,,,2016-05-31,A,,,,,68.20B,NAFRev2,N,0.192536,43.28258,0.84,housenumber,8 Chemin de Lasbordes 65350 Castelvieilh,65131_0035_00008,G,8 CHEMIN DE LASBORDES,
820857993,00019,82085799300019,O,2016-06-01,,,2512ZZ,2016-06-10T08:42:36,true,1,,12,,CHE,DE CABANAC,65350,CASTELVIEILH,,,65131,,,,,,,,,,,,,,,,,,,2016-06-01,A,,,,,25.12Z,NAFRev2,N,0.197923,43.284381,0.83,housenumber,12 Chemin de Cabanac 65350 Castelvieilh,65131_0010_00012,G,12 CHEMIN DE CABANAC,
823563333,00017,82356333300017,O,2016-10-27,,,,2021-03-18T19:35:45,true,1,,67,,CHE,DE LASBORDES,65350,CASTELVIEILH,,,65131,,,,,,,,,,,,,,,,,,,2016-10-27,A,,,,,68.20B,NAFRev2,N,0.203611,43.278588,0.84,housenumber,67 Chemin de Lasbordes 65350 Castelvieilh,65131_0035_00067,G,67 CHEMIN DE LASBORDES,
829334291,00012,82933429100012,O,2017-05-02,,,,2018-09-18T19:34:10,true,2,,6,B,CHE,DE LASBORDES,65350,CASTELVIEILH,,,65131,,,,,,,,,,,,,,,,,,,2018-09-17,F,,,,RAVALEMENT BIGOURDAN,43.99C,NAFRev2,N,0.192817,43.282714,0.71,housenumber,6 bis Chemin de Lasbordes 65350 Castelvieilh,65131_0035_00006_bis,G,6 BIS CHEMIN DE LASBORDES,
829595917,00016,82959591700016,O,2017-04-25,,,,2018-12-10T15:30:15,false,2,,17,,RUE,DE L'EGLISE,65350,CASTELVIEILH,,,65131,,,,,,,,,,,,,,,,,,,2018-10-30,F,,,,,68.20B,NAFRev2,N,0.196551,43.286079,0.93,housenumber,17 Rue de l'Eglise 65350 Castelvieilh,65131_0015_00017,G,17 RUE DE L EGLISE,
830339149,00015,83033914900015,O,2017-06-01,,,,2017-06-28T16:12:31,true,1,,18,,CHE,DE CABANAC,65350,CASTELVIEILH,,,65131,,,,,,,,,,,,,,,,,,,2017-06-01,A,,,,LES PETITS JARDINS,81.21Z,NAFRev2,N,0.199978,43.284275,0.83,housenumber,18 Chemin de Cabanac 65350 Castelvieilh,65131_0010_00018,G,18 CHEMIN DE CABANAC,
835244815,00014,83524481500014,O,2018-03-01,,,,2018-02-08T08:16:12,true,1,,9,,CHE,DE LARNAUD,65350,CASTELVIEILH,,,65131,,,,,,,,,,,,,,,,,,,2018-03-01,A,,,,PROFFICE,82.19Z,NAFRev2,N,0.196841,43.282974,0.82,housenumber,9 Chemin de Larnaud 65350 Castelvieilh,65131_0031_00009,G,9 CHEMIN DE LARNAUD,
842476921,00015,84247692100015,O,2018-09-18,,,4321AB,2019-01-14T03:51:16,true,2,,8,,CHE,DE CABANAC,65350,CASTELVIEILH,,,65131,,,,,,,,,,,,,,,,,,,2019-01-02,A,,,,ALARMES VIDEOS DES PYRENEES - A.V.P.,43.21A,NAFRev2,O,0.197192,43.284514,0.82,housenumber,8 Chemin de Cabanac 65350 Castelvieilh,65131_0010_00008,G,8 CHEMIN DE CABANAC,