siren,nic,siret,statutDiffusionEtablissement,dateCreationEtablissement,trancheEffectifsEtablissement,anneeEffectifsEtablissement,activitePrincipaleRegistreMetiersEtablissement,dateDernierTraitementEtablissement,etablissementSiege,nombrePeriodesEtablissement,complementAdresseEtablissement,numeroVoieEtablissement,indiceRepetitionEtablissement,typeVoieEtablissement,libelleVoieEtablissement,codePostalEtablissement,libelleCommuneEtablissement,libelleCommuneEtrangerEtablissement,distributionSpecialeEtablissement,codeCommuneEtablissement,codeCedexEtablissement,libelleCedexEtablissement,codePaysEtrangerEtablissement,libellePaysEtrangerEtablissement,complementAdresse2Etablissement,numeroVoie2Etablissement,indiceRepetition2Etablissement,typeVoie2Etablissement,libelleVoie2Etablissement,codePostal2Etablissement,libelleCommune2Etablissement,libelleCommuneEtranger2Etablissement,distributionSpeciale2Etablissement,codeCommune2Etablissement,codeCedex2Etablissement,libelleCedex2Etablissement,codePaysEtranger2Etablissement,libellePaysEtranger2Etablissement,dateDebut,etatAdministratifEtablissement,enseigne1Etablissement,enseigne2Etablissement,enseigne3Etablissement,denominationUsuelleEtablissement,activitePrincipaleEtablissement,nomenclatureActivitePrincipaleEtablissement,caractereEmployeurEtablissement,longitude,latitude,geo_score,geo_type,geo_adresse,geo_id,geo_ligne,geo_l4,geo_l5
007927296,00017,00792729600017,O,1994-12-25,NN,,,2010-04-18T03:00:28,true,3,,7,,AV,TURGOT,19200,USSEL,,,19275,,,,,,,,,,,,,,,,,,,2008-12-31,A,,,,,81.10Z,NAFRev2,N,2.303786,45.545102,0.79,housenumber,7 Avenue Turgot 19200 Ussel,19275_1370_00007,G,7 AVENUE TURGOT,
007927346,00010,00792734600010,O,1994-12-25,01,2018,,2020-08-25T10:10:15,true,3,,33,,AV,CARNOT,19200,USSEL,,,19275,,,,,,,,,,,,,,,,,,,2008-01-01,A,,,,,81.10Z,NAFRev2,O,2.311204,45.548418,0.8,housenumber,33 Avenue Carnot 19200 Ussel,19275_0170_00033,G,33 AVENUE CARNOT,
007927353,00016,00792735300016,O,1994-12-25,NN,,,2008-01-04T17:54:29,true,2,,13,,BD,CLEMENCEAU,19200,USSEL,,,19275,,,,,,,,,,,,,,,,,,,2008-01-01,A,,,,,81.10Z,NAFRev2,N,2.308324,45.548107,0.83,housenumber,13 Boulevard Clémenceau 19200 Ussel,19275_0320_00013,G,13 BOULEVARD CLEMENCEAU,
007928641,00013,00792864100013,O,1994-12-25,NN,,,2010-04-18T03:00:28,true,3,,9,,AV,GAMBETTA,19200,USSEL,,,19275,,,,,,,,,,,,,,,,,,,2008-12-31,A,,,,,81.10Z,NAFRev2,N,2.308761,45.545388,0.81,housenumber,9 Avenue Gambetta 19200 Ussel,19275_0570_00009,G,9 AVENUE GAMBETTA,
050347962,00016,05034796200016,O,1994-12-25,NN,,,2016-04-26T01:06:24,true,4,,1,,BD,VICTOR HUGO,19200,USSEL,,,19275,,,,,,,,,,,,,,,,,,,2015-03-31,A,,,,,81.10Z,NAFRev2,N,2.309432,45.546254,0.83,housenumber,1 Boulevard Victor Hugo 19200 Ussel,19275_1470_00001,G,1 BOULEVARD VICTOR HUGO,
054500335,01513,05450033501513,O,1992-01-01,,,,,false,4,,61,,AV,DU GENERAL LECLERC,19200,USSEL,,,19275,,,,,,,,,,,,,,,,,,,1993-12-31,F,PIOT PNEU,,,,50.3B,NAF1993,N,2.30174,45.557552,0.87,housenumber,61 Avenue du Général Leclerc 19200 Ussel,19275_0620_00061,G,61 AVENUE DU GENERAL LECLERC,
064200793,01580,06420079301580,O,1995-03-16,,,,2006-11-25T09:05:38,false,4,,33,,AV,CARNOT,19200,USSEL,,,19275,,,,,,,,,,,,,,,,,,,2005-08-23,F,,,,,52.4E,NAFRev1,N,2.311204,45.548418,0.8,housenumber,33 Avenue Carnot 19200 Ussel,19275_0170_00033,G,33 AVENUE CARNOT,
130005481,08443,13000548108443,O,2008-12-19,NN,,,2015-05-14T03:12:51,false,3,,5,,RUE,ERNEST JARASSE,19200,USSEL,,,19275,,,,,,,,,,,,,,,,,,,2013-06-01,F,AGENCE LOCALE D'USSEL,,,,84.13Z,NAFRev2,O,2.312176,45.546709,0.95,housenumber,5 Rue Ernest Jarasse 19200 Ussel,19275_0480_00005,G,5 RUE ERNEST JARASSE,
130005481,15539,13000548115539,O,2008-12-19,NN,,,2015-05-14T03:12:51,false,3,,,,,LA GARE,19200,USSEL,,USSEL,19275,,,,,,,,,,,,,,,,,,,2013-08-01,F,,,,,84.13Z,NAFRev2,O,2.304494,45.552599,0.81,locality,La Garenne Sud 19200 Ussel,19275_b241,G,LA GARENNE SUD,
130005481,19895,13000548119895,O,2012-05-01,11,2018,,2020-08-25T10:13:06,false,2,RESIDENCE VENTADOUR,47,,AV,TURGOT,19200,USSEL,,,19275,,,,,,,,,,,,,,,,,,,2013-02-03,A,USSEL,,,,84.13Z,NAFRev2,O,2.300717,45.542001,0.8,housenumber,47 Avenue Turgot 19200 Ussel,19275_1370_00047,G,47 AVENUE TURGOT,
130010903,00032,13001090300032,O,2010-01-01,01,2018,,2020-08-25T10:13:15,false,1,,,,AV,PIERRE SEMARD,19200,USSEL,,,19275,,,,,,,,,,,,,,,,,,,2010-01-01,A,AGENCE DE HAUTE CORREZE,,,,84.11Z,NAFRev2,O,2.315038,45.554537,0.78,street,Rue Pierre Semard 19200 Ussel,19275_c7ptr6,G,RUE PIERRE SEMARD,
130014723,00147,13001472300147,O,2011-07-01,11,2018,,2021-03-31T20:01:17,false,2,,3,,RUE,ALBERT CHAVAGNAC,19200,USSEL,,,19275,,,,,,,,,,,,,,,,,,,2021-01-01,F,SERVICE IMPOTS DES PARTICULIERS D'USSEL,,,,84.11Z,NAFRev2,N,2.311309,45.546327,0.95,housenumber,3 Rue Albert Chavagnac 19200 Ussel,19275_0020_00003,G,3 RUE ALBERT CHAVAGNAC,
130014723,00402,13001472300402,O,2011-07-01,11,2018,,2020-08-25T10:13:22,false,1,,3,,RUE,ALBERT CHAVAGNAC,19200,USSEL,,,19275,,,,,,,,,,,,,,,,,,,2011-07-01,A,TRESORERIE D' USSEL,,,,84.11Z,NAFRev2,N,2.311309,45.546327,0.95,housenumber,3 Rue Albert Chavagnac 19200 Ussel,19275_0020_00003,G,3 RUE ALBERT CHAVAGNAC,
130014723,00444,13001472300444,O,2011-07-01,,,,2021-02-23T10:28:21,false,1,,,,RUE,ALBERT CHAVAGNAC,19200,USSEL,,BP 66,19275,19208,USSEL CEDEX,,,,,,,,,,,,,,,,,2011-07-01,A,EMPLOIS EXCENTRES D'USSEL,,,,84.11Z,NAFRev2,N,2.311274,45.546304,0.95,street,Rue Albert Chavagnac 19200 Ussel,19275_0020,G,RUE ALBERT CHAVAGNAC,
171900012,00039,17190001200039,O,1983-03-16,11,2018,,2020-08-25T10:13:31,false,4,,1,,BD,DE LA PRADE,19200,USSEL,,,19275,,,,,,,,,,,,,,,,,,,2008-01-01,A,SOUS PREFECTURE,,,,84.11Z,NAFRev2,N,2.314286,45.54944,0.83,housenumber,1 Boulevard de la Prade 19200 Ussel,19275_1057_00001,G,1 BOULEVARD DE LA PRADE,
171901515,00022,17190151500022,O,1983-03-16,12,2018,,2020-08-25T10:13:31,false,4,,7,,AV,CARNOT,19200,USSEL,,,19275,,,,,,,,,,,,,,,,,,,2008-01-01,A,COMMISSARIAT DE POLICE,,,,84.24Z,NAFRev2,N,2.310103,45.546864,0.79,housenumber,7 Avenue Carnot 19200 Ussel,19275_0170_00007,G,7 AVENUE CARNOT,
171902117,00307,17190211700307,O,1983-03-25,NN,,,2007-05-19T08:09:25,false,4,,26,,AV,MARMONTEL,19200,USSEL,,,19275,19208,USSEL CEDEX,,,,,,,,,,,,,,,,,2006-06-19,F,TRESORERIE USSEL,,,,75.1A,NAFRev1,O,2.313825,45.54484,0.83,housenumber,26 Avenue Marmontel 19200 Ussel,19275_0870_00026,G,26 AVENUE MARMONTEL,
171902117,00505,17190211700505,O,2006-06-19,NN,,,2013-05-18T02:07:53,false,3,HOTEL DES FINANCES,3,,RUE,ALBERT CHAVAGNAC,19200,USSEL,,,19275,19208,USSEL CEDEX,,,,,,,,,,,,,,,,,2011-07-01,F,TRESORERIE D'USSEL,,,,84.11Z,NAFRev2,N,2.311309,45.546327,0.95,housenumber,3 Rue Albert Chavagnac 19200 Ussel,19275_0020_00003,G,3 RUE ALBERT CHAVAGNAC,
171902216,00026,17190221600026,O,1983-03-16,NN,,,2013-05-18T02:07:53,false,6,HOTEL DES FINANCES CDI-SIE,3,,RUE,ALBERT CHAVAGNAC,19200,USSEL,,,19275,,,,,,,,,,,,,,,,,,,2011-07-01,F,SCE IMPOTS  PARTICULIERS USSEL,,,,84.11Z,NAFRev2,O,2.311309,45.546327,0.95,housenumber,3 Rue Albert Chavagnac 19200 Ussel,19275_0020_00003,G,3 RUE ALBERT CHAVAGNAC,
171902216,00174,17190221600174,O,1983-03-29,NN,,,2013-05-18T02:07:53,false,6,HOTEL DES FINANCES CDI-SIE,3,,RUE,ALBERT CHAVAGNAC,19200,USSEL,,,19275,,,,,,,,,,,,,,,,,,,2011-07-01,F,SCE IMPOTS DES ENTREPRISES  USSEL,,,,84.11Z,NAFRev2,O,2.311309,45.546327,0.95,housenumber,3 Rue Albert Chavagnac 19200 Ussel,19275_0020_00003,G,3 RUE ALBERT CHAVAGNAC,
171902216,00299,17190221600299,O,1995-02-01,,,,2012-07-27T14:05:37,false,5,,,,RUE,ALBERT CHAVAGNAC,19200,USSEL,,BP 66,19275,19208,USSEL CEDEX,,,,,,,,,,,,,,,,,2011-07-01,F,EMPLOIS EXCENTRES D'USSEL,,,,84.11Z,NAFRev2,O,2.311274,45.546304,0.95,street,Rue Albert Chavagnac 19200 Ussel,19275_0020,G,RUE ALBERT CHAVAGNAC,
171903016,00037,17190301600037,O,1987-01-01,NN,,,,false,4,,,,RUE,DU DOC ROULLET,19200,USSEL,,,19275,,,,,,,,,,,,,,,,,,,2001-12-25,F,DISPENSAIRE D HYGIENE MENTALE,,,,85.1C,NAF1993,N,2.313234,45.544174,0.85,street,Rue du Docteur Roullet 19200 Ussel,19275_0410,G,RUE DU DOCTEUR ROULLET,
171904311,00106,17190431100106,O,1985-04-01,NN,,,,false,4,,,,BD,DU DOCTEUR GOUDOUNECHE,19200,USSEL,,,19275,,,,,,,,,,,,,,,,,,,2000-12-31,F,INSP DEPT EDUCATION USSEL,,,,75.1C,NAF1993,N,2.312604,45.545832,0.77,street,Boulevard Docteur Goudouneche 19200 Ussel,19275_0400,G,BOULEVARD DOCTEUR GOUDOUNECHE,
171904311,00114,17190431100114,O,1985-04-01,02,2018,,2020-08-25T10:13:31,false,4,,20,,RUE,DE LA CIVADIERE,19200,USSEL,,,19275,,,,,,,,,,,,,,,,,,,2019-02-15,A,CIO D' ETAT DE USSEL,,,,84.12Z,NAFRev2,N,2.315317,45.54683,0.95,housenumber,20 Rue de la Civadière 19200 Ussel,19275_0315_00020,G,20 RUE DE LA CIVADIERE,
171904311,00122,17190431100122,O,1985-04-01,NN,,,2008-01-04T18:14:37,false,3,,,,BD,DU DOCTEUR GOUDOUNECHE,19200,USSEL,,,19275,,,,,,,,,,,,,,,,,,,2008-01-01,A,COMMISSION CIRC PRESCOL ELEM,,,,84.12Z,NAFRev2,N,2.312604,45.545832,0.77,street,Boulevard Docteur Goudouneche 19200 Ussel,19275_0400,G,BOULEVARD DOCTEUR GOUDOUNECHE,
171904311,00213,17190431100213,O,1997-01-01,02,2018,,2020-08-25T10:13:31,false,3,,1,,BD,RHIN ET DANUBE,19200,USSEL,,,19275,,,,,,,,,,,,,,,,,,,2008-01-01,A,INSPECTION EDUCATION NATIONALE USSEL,,,,84.12Z,NAFRev2,N,2.317857,45.538415,0.85,housenumber,1 Boulevard Rhin et Danube 19200 Ussel,19275_1156_00001,G,1 BOULEVARD RHIN ET DANUBE,
171906613,00194,17190661300194,O,1983-03-16,,,,2013-04-29T22:36:00,false,5,,6,,AV,PIERRE SEMARD,19200,USSEL,,,19275,,,,,,,,,,,,,,,,,,,2009-01-01,F,DDE SUBD TERRIT USSEL,,,,84.13Z,NAFRev2,N,2.315235,45.554895,0.76,housenumber,6 Rue Pierre Semard 19200 Ussel,19275_c7ptr6_00006,G,6 RUE PIERRE SEMARD,
178701116,00091,17870111600091,O,1983-05-03,NN,,,2011-04-23T04:08:55,false,5,,9,,BD,CLEMENCEAU,19200,USSEL,,,19275,,,,,,,,,,,,,,,,,,,2010-01-01,F,TRIBUNAL D'INSTANCE D'USSEL,,,,84.23Z,NAFRev2,N,2.308228,45.547715,0.83,housenumber,9 Boulevard Clémenceau 19200 Ussel,19275_0320_00009,G,9 BOULEVARD CLEMENCEAU,
178701116,00380,17870111600380,O,2007-12-25,NN,,,2009-06-27T03:14:56,false,1,,9,,BD,CLEMENCEAU,19200,USSEL,,BP 61,19275,,,,,,,,,,,,,,,,,,,2007-12-25,A,TRIBUNAL PARITAIRE DES BAUX RURAUX,,,,84.23Z,NAFRev2,N,2.308228,45.547715,0.83,housenumber,9 Boulevard Clémenceau 19200 Ussel,19275_0320_00009,G,9 BOULEVARD CLEMENCEAU,
180038028,03878,18003802803878,O,1983-03-16,NN,,,2010-04-18T03:07:50,false,4,,5,,RUE,ERNEST JARASSE,19200,USSEL,,,19275,,,,,,,,,,,,,,,,,,,2008-12-19,F,AGENCE LOCALE D'USSEL,,,,84.13Z,NAFRev2,N,2.312176,45.546709,0.95,housenumber,5 Rue Ernest Jarasse 19200 Ussel,19275_0480_00005,G,5 RUE ERNEST JARASSE,
181908013,00095,18190801300095,O,2002-04-23,NN,,,2011-04-23T04:09:15,false,3,IMMEUBLE CONSULAIRE DE L'ODINE,,,AV,DE LA RESISTANCE,19200,USSEL,,,19275,,,,,,,,,,,,,,,,,,,2010-12-20,F,CENTRE DE FORMALITES,,,,94.11Z,NAFRev2,O,2.30807,45.54401,0.86,street,Avenue de la Resistance 19200 Ussel,19275_1175,G,AVENUE DE LA RESISTANCE,
191900380,00012,19190038000012,O,1983-03-01,21,2018,,2020-08-25T10:14:02,true,4,,,,BD,DE LA JALOUSTRE,19200,USSEL,,,19275,,,,,,,,,,,,,,,,,,,2008-01-01,A,,,,,85.31Z,NAFRev2,N,2.314896,45.54316,0.85,street,Boulevard de la Jaloustre 19200 Ussel,19275_0705,G,BOULEVARD DE LA JALOUSTRE,
191906155,00012,19190615500012,O,1983-03-01,21,2018,,2020-08-25T10:14:02,true,5,,,,PL,VOLTAIRE,19200,USSEL,,,19275,,,,,,,,,,,,,,,,,,,2012-02-05,A,,,,,85.31Z,NAFRev2,O,2.307448,45.545597,0.79,locality,Place Voltaire 19200 Ussel,19275_1490,G,PLACE VOLTAIRE,
191906742,00017,19190674200017,O,1983-03-01,11,2018,,2020-08-25T10:14:02,true,4,,,,BD,DE LA JALOUSTRE,19200,USSEL,,,19275,,,,,,,,,,,,,,,,,,,2013-12-08,A,,,,,85.32Z,NAFRev2,O,2.314896,45.54316,0.85,street,Boulevard de la Jaloustre 19200 Ussel,19275_0705,G,BOULEVARD DE LA JALOUSTRE,
200010494,00025,20001049400025,O,2013-07-08,NN,,,2017-05-04T01:16:09,true,2,,,,,PARC D'ACTIVITE BOIS ST MICHEL,19200,USSEL,,,19275,,,,,,,,,,,,,,,,,,,2015-12-31,F,,,,,91.03Z,NAFRev2,O,2.2601799,45.5147076,0.82,poi.industrial,Parc d’activité du Bois Saint-Michel (Zone industrielle) Saint-Angel,https://osm.org/way/201483362,G,,
200021053,00018,20002105300018,O,2009-09-01,,,,2013-07-29T16:34:12,true,2,MAIRIE,26,,AV,MARMONTEL,19200,USSEL,,BP63,19275,,,,,,,,,,,,,,,,,,,2013-07-09,F,,,,,84.11Z,NAFRev2,N,2.313825,45.54484,0.83,housenumber,26 Avenue Marmontel 19200 Ussel,19275_0870_00026,G,26 AVENUE MARMONTEL,
200060259,00013,20006025900013,O,2016-01-01,02,2018,,2020-08-25T10:15:04,true,1,CC HAUTE-CORREZE COMMUNAUTE,23,,,PARC D'ACTIVITE BOIS ST MICHEL,19200,USSEL,,,19275,,,,,,,,,,,,,,,,,,,2016-01-01,A,,,,,84.13Z,NAFRev2,O,2.2601799,45.5147076,0.82,poi.industrial,Parc d’activité du Bois Saint-Michel (Zone industrielle) Saint-Angel,https://osm.org/way/201483362,G,,
200066744,00018,20006674400018,O,2017-01-01,22,2018,,2020-08-25T10:15:09,true,1,,23,,,PARC D'ACTIVITE BOIS ST MICHEL,19200,USSEL,,,19275,,,,,,,,,,,,,,,,,,,2017-01-01,A,,,,,84.11Z,NAFRev2,O,2.2601799,45.5147076,0.82,poi.industrial,Parc d’activité du Bois Saint-Michel (Zone industrielle) Saint-Angel,https://osm.org/way/201483362,G,,
200078947,00013,20007894700013,O,2018-01-01,12,2018,,2020-08-25T10:15:19,true,1,,2,,AV,DE BEAUREGARD,19200,USSEL,,,19275,,,,,,,,,,,,,,,,,,,2018-01-01,A,,,,,84.11Z,NAFRev2,O,2.313937,45.551814,0.85,housenumber,2 Avenue de Beauregard 19200 Ussel,19275_0070_00002,G,2 AVENUE DE BEAUREGARD,
211927504,00012,21192750400012,O,1983-03-01,21,2018,,2020-08-25T10:16:06,true,4,,26,,AV,MARMONTEL,19200,USSEL,,BP 63,19275,,,,,,,,,,,,,,,,,,,2008-01-01,A,MAIRIE,,,,84.11Z,NAFRev2,O,2.313825,45.54484,0.83,housenumber,26 Avenue Marmontel 19200 Ussel,19275_0870_00026,G,26 AVENUE MARMONTEL,
211927504,00038,21192750400038,O,1983-03-16,NN,,,2008-01-04T18:27:33,false,3,,,,RUE,DE PONTICQ,19200,USSEL,,,19275,,,,,,,,,,,,,,,,,,,2008-01-01,A,CENTRE TOURISTIQUE,,,,55.20Z,NAFRev2,N,2.297209,45.54491,0.78,locality,Rue Ponticq 19200 Ussel,19275_1052,G,RUE PONTICQ,
211927504,00137,21192750400137,O,1983-12-21,03,2018,,2021-07-13T10:41:26,false,4,,,,,GRAMMONT GRAND,19200,USSEL,,,19275,,,,,,,,,,,,,,,,,,,2021-08-31,F,ECOL MATE GRAMMONT,,,,85.10Z,NAFRev2,N,2.325456,45.548107,0.95,locality,Grammont Grand 19200 Ussel,19275_b242,G,GRAMMONT GRAND,
211927504,00152,21192750400152,O,1983-12-21,12,2018,,2020-08-25T10:16:06,false,3,,,,BD,DU DOCTEUR GOUDOUNECHE,19200,USSEL,,,19275,,,,,,,,,,,,,,,,,,,2008-01-01,A,ECOL PRIM NO 1 J JAURES,,,,85.20Z,NAFRev2,N,2.312604,45.545832,0.77,street,Boulevard Docteur Goudouneche 19200 Ussel,19275_0400,G,BOULEVARD DOCTEUR GOUDOUNECHE,
211927504,00160,21192750400160,O,1983-12-21,NN,,,2006-10-26T23:40:27,false,3,,,,BD,DU DOCTEUR GOUDOUNECHE,19200,USSEL,,,19275,,,,,,,,,,,,,,,,,,,2005-12-25,F,ECOL PRIM NO 2 J. JAURES,,,,80.1Z,NAFRev1,N,2.312604,45.545832,0.77,street,Boulevard Docteur Goudouneche 19200 Ussel,19275_0400,G,BOULEVARD DOCTEUR GOUDOUNECHE,
211927504,00178,21192750400178,O,1983-12-21,02,2018,,2020-08-25T10:16:06,false,3,,,,BD,RHIN ET DANUBE,19200,USSEL,,,19275,,,,,,,,,,,,,,,,,,,2008-01-01,A,ECOLE PRIMAIRE PUBLIQUE,,,,85.20Z,NAFRev2,N,2.317857,45.538415,0.84,street,Boulevard Rhin et Danube 19200 Ussel,19275_1156,G,BOULEVARD RHIN ET DANUBE,
211927504,00186,21192750400186,O,1983-12-21,12,2018,,2020-08-25T10:16:06,false,3,,,,IMP,DES JONQUILLES,19200,USSEL,,,19275,,,,,,,,,,,,,,,,,,,2008-01-01,A,ECOL MATE LA JALOUSTRE,,,,85.10Z,NAFRev2,N,2.317661,45.537893,0.85,street,Impasse des Jonquilles 19200 Ussel,19275_0722,G,IMPASSE DES JONQUILLES,
211927504,00194,21192750400194,O,1983-12-21,NN,,,,false,4,,10,,,LA GARE,19200,USSEL,,,19275,,,,,,,,,,,,,,,,,,,1997-12-31,F,ECOLE PRIMAIRE PUBLIQUE,,,,80.1Z,NAF1993,N,2.302795,45.555658,0.76,housenumber,10 Boulevard de la Garenne 19200 Ussel,19275_0605_00010,G,10 BOULEVARD DE LA GARENNE,
211927504,00202,21192750400202,O,1983-12-21,03,2018,,2020-08-25T10:16:06,false,4,,10,,RUE,LACHAZE,19200,USSEL,,,19275,,,,,,,,,,,,,,,,,,,2008-01-01,A,ECOLE PRIMAIRE PUBLIQUE,,,,85.20Z,NAFRev2,N,2.313513,45.553892,0.95,housenumber,10 Rue Lachaze 19200 Ussel,19275_0750_00010,G,10 RUE LACHAZE,
211927504,00210,21192750400210,O,1983-12-21,03,2018,,2020-08-25T10:16:06,false,3,,,,AV,THIERS,19200,USSEL,,,19275,,,,,,,,,,,,,,,,,,,2008-01-01,A,ECOLE MATERNELLE PUBLIQUE,,,,85.10Z,NAFRev2,N,2.305072,45.545844,0.76,street,Avenue Thiers 19200 Ussel,19275_1310,G,AVENUE THIERS,
211927504,00228,21192750400228,O,1985-09-01,03,2018,,2020-08-25T10:16:06,false,3,,24,,AV,MARMONTEL,19200,USSEL,,,19275,,,,,,,,,,,,,,,,,,,2008-01-01,A,BIBLIOTHEQUE MUNICIPALE,,,,91.01Z,NAFRev2,N,2.311664,45.545804,0.83,housenumber,24 Avenue Marmontel 19200 Ussel,19275_0870_00024,G,24 AVENUE MARMONTEL,
211927504,00236,21192750400236,O,1993-09-01,NN,,,2006-10-26T23:40:27,false,3,LA JALOUSTRE,,,BD,RHIN ET DANUBE,19200,USSEL,,,19275,,,,,,,,,,,,,,,,,,,2005-12-25,F,ECOLE PRIMAIRE PUBLIQUE LA JALOUSTRE,,,,80.1Z,NAFRev1,N,2.317857,45.538415,0.84,street,Boulevard Rhin et Danube 19200 Ussel,19275_1156,G,BOULEVARD RHIN ET DANUBE,
211927504,00244,21192750400244,O,1995-12-25,NN,,,2008-01-04T18:27:33,false,2,MAIRIE,,,,PONTICQ,19200,USSEL,,,19275,,,,,,,,,,,,,,,,,,,2008-01-01,A,CAMPING MUNICIPAL DU PONTY,,,,55.30Z,NAFRev2,N,2.297209,45.54491,0.93,locality,Rue Ponticq 19200 Ussel,19275_1052,G,RUE PONTICQ,
211927504,00251,21192750400251,O,1995-12-25,02,2018,,2020-08-25T10:16:06,false,3,,26,,AV,MARMONTEL,19200,USSEL,,,19275,,,,,,,,,,,,,,,,,,,2019-06-12,F,ABATTOIRS,,,,10.11Z,NAFRev2,N,2.313825,45.54484,0.83,housenumber,26 Avenue Marmontel 19200 Ussel,19275_0870_00026,G,26 AVENUE MARMONTEL,
211927504,00269,21192750400269,O,1998-01-01,NN,,,2013-10-05T12:35:29,false,4,,,,RUE,DU MAZET,19200,USSEL,,,19275,,,,,,,,,,,,,,,,,,,2012-12-25,F,LOCATION IMMEUBLES INDUSTRIELS,,,,68.20B,NAFRev2,N,2.32768,45.554783,0.95,street,Rue du Mazet 19200 Ussel,19275_0905,G,RUE DU MAZET,
211927504,00277,21192750400277,O,1998-01-01,NN,,,2016-05-24T09:53:54,false,4,MAIRIE,26,,AV,MARMONTEL,19200,USSEL,,,19275,,,,,,,,,,,,,,,,,,,2016-03-23,F,POMPES FUNEBRES,,,,96.03Z,NAFRev2,N,2.313825,45.54484,0.83,housenumber,26 Avenue Marmontel 19200 Ussel,19275_0870_00026,G,26 AVENUE MARMONTEL,
211927504,00285,21192750400285,O,1998-11-09,NN,,,2020-05-27T09:28:04,false,4,BP63,26,,AV,MARMONTEL,19200,USSEL,,,19275,,,,,,,,,,,,,,,,,,,2018-12-12,F,LOTISSEMENTS,,,,42.99Z,NAFRev2,N,2.313825,45.54484,0.83,housenumber,26 Avenue Marmontel 19200 Ussel,19275_0870_00026,G,26 AVENUE MARMONTEL,
211927504,00293,21192750400293,O,1999-04-16,03,2018,,2020-08-25T10:16:06,false,3,MAIRIE,26,,AV,MARMONTEL,19200,USSEL,,BP 63,19275,,,,,,,,,,,,,,,,,,,2008-01-01,A,SERVICE DES EAUX,,,,36.00Z,NAFRev2,N,2.313825,45.54484,0.83,housenumber,26 Avenue Marmontel 19200 Ussel,19275_0870_00026,G,26 AVENUE MARMONTEL,
211927504,00301,21192750400301,O,1999-04-16,01,2018,,2020-08-25T10:16:06,false,3,MAIRIE,26,,AV,MARMONTEL,19200,USSEL,,BP 63,19275,,,,,,,,,,,,,,,,,,,2008-01-01,A,SERVICE ASSAINISSEMENT,,,,37.00Z,NAFRev2,N,2.313825,45.54484,0.83,housenumber,26 Avenue Marmontel 19200 Ussel,19275_0870_00026,G,26 AVENUE MARMONTEL,
211927504,00319,21192750400319,O,2000-10-01,NN,,,2017-05-04T01:23:09,false,5,,,,RTE,DE NEUVIC,19200,USSEL,,,19275,,,,,,,,,,,,,,,,,,,2015-12-31,F,COMPLEXE DE TRI DU CAMP CESAR,,,,38.12Z,NAFRev2,N,2.30761,45.540547,0.82,street,Route de Neuvic 19200 Ussel,19275_0951,G,ROUTE DE NEUVIC,
211927504,00327,21192750400327,O,2000-12-01,NN,,,2006-10-26T23:40:27,false,4,,,,RUE,DE LOCHES,19200,USSEL,,BP 63,19275,19208,USSEL CEDEX,,,,,,,,,,,,,,,,,2005-12-25,F,DECHETTERIE MUNICIPALE,,,,90.0E,NAFRev1,N,2.306738,45.550339,0.95,street,Rue de Loches 19200 Ussel,19275_0840,G,RUE DE LOCHES,
211927504,00335,21192750400335,O,2006-02-22,12,2018,,2020-08-25T10:16:06,false,2,,,,RUE,DU STADE,19200,USSEL,,,19275,,,,,,,,,,,,,,,,,,,2008-01-01,A,SERVICE DES SPORTS,,,,84.11Z,NAFRev2,O,2.31498,45.547793,0.95,street,Rue du Stade 19200 Ussel,19275_1255,G,RUE DU STADE,
211927504,00343,21192750400343,O,2006-02-22,12,2018,,2020-08-25T10:16:06,false,2,,,,RUE,DU CHATEAU D EAU,19200,USSEL,,,19275,,,,,,,,,,,,,,,,,,,2008-01-01,A,SERVICES TECHNIQUES,,,,84.11Z,NAFRev2,O,2.303488,45.553658,0.95,locality,Rue du Château d'Eau 19200 Ussel,19275_0283,G,RUE DU CHATEAU D EAU,
211927504,00350,21192750400350,O,2006-02-22,12,2018,,2020-08-25T10:16:06,false,2,,,,RUE,DU DOC ROULLET,19200,USSEL,,,19275,,,,,,,,,,,,,,,,,,,2008-01-01,A,MAISON DE L ENFANCE,,,,88.91A,NAFRev2,O,2.313234,45.544174,0.85,street,Rue du Docteur Roullet 19200 Ussel,19275_0410,G,RUE DU DOCTEUR ROULLET,
221927205,00247,22192720500247,O,1992-01-01,NN,,,,false,4,,,,,HLM LA GANNE LA JALOUSTRE,19200,USSEL,,,19275,,,,,,,,,,,,,,,,,,,2003-04-16,F,SERVICE DE PREVENTION SPECIALISE,,,,85.3K,NAFRev1,N,2.317759,45.540437,0.95,locality,Hlm la Ganne la Jaloustre 19200 Ussel,19275_a093,G,HLM LA GANNE LA JALOUSTRE,
221927205,00296,22192720500296,O,2003-04-16,NN,,,2007-05-19T08:21:33,false,3,,,,RUE,DES SANS CULOTTES,19200,USSEL,,,19275,,,,,,,,,,,,,,,,,,,2005-03-31,F,SERVICE DE PREVENTION SPECIALISE,,,,85.3K,NAFRev1,N,2.309539,45.547042,0.95,street,Rue des Sans Culottes 19200 Ussel,19275_1210,G,RUE DES SANS CULOTTES,
221927205,00379,22192720500379,O,2003-11-18,NN,,,2013-05-18T02:17:35,false,5,,22,,RUE,DE LA CIVADIERE,19200,USSEL,,,19275,,,,,,,,,,,,,,,,,,,2011-07-11,F,CENTRE MEDICO SOCIAL,,,,88.99B,NAFRev2,O,2.315272,45.547108,0.95,housenumber,22 Rue de la Civadière 19200 Ussel,19275_0315_00022,G,22 RUE DE LA CIVADIERE,
221927205,00403,22192720500403,O,2003-11-18,NN,,,2008-01-04T18:46:18,false,3,,22,,RUE,DE LA CIVADIERE,19200,USSEL,,,19275,,,,,,,,,,,,,,,,,,,2008-01-01,A,UNITE TERRIT ACTIONS MEDICO SOCIALES,,,,88.99B,NAFRev2,N,2.315272,45.547108,0.95,housenumber,22 Rue de la Civadière 19200 Ussel,19275_0315_00022,G,22 RUE DE LA CIVADIERE,
221927205,00510,22192720500510,O,2011-07-11,11,2018,,2020-08-25T10:19:53,false,1,,35,,AV,DU GENERAL LECLERC,19200,USSEL,,,19275,,,,,,,,,,,,,,,,,,,2011-07-11,A,CENTRE MEDICO SOCIAL DEPARTEMENTAL D USSEL,,,,88.99B,NAFRev2,N,2.302505,45.554877,0.87,housenumber,35 Avenue du Général Leclerc 19200 Ussel,19275_0620_00035,G,35 AVENUE DU GENERAL LECLERC,
221927205,00551,22192720500551,O,2021-03-01,,,,2021-02-19T14:03:33,false,1,,20,,RUE,DU GENERAL A PROUZERGUE,19200,USSEL,,,19275,,,,,,,,,,,,,,,,,,,2021-03-01,A,CDS CORREZE - ANTENNE USSEL,,,,86.21Z,NAFRev2,N,2.309004,45.544346,0.89,housenumber,20 Rue du General Antony Prouzergue 19200 Ussel,19275_0615_00020,G,20 RUE DU GAL ANTONY PROUZERGUE,
241927417,00022,24192741700022,O,2004-03-30,NN,,,2016-10-27T10:28:04,false,4,,23,,,PARC D'ACTIVITE BOIS ST MICHEL,19200,USSEL,,,19275,,,,,,,,,,,,,,,,,,,2017-01-01,F,MARCHE AU CADRAN,,,,84.13Z,NAFRev2,N,2.2601799,45.5147076,0.82,poi.industrial,Parc d’activité du Bois Saint-Michel (Zone industrielle) Saint-Angel,https://osm.org/way/201483362,G,,
241927417,00030,24192741700030,O,2005-04-07,,,,2016-10-27T10:28:04,false,4,,23,,,PARC D'ACTIVITE BOIS ST MICHEL,19200,USSEL,,,19275,,,,,,,,,,,,,,,,,,,2017-01-01,F,ZONE D'ACTIVITES DE MAUBECH,,,,42.99Z,NAFRev2,N,2.2601799,45.5147076,0.82,poi.industrial,Parc d’activité du Bois Saint-Michel (Zone industrielle) Saint-Angel,https://osm.org/way/201483362,G,,
241927417,00089,24192741700089,O,2013-05-23,NN,,,2019-06-24T13:13:07,true,3,,23,,,PARC D'ACTIVITE BOIS ST MICHEL,19200,USSEL,,,19275,,,,,,,,,,,,,,,,,,,2017-01-01,F,,,,,84.11Z,NAFRev2,O,2.2601799,45.5147076,0.82,poi.industrial,Parc d’activité du Bois Saint-Michel (Zone industrielle) Saint-Angel,https://osm.org/way/201483362,G,,
251923306,00020,25192330600020,O,1996-03-01,01,2018,,2020-08-25T10:20:16,true,3,,2,,AV,DE BEAUREGARD,19200,USSEL,,,19275,,,,,,,,,,,,,,,,,,,2008-01-01,A,,,,,37.00Z,NAFRev2,O,2.313937,45.551814,0.85,housenumber,2 Avenue de Beauregard 19200 Ussel,19275_0070_00002,G,2 AVENUE DE BEAUREGARD,
251927505,00015,25192750500015,O,1983-03-01,NN,,,2015-05-14T03:46:12,false,5,MAIRIE,26,,AV,MARMONTEL,19200,USSEL,,,19275,,,,,,,,,,,,,,,,,,,2013-01-01,F,,,,,38.11Z,NAFRev2,O,2.313825,45.54484,0.83,housenumber,26 Avenue Marmontel 19200 Ussel,19275_0870_00026,G,26 AVENUE MARMONTEL,