siren,nic,siret,statutDiffusionEtablissement,dateCreationEtablissement,trancheEffectifsEtablissement,anneeEffectifsEtablissement,activitePrincipaleRegistreMetiersEtablissement,dateDernierTraitementEtablissement,etablissementSiege,nombrePeriodesEtablissement,complementAdresseEtablissement,numeroVoieEtablissement,indiceRepetitionEtablissement,typeVoieEtablissement,libelleVoieEtablissement,codePostalEtablissement,libelleCommuneEtablissement,libelleCommuneEtrangerEtablissement,distributionSpecialeEtablissement,codeCommuneEtablissement,codeCedexEtablissement,libelleCedexEtablissement,codePaysEtrangerEtablissement,libellePaysEtrangerEtablissement,complementAdresse2Etablissement,numeroVoie2Etablissement,indiceRepetition2Etablissement,typeVoie2Etablissement,libelleVoie2Etablissement,codePostal2Etablissement,libelleCommune2Etablissement,libelleCommuneEtranger2Etablissement,distributionSpeciale2Etablissement,codeCommune2Etablissement,codeCedex2Etablissement,libelleCedex2Etablissement,codePaysEtranger2Etablissement,libellePaysEtranger2Etablissement,dateDebut,etatAdministratifEtablissement,enseigne1Etablissement,enseigne2Etablissement,enseigne3Etablissement,denominationUsuelleEtablissement,activitePrincipaleEtablissement,nomenclatureActivitePrincipaleEtablissement,caractereEmployeurEtablissement,longitude,latitude,geo_score,geo_type,geo_adresse,geo_id,geo_ligne,geo_l4,geo_l5
212317408,00012,21231740800012,O,1983-03-01,02,2018,,2020-08-25T10:16:17,true,4,,,,PL,DE LA MAIRIE,23600,SOUMANS,,,23174,,,,,,,,,,,,,,,,,,,2008-01-01,A,MAIRIE,,,,84.11Z,NAFRev2,O,4.9019022,46.7490994,0.79,poi.park,Place de la Mairie (Parc) Épervans,https://osm.org/way/234085031,G,,
212317408,00038,21231740800038,O,1983-12-21,01,2018,,2020-08-25T10:16:17,false,3,,,,RUE,DES ECOLES,23600,SOUMANS,,,23174,,,,,,,,,,,,,,,,,,,2008-01-01,A,ECOLE PRIMAIRE PUBLIQUE,,,,85.20Z,NAFRev2,N,2.308182,46.301439,0.94,street,Rue des Ecoles 23600 Soumans,23174_0006,G,RUE DES ECOLES,
212317408,00046,21231740800046,O,1997-01-01,NN,,,2019-05-15T15:19:54,false,4,MAIRIE,,,PL,DE LA MAIRIE,23600,SOUMANS,,,23174,,,,,,,,,,,,,,,,,,,2017-12-31,F,SERVICE ASSAINISSEMENT,,,,37.00Z,NAFRev2,N,4.9019022,46.7490994,0.79,poi.park,Place de la Mairie (Parc) Épervans,https://osm.org/way/234085031,G,,
212317408,00053,21231740800053,O,1995-12-25,NN,,,2008-01-04T18:28:37,false,2,MAIRIE,,,PL,DE LA MAIRIE,23600,SOUMANS,,,23174,,,,,,,,,,,,,,,,,,,2008-01-01,A,REGIE TRANSPORTS SCOLAIRES,,,,49.31Z,NAFRev2,N,4.9019022,46.7490994,0.79,poi.park,Place de la Mairie (Parc) Épervans,https://osm.org/way/234085031,G,,
212317408,00061,21231740800061,O,2002-08-01,NN,,,2011-08-23T10:55:01,false,4,MAIRIE,,,PL,DE LA MAIRIE,23600,SOUMANS,,,23174,,,,,,,,,,,,,,,,,,,2009-03-27,F,LOTISSEMENT COMMUNAL,,,,42.99Z,NAFRev2,N,4.9019022,46.7490994,0.79,poi.park,Place de la Mairie (Parc) Épervans,https://osm.org/way/234085031,G,,
262317407,00019,26231740700019,O,1983-03-01,NN,,,2017-08-06T14:09:21,true,4,MAIRIE,,,PL,DE LA MAIRIE,23600,SOUMANS,,,23174,,,,,,,,,,,,,,,,,,,2017-08-01,F,CCAS,,,,88.99B,NAFRev2,N,4.9019022,46.7490994,0.79,poi.park,Place de la Mairie (Parc) Épervans,https://osm.org/way/234085031,G,,
262317415,00012,26231741500012,O,1983-03-01,NN,,,2008-01-04T18:57:01,true,3,MAIRIE,,,PL,DE LA MAIRIE,23600,SOUMANS,,,23174,,,,,,,,,,,,,,,,,,,2008-01-01,A,CDE,,,,88.99B,NAFRev2,N,4.9019022,46.7490994,0.79,poi.park,Place de la Mairie (Parc) Épervans,https://osm.org/way/234085031,G,,
301445649,00017,30144564900017,O,,NN,,,,true,1,,,,,LE BOURG,23600,SOUMANS,,,23174,,,,,,,,,,,,,,,,,,,1996-02-27,F,,,,,51.3J,NAF1993,N,2.212915,47.9910304,0.9,poi.bar,Le Bourg (Bar) Ingrannes,https://osm.org/node/1718543174,G,,
302641857,00016,30264185700016,O,1900-01-01,NN,,,2012-09-11T14:21:43,true,3,,,,,MAIRIE,23600,SOUMANS,,,23174,,,,,,,,,,,,,,,,,,,2008-01-01,A,,,,,90.01Z,NAFRev2,N,3.0709671,50.6304695,0.92,poi.townhall,Hôtel de Ville Lille,https://osm.org/way/40917078,G,,
303631493,00010,30363149300010,O,,,,,,true,1,,,,,,23600,SOUMANS,,,23174,,,,,,,,,,,,,,,,,,,1985-12-25,F,,,,,21.01,NAP,N,,,0,,,,,,
303681332,00019,30368133200019,O,,NN,,,,true,1,,,,,,23600,SOUMANS,,,23174,,,,,,,,,,,,,,,,,,,,F,,,,,55.40,NAP,N,,,0,,,,,,
305951873,00010,30595187300010,O,1976-01-01,NN,,,2010-09-09T10:09:25,true,4,,,,,,23600,SOUMANS,,,23174,,,,,,,,,,,,,,,,,,,2009-12-25,F,,,,,56.10A,NAFRev2,N,,,0,,,,,,
306104860,00011,30610486000011,O,,NN,,,,true,1,,,,,,23600,SOUMANS,,,23174,,,,,,,,,,,,,,,,,,,1993-09-17,F,,,,,55.3A,NAF1993,N,,,0,,,,,,
306589292,00011,30658929200011,O,,,,,,true,1,,,,,,23600,SOUMANS,,,23174,,,,,,,,,,,,,,,,,,,1988-12-12,F,,,,,57.01,NAP,N,,,0,,,,,,
306970203,00015,30697020300015,O,,NN,,,,true,1,,,,,,23600,SOUMANS,,,23174,,,,,,,,,,,,,,,,,,,,F,,,,,81.21,NAP,N,,,0,,,,,,
308852292,00017,30885229200017,O,,,,,,true,1,,,,,BOURG,23600,SOUMANS,,,23174,,,,,,,,,,,,,,,,,,,1995-12-25,F,,,,,70.2C,NAF1993,N,-1.229143,44.2011043,0.89,poi.school,École du bourg Mimizan,https://osm.org/way/35215942,G,,
308929579,00040,30892957900040,O,2007-04-01,,,,2020-10-27T03:35:03,true,3,,,,,LE BOURG,23600,SOUMANS,,,23174,,,,,,,,,,,,,,,,,,,2019-12-16,F,,,,,68.20A,NAFRev2,N,2.212915,47.9910304,0.9,poi.bar,Le Bourg (Bar) Ingrannes,https://osm.org/node/1718543174,G,,
310129796,00010,31012979600010,O,,NN,,,2006-11-25T09:25:49,true,1,,,,,MAIRIE,23600,SOUMANS,,,23174,,,,,,,,,,,,,,,,,,,,F,,,,,97.23,NAP,N,3.0709671,50.6304695,0.92,poi.townhall,Hôtel de Ville Lille,https://osm.org/way/40917078,G,,
310679097,00017,31067909700017,O,1900-01-01,NN,,,2008-01-04T20:02:06,true,3,,,,,MAIRIE,23600,SOUMANS,,,23174,,,,,,,,,,,,,,,,,,,2008-01-01,A,,,,,93.12Z,NAFRev2,N,3.0709671,50.6304695,0.92,poi.townhall,Hôtel de Ville Lille,https://osm.org/way/40917078,G,,
310998414,00034,31099841400034,O,1985-01-01,NN,,,2021-02-11T11:42:06,false,3,,,,,LE BOURG,23600,SOUMANS,,,23174,,,,,,,,,,,,,,,,,,,2008-01-01,A,,,,,58.14Z,NAFRev2,N,2.212915,47.9910304,0.9,poi.bar,Le Bourg (Bar) Ingrannes,https://osm.org/node/1718543174,G,,
312581960,00019,31258196000019,O,1996-01-05,NN,,,2008-11-07T00:27:44,false,4,,,,,MONTEBRAS,23600,SOUMANS,,,23174,,,,,,,,,,,,,,,,,,,2002-04-26,F,ISM,,,,45.4C,NAF1993,N,2.30209,46.318839,0.94,street,Montebras 23600 Soumans,23174_5xl53z,G,MONTEBRAS,
313690745,00028,31369074500028,O,,,,,,true,1,,,,,,23600,SOUMANS,,,23174,,,,,,,,,,,,,,,,,,,1988-12-31,F,,,,,55.31,NAP,N,,,0,,,,,,
313796708,00029,31379670800029,O,1989-01-01,NN,,,2006-11-25T09:33:06,true,3,,,,RTE,BOUSSAC,23600,SOUMANS,,,23174,,,,,,,,,,,,,,,,,,,2006-03-31,F,,,,,74.1J,NAFRev1,N,2.327561,46.318376,0.32,street,Le Bouchat 23600 Soumans,23174_nmc64i,G,LE BOUCHAT,
315759324,00017,31575932400017,O,1979-01-01,NN,,,2008-11-07T00:31:14,false,4,,,,,MAZURIER,23600,SOUMANS,,,23174,,,,,,,,,,,,,,,,,,,1999-03-08,F,,,,,45.2V,NAF1993,O,2.34285,46.311182,0.92,street,Le Mazurier 23600 Soumans,23174_vn8nbc,G,LE MAZURIER,
315759324,00025,31575932400025,O,1999-03-08,NN,,4399CZ,2018-09-29T12:15:37,true,4,,,,,LES OUCHETTES,23600,SOUMANS,,,23174,,,,,,,,,,,,,,,,,,,2016-09-30,F,,,,,43.99C,NAFRev2,N,2.308732,46.3057,0.94,street,Les Ouchettes 23600 Soumans,23174_k17as9,G,LES OUCHETTES,
316073519,00043,31607351900043,O,2013-01-01,,,,2014-09-09T08:18:49,false,2,,,,,CHATRES,23600,SOUMANS,,,23174,,,,,,,,,,,,,,,,,,,2014-08-28,F,,,,,01.11Z,NAFRev2,N,2.337928,46.283216,0.94,street,Chatres 23600 Soumans,23174_imm3bq,G,CHATRES,
317283067,00013,31728306700013,O,1979-01-01,NN,,,2007-09-28T14:14:46,true,3,,,,,LA GARDE,23600,SOUMANS,,,23174,,,,,,,,,,,,,,,,,,,2007-12-31,F,,,,,74.2B,NAFRev1,N,2.3015,46.289341,0.94,street,La Garde 23600 Soumans,23174_mdegjx,G,LA GARDE,
317792828,00020,31779282800020,O,1900-01-01,,,,2011-04-28T00:16:57,false,3,,,,LD,MONTEBAS,23600,SOUMANS,,,23174,,,,,,,,,,,,,,,,,,,1997-11-17,F,,,,,29.3C,NAF1993,N,2.30209,46.318839,0.73,street,Montebras 23600 Soumans,23174_5xl53z,G,MONTEBRAS,
317792828,00038,31779282800038,O,2004-02-23,NN,,,2017-01-11T11:17:19,true,4,,,,,MONTBRAS,23600,SOUMANS,,,23174,,,,,,,,,,,,,,,,,,,2016-12-31,F,,,,,01.42Z,NAFRev2,N,2.30209,46.318839,0.73,street,Montebras 23600 Soumans,23174_5xl53z,G,MONTEBRAS,
317878569,00019,31787856900019,O,,NN,,,,true,1,,,,,BOURG,23600,SOUMANS,,,23174,,,,,,,,,,,,,,,,,,,1983-12-31,F,,,,,77.11,NAP,N,-1.229143,44.2011043,0.89,poi.school,École du bourg Mimizan,https://osm.org/way/35215942,G,,
318507720,00015,31850772000015,O,,,,,,true,1,,,,HAM,LA GARDE,23600,SOUMANS,,,23174,,,,,,,,,,,,,,,,,,,1984-12-25,F,,,,,84.12,NAP,N,2.3015,46.289341,0.94,street,La Garde 23600 Soumans,23174_mdegjx,G,LA GARDE,
320702079,00031,32070207900031,O,2007-04-01,,,,2008-01-04T18:17:11,false,2,,,R,,DES ECOLES,23600,SOUMANS,,,23174,,,,,,,,,,,,,,,,,,,2008-01-01,A,,,,,68.20A,NAFRev2,N,2.308182,46.301439,0.78,street,Rue des Ecoles 23600 Soumans,23174_0006,G,RUE DES ECOLES,
322427592,00017,32242759200017,O,1981-07-20,NN,,,,false,4,,,,,MONTEBRAS,23600,SOUMANS,,,23174,,,,,,,,,,,,,,,,,,,1999-01-01,F,,,,,01.4A,NAF1993,N,2.30209,46.318839,0.94,street,Montebras 23600 Soumans,23174_5xl53z,G,MONTEBRAS,
324184274,00011,32418427400011,O,1982-03-21,NN,,,2009-06-27T04:30:10,true,4,,,,,LE MONTURET,23600,SOUMANS,,,23174,,,,,,,,,,,,,,,,,,,2003-12-31,F,,,,,01.2E,NAFRev1,N,2.308007,46.301408,0.39,street,Route de Montebras 23600 Soumans,23174_0009,G,ROUTE DE MONTEBRAS,
324195890,00011,32419589000011,O,,NN,,,,true,1,,,,,LES PARENTS,23600,SOUMANS,,,23174,,,,,,,,,,,,,,,,,,,1996-12-31,F,,,,,01.2E,NAF1993,N,3.8681567,43.7739078,0.88,poi.kindergarten,Lieu d'accueil enfants-parents Les lucioles (Jardin d'enfant) Saint-Mathieu-de-Tréviers,https://osm.org/node/3274881362,G,,
324226166,00019,32422616600019,O,1981-12-30,NN,,,2020-03-12T12:09:13,false,4,,,,,BELLEFAYE,23600,SOUMANS,,,23174,,,,,,,,,,,,,,,,,,,2018-06-06,F,,,,,68.20B,NAFRev2,N,2.3665,46.300555,0.94,street,Bellefaye 23600 Soumans,23174_gpi0rd,G,BELLEFAYE,
324679067,00037,32467906700037,O,2003-04-01,NN,,,2012-08-02T04:25:01,true,4,,23,,,LA CHASSAGNE,23600,SOUMANS,,,23174,,,,,,,,,,,,,,,,,,,2011-12-31,F,,,,,01.42Z,NAFRev2,N,2.338026,46.296821,0.94,housenumber,23 La Chassagne 23600 Soumans,23174_5szhxn_00023,G,23 LA CHASSAGNE,
324817089,00018,32481708900018,O,,NN,,,,true,1,,,,,LA CHASSAGNE,23600,SOUMANS,,,23174,,,,,,,,,,,,,,,,,,,1994-12-31,F,,,,,92.3A,NAF1993,N,2.334965,46.29779,0.94,street,La Chassagne 23600 Soumans,23174_5szhxn,G,LA CHASSAGNE,
325416030,00014,32541603000014,O,,NN,,,,true,1,,,,,LA CHASSAGNE,23600,SOUMANS,,,23174,,,,,,,,,,,,,,,,,,,,F,,,,,77.10,NAP,N,2.334965,46.29779,0.94,street,La Chassagne 23600 Soumans,23174_5szhxn,G,LA CHASSAGNE,
325479160,00039,32547916000039,O,1995-03-25,NN,,,,true,1,,,,RTE,DE BORD,23600,SOUMANS,,,23174,,,,,,,,,,,,,,,,,,,2001-03-31,F,,,,,85.1C,NAF1993,N,2.308007,46.301408,0.4,street,Route de Montebras 23600 Soumans,23174_0009,G,ROUTE DE MONTEBRAS,
325567162,00038,32556716200038,O,1993-01-01,NN,,4520AA,2019-06-24T13:23:20,false,5,,,,,LE BOURG,23600,SOUMANS,,,23174,,,,,,,,,,,,,,,,,,,2016-07-01,F,,,,,45.20A,NAFRev2,O,2.212915,47.9910304,0.9,poi.bar,Le Bourg (Bar) Ingrannes,https://osm.org/node/1718543174,G,,
325567162,00046,32556716200046,O,2016-07-01,,,4520AA,2017-09-29T09:37:26,true,2,,,,,LES GOUTTES,23600,SOUMANS,,,23174,,,,,,,,,,,,,,,,,,,2017-09-30,F,SOUMANS DEPANNAGE,,,,45.20A,NAFRev2,O,2.310984,46.29957,0.94,street,Les Gouttes 23600 Soumans,23174_552079,G,LES GOUTTES,
325571990,00010,32557199000010,O,1982-10-11,NN,,4391BZ,2015-03-17T00:17:56,true,5,CENSAT,,,,,23600,SOUMANS,,,23174,,,,,,,,,,,,,,,,,,,2008-01-01,A,,,,,43.91B,NAFRev2,O,,,0,,,,,,
326076148,00021,32607614800021,O,,,,,,true,1,,,,,CHATOUX,23600,SOUMANS,,,23174,,,,,,,,,,,,,,,,,,,1985-12-25,F,,,,,87.07,NAP,N,2.1554937,48.8868413,0.76,poi.marketplace,Marché Berteaux (Place de marché) Chatou,https://osm.org/node/2581002739,G,,
326463122,00019,32646312200019,O,1983-01-18,01,2018,,2020-08-25T10:31:55,true,3,,9,,,QUARTIER DE LA VARNADE,23600,SOUMANS,,,23174,,,,,,,,,,,,,,,,,,,2008-01-01,A,,,,,01.42Z,NAFRev2,N,2.306973,46.297626,0.94,housenumber,9 Quartier de la Varnade 23600 Soumans,23174_b125_00009,G,9 QUARTIER DE LA VARNADE,
326648946,00019,32664894600019,O,1983-01-01,NN,,,2011-11-29T04:40:40,true,4,MME MISSIOUX NORE MR NORE,,,LD,BELLEFAYE,23600,SOUMANS,,,23174,,,,,,,,,,,,,,,,,,,2011-08-31,F,,,,,01.42Z,NAFRev2,N,2.3665,46.300555,0.94,street,Bellefaye 23600 Soumans,23174_gpi0rd,G,BELLEFAYE,
327579983,00013,32757998300013,O,,,,,,true,1,,,,,LE MAZURIER,23600,SOUMANS,,,23174,,,,,,,,,,,,,,,,,,,1997-01-01,F,,,,,01.1A,NAF1993,N,2.34285,46.311182,0.94,street,Le Mazurier 23600 Soumans,23174_vn8nbc,G,LE MAZURIER,
328562285,00010,32856228500010,O,1983-01-01,NN,,,2017-12-01T09:08:05,true,4,,,,,LA GARDE,23600,SOUMANS,,,23174,,,,,,,,,,,,,,,,,,,2016-12-31,F,,,,,71.12A,NAFRev2,N,2.3015,46.289341,0.94,street,La Garde 23600 Soumans,23174_mdegjx,G,LA GARDE,
328562285,00028,32856228500028,O,1984-12-31,NN,,,2009-06-08T15:20:15,false,4,,,,,LA GARDE,23600,SOUMANS,,,23174,,,,,,,,,,,,,,,,,,,2008-11-06,F,,,,,01.11Z,NAFRev2,N,2.3015,46.289341,0.94,street,La Garde 23600 Soumans,23174_mdegjx,G,LA GARDE,
330191461,00012,33019146100012,O,,NN,,,,true,1,,,,,,23600,SOUMANS,,,23174,,,,,,,,,,,,,,,,,,,,F,,,,,55.71,NAP,N,,,0,,,,,,
330365818,00013,33036581800013,O,1984-06-21,NN,,,2021-02-17T10:27:01,true,3,,,,,MAIRIE,23600,SOUMANS,,,23174,,,,,,,,,,,,,,,,,,,2008-01-01,A,,,,,01.61Z,NAFRev2,N,3.0709671,50.6304695,0.92,poi.townhall,Hôtel de Ville Lille,https://osm.org/way/40917078,G,,
330604562,00109,33060456200109,O,2013-05-31,,,9524ZZ,2015-03-18T01:01:45,false,2,,14,,RUE,DES ACACIAS,23600,SOUMANS,,,23174,,,,,,,,,,,,,,,,,,,2014-11-10,F,L'ATELIER DES PETITS BONHEURS,,,,95.24Z,NAFRev2,N,2.307103,46.301231,0.94,housenumber,14 Rue des Acacias 23600 Soumans,23174_0002_00014,G,14 RUE DES ACACIAS,
331708966,00014,33170896600014,O,,NN,,,,true,1,,,,,BELLEFAYE,23600,SOUMANS,,,23174,,,,,,,,,,,,,,,,,,,,F,,,,,00.10,NAP,N,2.3665,46.300555,0.94,street,Bellefaye 23600 Soumans,23174_gpi0rd,G,BELLEFAYE,
331708974,00018,33170897400018,O,1984-12-18,NN,,,2018-03-22T11:30:52,true,5,,,,,BELLEFAYE,23600,SOUMANS,,,23174,,,,,,,,,,,,,,,,,,,2018-02-28,F,,,,,01.50Z,NAFRev2,N,2.3665,46.300555,0.94,street,Bellefaye 23600 Soumans,23174_gpi0rd,G,BELLEFAYE,
331718742,00017,33171874200017,O,,NN,,,,true,1,,,,,BELLEFAYE,23600,SOUMANS,,,23174,,,,,,,,,,,,,,,,,,,,F,,,,,01.80,NAP,N,2.3665,46.300555,0.94,street,Bellefaye 23600 Soumans,23174_gpi0rd,G,BELLEFAYE,
332432319,00017,33243231900017,O,1984-01-01,NN,,,,false,4,,,,,CHATEUX,23600,SOUMANS,,,23174,,,,,,,,,,,,,,,,,,,1996-09-01,F,,,,,74.8F,NAF1993,N,2.309751,46.309664,0.94,street,Chateux 23600 Soumans,23174_djx1up,G,CHATEUX,
332432319,00025,33243231900025,O,1996-09-01,NN,,,2019-11-14T03:38:58,true,4,,,,,LE BOURG,23600,SOUMANS,,,23174,,,,,,,,,,,,,,,,,,,2019-12-31,F,,,,,01.42Z,NAFRev2,N,2.212915,47.9910304,0.9,poi.bar,Le Bourg (Bar) Ingrannes,https://osm.org/node/1718543174,G,,
332432319,00033,33243231900033,O,2001-01-01,NN,,,2011-08-04T14:59:36,false,4,,,,,,23600,SOUMANS,,,23174,,,,,,,,,,,,,,,,,,,2008-01-01,F,,,,,66.22Z,NAFRev2,N,,,0,,,,,,
333064962,00017,33306496200017,O,,NN,,,,true,1,,,,,BELLEFAYE,23600,SOUMANS,,,23174,,,,,,,,,,,,,,,,,,,1988-11-11,F,,,,,01.2A,NAF1993,N,2.3665,46.300555,0.94,street,Bellefaye 23600 Soumans,23174_gpi0rd,G,BELLEFAYE,
333663243,00017,33366324300017,O,,NN,,,,true,1,,,,,,23600,SOUMANS,,,23174,,,,,,,,,,,,,,,,,,,,F,,,,,84.14,NAP,N,,,0,,,,,,
334402997,00012,33440299700012,O,,NN,,,,true,1,,,,,MONTEBRAS,23600,SOUMANS,,,23174,,,,,,,,,,,,,,,,,,,1996-01-01,F,,,,,01.3Z,NAF1993,N,2.30209,46.318839,0.94,street,Montebras 23600 Soumans,23174_5xl53z,G,MONTEBRAS,
334539301,00021,33453930100021,O,2000-01-01,NN,,,2016-01-12T00:12:12,true,3,,3,,RUE,DU CHAMP DE FOIRE,23600,SOUMANS,,,23174,,,,,,,,,,,,,,,,,,,2008-01-01,A,,,,,02.20Z,NAFRev2,N,2.308479,46.300965,0.94,housenumber,3 Rue du Champ de Foire 23600 Soumans,23174_0004_00003,G,3 RUE DU CHAMP DE FOIRE,
334798022,00011,33479802200011,O,1986-01-20,NN,,,,true,1,,,,,MONTEBRAS,23600,SOUMANS,,,23174,,,,,,,,,,,,,,,,,,,2001-07-30,F,,,,,67.2Z,NAF1993,N,2.30209,46.318839,0.94,street,Montebras 23600 Soumans,23174_5xl53z,G,MONTEBRAS,
338051212,00029,33805121200029,O,2008-01-01,,,,2015-12-18T08:26:12,true,4,,4,,,CHATEUX,23600,SOUMANS,,,23174,,,,,,,,,,,,,,,,,,,2015-12-31,F,,,,,01.11Z,NAFRev2,N,2.310465,46.310554,0.94,housenumber,4 Chateux 23600 Soumans,23174_djx1up_00004,G,4 CHATEUX,
338857766,00012,33885776600012,O,1986-09-26,NN,,,,true,4,,,,,L ETANG,23600,SOUMANS,,,23174,,,,,,,,,,,,,,,,,,,2003-10-31,F,,,,,01.2A,NAFRev1,N,2.2978905,44.4487282,0.9,poi.water,L'Étang (Eau) Bournazel,https://osm.org/way/42253212,G,,
343308516,00016,34330851600016,O,,NN,,,,true,1,,,,,,23600,SOUMANS,,,23174,,,,,,,,,,,,,,,,,,,1990-12-31,F,,,,,65.01,NAP,N,,,0,,,,,,
344084074,00022,34408407400022,O,1996-05-02,NN,,,2006-11-25T10:50:04,false,3,,,,RTE,DE BOUSSAC,23600,SOUMANS,,,23174,,,,,,,,,,,,,,,,,,,2004-11-19,F,RELAIS DES MOUSQUETAIRES,,,,52.1C,NAFRev1,O,2.308007,46.301408,0.34,street,Route de Montebras 23600 Soumans,23174_0009,G,ROUTE DE MONTEBRAS,
349234690,00015,34923469000015,O,1988-12-08,NN,,,2008-01-04T23:01:32,true,3,,,,,BELLEFAYE,23600,SOUMANS,,,23174,,,,,,,,,,,,,,,,,,,2008-01-01,A,,,,,01.42Z,NAFRev2,N,2.3665,46.300555,0.94,street,Bellefaye 23600 Soumans,23174_gpi0rd,G,BELLEFAYE,
349251900,00016,34925190000016,O,1989-01-01,NN,,,,true,4,,,,,LE MAZURIER,23600,SOUMANS,,,23174,,,,,,,,,,,,,,,,,,,2003-06-30,F,,,,,01.2A,NAFRev1,N,2.34285,46.311182,0.94,street,Le Mazurier 23600 Soumans,23174_vn8nbc,G,LE MAZURIER,
349454181,00018,34945418100018,O,1989-01-01,11,2018,4399BZ,2021-02-23T11:02:19,true,4,,,,RTE,DE BOUSSAC,23600,SOUMANS,,,23174,,,,,,,,,,,,,,,,,,,2008-01-01,A,,,,,43.99B,NAFRev2,O,2.308007,46.301408,0.34,street,Route de Montebras 23600 Soumans,23174_0009,G,ROUTE DE MONTEBRAS,
349832188,00016,34983218800016,O,1989-03-03,NN,,,,true,1,,,,,,23600,SOUMANS,,,23174,,,,,,,,,,,,,,,,,,,1998-12-31,F,,,,,29.2F,NAF1993,N,,,0,,,,,,
351782669,00011,35178266900011,O,,NN,,,,true,1,,,,,LES BUGES,23600,SOUMANS,,,23174,,,,,,,,,,,,,,,,,,,1993-12-31,F,,,,,01.4A,NAF1993,N,2.33971,46.315929,0.94,street,Les Buges 23600 Soumans,23174_fi8hdx,G,LES BUGES,
352454862,00017,35245486200017,O,1989-11-14,NN,,,2008-11-08T00:29:31,false,4,,,,,,23600,SOUMANS,,,23174,,,,,,,,,,,,,,,,,,,1995-12-25,F,,,,,93.0D,NAF1993,N,,,0,,,,,,
352457683,00014,35245768300014,O,1989-09-04,NN,,,2008-01-04T23:42:45,true,3,,,,,MONTEBRAS,23600,SOUMANS,,,23174,,,,,,,,,,,,,,,,,,,2008-01-01,A,,,,,01.42Z,NAFRev2,N,2.30209,46.318839,0.94,street,Montebras 23600 Soumans,23174_5xl53z,G,MONTEBRAS,
352530695,00027,35253069500027,O,2006-08-04,,,,2015-06-04T08:36:19,true,3,,16,,,BELLEFAYE,23600,SOUMANS,,,23174,,,,,,,,,,,,,,,,,,,2015-06-30,F,,,,,01.62Z,NAFRev2,N,2.373652,46.299014,0.94,housenumber,16 Bellefaye 23600 Soumans,23174_gpi0rd_00016,G,16 BELLEFAYE,
353074545,00024,35307454500024,O,,NN,,,,true,1,,,,,LE BOUCHAT,23600,SOUMANS,,,23174,,,,,,,,,,,,,,,,,,,1993-12-31,F,,,,,70.2C,NAF1993,N,2.327561,46.318376,0.94,street,Le Bouchat 23600 Soumans,23174_nmc64i,G,LE BOUCHAT,
353560931,00019,35356093100019,O,1990-01-01,NN,,,2008-11-08T00:31:17,true,4,,,,,,23600,SOUMANS,,,23174,,,,,,,,,,,,,,,,,,,2003-10-30,F,,,,,15.8C,NAFRev1,O,,,0,,,,,,
356000745,03984,35600074503984,O,1991-01-01,NN,,,2009-03-10T14:45:58,false,4,,,,,AU  BOURG,23600,SOUMANS,,,23174,,,,,,,,,,,,,,,,,,,2009-03-05,F,BUREAU DE POSTE,,,,53.10Z,NAFRev2,O,-1.9115621,47.1089349,0.88,poi.track,Chemin du Breil au Bourg Chaumes-en-Retz,https://osm.org/way/283246644,G,,
380841353,00028,38084135300028,O,1993-01-01,,,,2006-11-25T11:32:11,false,3,,,,,LE BOURG,23600,SOUMANS,,,23174,,,,,,,,,,,,,,,,,,,2004-12-31,F,,,,,51.3J,NAFRev1,N,2.212915,47.9910304,0.9,poi.bar,Le Bourg (Bar) Ingrannes,https://osm.org/node/1718543174,G,,
381842251,00013,38184225100013,O,1990-11-11,NN,,,,true,1,,,,,BELFAYE,23600,SOUMANS,,,23174,,,,,,,,,,,,,,,,,,,2002-06-11,F,,,,,01.2A,NAF1993,N,2.3665,46.300555,0.7,street,Bellefaye 23600 Soumans,23174_gpi0rd,G,BELLEFAYE,
382381705,00013,38238170500013,O,1991-06-21,NN,,,2007-01-18T09:29:58,true,3,,,,,LE BOUCHAT,23600,SOUMANS,,,23174,,,,,,,,,,,,,,,,,,,1992-12-31,F,,,,,01.1A,NAF1993,N,2.327561,46.318376,0.94,street,Le Bouchat 23600 Soumans,23174_nmc64i,G,LE BOUCHAT,
382981298,00013,38298129800013,O,1991-06-01,NN,,,2021-02-23T11:11:15,true,3,,,,,LA BACLIERE,23600,SOUMANS,,,23174,,,,,,,,,,,,,,,,,,,2008-01-01,A,,,,,68.20B,NAFRev2,N,2.306324,46.298735,0.32,street,Quartier de la Varnade 23600 Soumans,23174_b125,G,QUARTIER DE LA VARNADE,
383706827,00011,38370682700011,O,1991-10-01,NN,,,2009-12-20T04:34:00,true,5,,,,,MONTEBRAS,23600,SOUMANS,,,23174,,,,,,,,,,,,,,,,,,,2009-12-31,F,,,,,01.42Z,NAFRev2,N,2.30209,46.318839,0.94,street,Montebras 23600 Soumans,23174_5xl53z,G,MONTEBRAS,
385098561,00017,38509856100017,O,1992-04-04,NN,,,2010-02-25T05:06:14,true,3,,,,,CHATEUX,23600,SOUMANS,,,23174,,,,,,,,,,,,,,,,,,,2008-01-01,A,,,,,68.20B,NAFRev2,N,2.309751,46.309664,0.94,street,Chateux 23600 Soumans,23174_djx1up,G,CHATEUX,
389877002,00052,38987700200052,O,2010-04-01,,,,2015-06-05T11:39:45,false,2,,2,,,L'ARBORETUM,23600,SOUMANS,,,23174,,,,,,,,,,,,,,,,,,,2015-02-04,F,,,,,85.51Z,NAFRev2,N,2.309903,46.301216,0.91,housenumber,2 Lotissement de l'Arboretum 23600 Soumans,23174_b128_00002,G,2 LOTISSEMENT DE L ARBORETUM,
390231298,00022,39023129800022,O,2009-05-11,NN,,,2013-05-18T03:11:03,true,3,,,,LD,LE CHENE AU MAZURIER,23600,SOUMANS,,,23174,,,,,,,,,,,,,,,,,,,2012-01-22,A,,,,,94.99Z,NAFRev2,O,2.34285,46.311182,0.55,street,Le Mazurier 23600 Soumans,23174_vn8nbc,G,LE MAZURIER,
390664241,00010,39066424100010,O,1993-03-19,NN,,,2008-01-04T23:42:57,true,3,,,,,LA GARDE,23600,SOUMANS,,,23174,,,,,,,,,,,,,,,,,,,2008-01-01,A,,,,,01.42Z,NAFRev2,N,2.3015,46.289341,0.94,street,La Garde 23600 Soumans,23174_mdegjx,G,LA GARDE,
390734325,00017,39073432500017,O,1993-03-19,NN,,,2009-12-20T05:38:38,true,4,,,,,BELLEFAGE,23600,SOUMANS,,,23174,,,,,,,,,,,,,,,,,,,2009-12-31,F,,,,,01.42Z,NAFRev2,N,2.3665,46.300555,0.65,street,Bellefaye 23600 Soumans,23174_gpi0rd,G,BELLEFAYE,
390989366,00047,39098936600047,O,2018-10-04,,,,2021-02-23T11:16:53,true,1,,,,,LE PRAS DE PLUX,23600,SOUMANS,,,23174,,,,,,,,,,,,,,,,,,,2018-10-04,A,,,,,47.81Z,NAFRev2,N,2.291803,46.331105,0.82,locality,Le Pras de Pleux 23600 Soumans,23174_b096,G,LE PRAS DE PLEUX,
392653713,00017,39265371300017,O,,NN,,,,true,1,,,,,LE BOURG,23600,SOUMANS,,,23174,,,,,,,,,,,,,,,,,,,1996-09-01,F,,,,,01.2A,NAF1993,N,2.212915,47.9910304,0.9,poi.bar,Le Bourg (Bar) Ingrannes,https://osm.org/node/1718543174,G,,
393309174,00018,39330917400018,O,1993-11-01,NN,,,,true,1,,,,,LE BOURG,23600,SOUMANS,,,23174,,,,,,,,,,,,,,,,,,,1994-06-07,F,,,,,52.1B,NAF1993,N,2.212915,47.9910304,0.9,poi.bar,Le Bourg (Bar) Ingrannes,https://osm.org/node/1718543174,G,,
393546155,00010,39354615500010,O,1994-01-01,NN,,,2010-12-01T05:34:54,true,3,,,,,LE MONT GALBRUN,23600,SOUMANS,,,23174,,,,,,,,,,,,,,,,,,,2008-01-01,A,,,,,01.45Z,NAFRev2,N,2.308007,46.301408,0.31,street,Route de Montebras 23600 Soumans,23174_0009,G,ROUTE DE MONTEBRAS,
393785670,00018,39378567000018,O,,NN,,,,true,1,,,,,BABENOIR,23600,SOUMANS,,,23174,,,,,,,,,,,,,,,,,,,1996-12-31,F,,,,,01.2A,NAF1993,N,2.318155,46.30462,0.51,street,Bobenoire 23600 Soumans,23174_p962jh,G,BOBENOIRE,
393787809,00010,39378780900010,O,1994-01-01,NN,,,,true,1,,,,,BOBENOIRE,23600,SOUMANS,,,23174,,,,,,,,,,,,,,,,,,,1999-12-31,F,,,,,01.2A,NAF1993,N,2.318155,46.30462,0.94,street,Bobenoire 23600 Soumans,23174_p962jh,G,BOBENOIRE,
393884333,00013,39388433300013,O,1993-01-01,NN,,,2019-02-08T03:56:13,true,4,,,,,LA GARDE,23600,SOUMANS,,,23174,,,,,,,,,,,,,,,,,,,2018-12-17,F,,,,,01.11Z,NAFRev2,N,2.3015,46.289341,0.94,street,La Garde 23600 Soumans,23174_mdegjx,G,LA GARDE,
394267306,00014,39426730600014,O,1994-02-23,NN,,,2006-10-28T02:08:08,true,3,METAYER DANIEL,,,,LE MONTURET,23600,SOUMANS,,,23174,,,,,,,,,,,,,,,,,,,2004-09-01,F,,,,,70.2C,NAFRev1,N,2.308007,46.301408,0.39,street,Route de Montebras 23600 Soumans,23174_0009,G,ROUTE DE MONTEBRAS,