siren,nic,siret,statutDiffusionEtablissement,dateCreationEtablissement,trancheEffectifsEtablissement,anneeEffectifsEtablissement,activitePrincipaleRegistreMetiersEtablissement,dateDernierTraitementEtablissement,etablissementSiege,nombrePeriodesEtablissement,complementAdresseEtablissement,numeroVoieEtablissement,indiceRepetitionEtablissement,typeVoieEtablissement,libelleVoieEtablissement,codePostalEtablissement,libelleCommuneEtablissement,libelleCommuneEtrangerEtablissement,distributionSpecialeEtablissement,codeCommuneEtablissement,codeCedexEtablissement,libelleCedexEtablissement,codePaysEtrangerEtablissement,libellePaysEtrangerEtablissement,complementAdresse2Etablissement,numeroVoie2Etablissement,indiceRepetition2Etablissement,typeVoie2Etablissement,libelleVoie2Etablissement,codePostal2Etablissement,libelleCommune2Etablissement,libelleCommuneEtranger2Etablissement,distributionSpeciale2Etablissement,codeCommune2Etablissement,codeCedex2Etablissement,libelleCedex2Etablissement,codePaysEtranger2Etablissement,libellePaysEtranger2Etablissement,dateDebut,etatAdministratifEtablissement,enseigne1Etablissement,enseigne2Etablissement,enseigne3Etablissement,denominationUsuelleEtablissement,activitePrincipaleEtablissement,nomenclatureActivitePrincipaleEtablissement,caractereEmployeurEtablissement,longitude,latitude,geo_score,geo_type,geo_adresse,geo_id,geo_ligne,geo_l4,geo_l5
026010926,00025,02601092600025,O,,NN,,,2019-11-14T14:00:35,true,1,,,,,,37460,VILLELOIN-COULANGE,,,37277,,,,,,,,,,,,,,,,,,,1987-12-25,F,,,,,64.14,NAP,N,,,0,,,,,,
213702772,00012,21370277200012,O,1983-03-01,03,2018,,2020-08-25T10:17:02,true,4,,,,RUE,BERNARD DELATTRE,37460,VILLELOIN-COULANGE,,,37277,,,,,,,,,,,,,,,,,,,2008-01-01,A,MAIRIE,,,,84.11Z,NAFRev2,O,1.223364,47.140534,0.85,street,Rue Bernard de Lattre 37460 Villeloin-Coulangé,37277_0030,G,RUE BERNARD DE LATTRE,
213702772,00020,21370277200020,O,1983-12-21,01,2018,,2020-08-25T10:17:02,false,3,,20,,RUE,DE NOUANS,37460,VILLELOIN-COULANGE,,,37277,,,,,,,,,,,,,,,,,,,2008-01-01,A,ECOLE ELEMENTAIRE PUBLIQUE,,,,85.20Z,NAFRev2,N,1.224203,47.138943,0.94,housenumber,20 Rue de Nouans 37460 Villeloin-Coulangé,37277_0080_00020,G,20 RUE DE NOUANS,
213702772,00038,21370277200038,O,1983-12-21,NN,,,2019-11-14T14:00:35,false,4,,20,,RUE,DE NOUANS,37460,VILLELOIN-COULANGE,,,37277,,,,,,,,,,,,,,,,,,,2003-09-01,F,ECOLE MATERNELLE PUBLIQUE,,,,80.1Z,NAFRev1,N,1.224203,47.138943,0.94,housenumber,20 Rue de Nouans 37460 Villeloin-Coulangé,37277_0080_00020,G,20 RUE DE NOUANS,
263702573,00019,26370257300019,O,1983-03-01,NN,,,2019-11-14T14:00:35,true,4,MAIRIE,,,RUE,BERNARD DELATTRE,37460,VILLELOIN-COULANGE,,,37277,,,,,,,,,,,,,,,,,,,2016-01-01,F,CCAS,,,,88.99B,NAFRev2,N,1.223364,47.140534,0.85,street,Rue Bernard de Lattre 37460 Villeloin-Coulangé,37277_0030,G,RUE BERNARD DE LATTRE,
263702722,00012,26370272200012,O,1984-08-06,21,2018,,2020-08-25T10:20:59,true,4,,36,,RUE,DES LOGES,37460,VILLELOIN-COULANGE,,,37277,,,,,,,,,,,,,,,,,,,2008-01-01,A,,,,,87.10A,NAFRev2,O,1.228624,47.138263,0.94,housenumber,36 Rue des Loges 37460 Villeloin-Coulangé,37277_0070_00036,G,36 RUE DES LOGES,
263702722,00020,26370272200020,O,2002-12-25,,,,2019-11-14T14:00:35,false,3,,,,LD,LES BARAQUINS,37460,VILLELOIN-COULANGE,,,37277,,,,,,,,,,,,,,,,,,,2013-01-01,F,DOTATION NON AFFECTEE,,,,66.19A,NAFRev2,N,1.233831,47.137032,0.94,street,Les Baraquins 37460 Villeloin-Coulangé,37277_1mc6wm,G,LES BARAQUINS,
263702722,00038,26370272200038,O,2011-03-15,,,,2021-02-23T10:35:04,false,2,,36,,RUE,DES LOGES,37460,VILLELOIN-COULANGE,,,37277,,,,,,,,,,,,,,,,,,,2014-06-16,A,HEBERGEMENT TEMPORAIRE,,,,87.10A,NAFRev2,O,1.228624,47.138263,0.94,housenumber,36 Rue des Loges 37460 Villeloin-Coulangé,37277_0070_00036,G,36 RUE DES LOGES,
263703316,00012,26370331600012,O,1985-11-19,NN,,,2019-11-14T14:00:35,true,3,MAIRIE,,,,,37460,VILLELOIN-COULANGE,,,37277,,,,,,,,,,,,,,,,,,,2008-01-01,A,CDE,,,,88.99B,NAFRev2,N,1.265142,47.162072,0.38,street,La Touche Seillerie 37460 Villeloin-Coulangé,37277_b162,D,LA TOUCHE SEILLERIE,
293701736,00010,29370173600010,O,1985-12-06,NN,,,2019-11-14T14:00:35,true,4,MAIRIE,,,RUE,BERNARD DELATTRE,37460,VILLELOIN-COULANGE,,,37277,,,,,,,,,,,,,,,,,,,2011-12-31,F,,,,,42.99Z,NAFRev2,N,1.223364,47.140534,0.85,street,Rue Bernard de Lattre 37460 Villeloin-Coulangé,37277_0030,G,RUE BERNARD DE LATTRE,
300112380,00013,30011238000013,O,,,,,2019-11-14T14:00:35,true,1,,,,LD,LA VIORNE,37460,VILLELOIN-COULANGE,,,37277,,,,,,,,,,,,,,,,,,,1984-12-25,F,,,,,64.25,NAP,N,1.248788,47.136261,0.94,street,La Viorne 37460 Villeloin-Coulangé,37277_brqht8,G,LA VIORNE,
302359633,00013,30235963300013,O,,NN,,,2019-11-14T14:00:35,true,1,,,,PL,DU 11 NOVEMBRE,37460,VILLELOIN-COULANGE,,,37277,,,,,,,,,,,,,,,,,,,1999-12-31,F,,,,,85.1G,NAF1993,N,1.221899,47.140453,0.83,street,Place du 11 Novembre 1918 37460 Villeloin-Coulangé,37277_0090,G,PLACE DU 11 NOVEMBRE 1918,
303481188,00017,30348118800017,O,,,,,2019-11-14T14:00:35,true,1,,,,LD,VILLEBASLIN,37460,VILLELOIN-COULANGE,,,37277,,,,,,,,,,,,,,,,,,,1984-12-25,F,,,,,86.06,NAP,N,1.227443,47.122653,0.94,street,Villebaslin 37460 Villeloin-Coulangé,37277_mah3r9,G,VILLEBASLIN,
307216267,00012,30721626700012,O,,NN,,,2019-11-14T14:00:35,true,1,,,,RTE,DE NOUANS LES FONTAINES,37460,VILLELOIN-COULANGE,,,37277,,,,,,,,,,,,,,,,,,,1996-12-31,F,,,,,67.2Z,NAF1993,N,1.2983023,47.1365316,0.8,poi.place_of_worship,Église Saint-Martin (Lieu de culte) Nouans-les-Fontaines,https://osm.org/way/63245931,G,,
309008548,00013,30900854800013,O,,NN,,,2019-11-14T14:00:35,true,1,,,,,LA VILLETTE,37460,VILLELOIN-COULANGE,,,37277,,,,,,,,,,,,,,,,,,,,F,,,,,64.11,NAP,N,1.235553,47.13098,0.94,street,La Villette 37460 Villeloin-Coulangé,37277_3y8vmc,G,LA VILLETTE,
310080379,00038,31008037900038,O,2013-07-01,,,,2019-11-14T14:00:35,true,2,,,,,VILLENEUVE,37460,VILLELOIN-COULANGE,,,37277,,,,,,,,,,,,,,,,,,,2016-07-31,F,,,,,01.50Z,NAFRev2,O,1.279416,47.112483,0.94,street,Villeneuve 37460 Villeloin-Coulangé,37277_gx51qa,G,VILLENEUVE,
313212722,00018,31321272200018,O,,,,,2019-11-14T14:00:35,true,1,,,,,LD LA BOUQUETIERE,37460,VILLELOIN-COULANGE,,,37277,,,,,,,,,,,,,,,,,,,1993-11-02,F,,,,,01.1A,NAF1993,N,1.233437,47.160246,0.94,street,La Bouquetiere 37460 Villeloin-Coulangé,37277_nxdz00,G,LA BOUQUETIERE,
313502700,00047,31350270000047,O,2015-01-19,,,,2019-11-14T14:00:35,true,1,,7,,RUE,DE CHARREAU,37460,VILLELOIN-COULANGE,,,37277,,,,,,,,,,,,,,,,,,,2015-01-19,A,,,,,86.21Z,NAFRev2,N,1.223373,47.139059,0.94,housenumber,7 Rue de Charreau 37460 Villeloin-Coulangé,37277_0040_00007,G,7 RUE DE CHARREAU,
317983013,00010,31798301300010,O,,NN,,,2019-11-14T14:00:35,true,1,,,,,L'HERMITAGE,37460,VILLELOIN-COULANGE,,,37277,,,,,,,,,,,,,,,,,,,,F,,,,,55.72,NAP,N,1.222899,47.136355,0.94,street,L'Hermitage 37460 Villeloin-Coulangé,37277_upeau1,G,L HERMITAGE,
321414039,00016,32141403900016,O,1981-04-01,NN,,,2019-11-14T14:00:35,true,7,,4,,RUE,DU CARROIR,37460,VILLELOIN-COULANGE,,,37277,,,,,,,,,,,,,,,,,,,2012-07-31,F,,,,,43.34Z,NAFRev2,O,1.219913,47.140623,0.94,housenumber,4 Rue du Carroir 37460 Villeloin-Coulangé,37277_0038_00004,G,4 RUE DU CARROIR,
322106782,00012,32210678200012,O,,,,,2019-11-14T14:00:35,true,1,,,,LD,LES BARRAQUINS,37460,VILLELOIN-COULANGE,,,37277,,,,,,,,,,,,,,,,,,,1986-05-26,F,,,,,58.12,NAP,N,1.233831,47.137032,0.82,street,Les Baraquins 37460 Villeloin-Coulangé,37277_1mc6wm,G,LES BARAQUINS,
322155540,00014,32215554000014,O,,NN,,,2019-11-14T14:00:35,true,1,,,,LD,LE BOURG,37460,VILLELOIN-COULANGE,,,37277,,,,,,,,,,,,,,,,,,,1994-12-31,F,,,,,70.2C,NAF1993,N,1.223387,47.138007,0.94,street,Le Bourg 37460 Villeloin-Coulangé,37277_ty40mc,G,LE BOURG,
322155557,00018,32215555700018,O,,NN,,,2019-11-14T14:00:35,true,1,,,,,LE BOURG,37460,VILLELOIN-COULANGE,,,37277,,,,,,,,,,,,,,,,,,,1987-03-31,F,,,,,57.01,NAP,N,1.223387,47.138007,0.94,street,Le Bourg 37460 Villeloin-Coulangé,37277_ty40mc,G,LE BOURG,
324399492,00036,32439949200036,O,2008-01-01,,,,2021-02-23T10:47:23,true,1,,,,LD,LA PINOTTIERE,37460,VILLELOIN-COULANGE,,,37277,,,,,,,,,,,,,,,,,,,2008-01-01,A,,,,,70.22Z,NAFRev2,N,1.258872,47.11949,0.81,street,La Pinotiere 37460 Villeloin-Coulangé,37277_cpnguz,G,LA PINOTIERE,
324525781,00013,32452578100013,O,,NN,,,2019-11-14T14:00:35,true,1,,,,,FEULARDE,37460,VILLELOIN-COULANGE,,,37277,,,,,,,,,,,,,,,,,,,1990-08-31,F,,,,,01.07,NAP,N,1.258245,47.162793,0.94,street,Feularde 37460 Villeloin-Coulangé,37277_dbor3n,G,FEULARDE,
325053213,00014,32505321300014,O,1982-07-18,NN,,,2019-11-14T14:00:35,true,3,,,,LD,LA GARENNE,37460,VILLELOIN-COULANGE,,,37277,,,,,,,,,,,,,,,,,,,2005-12-31,F,,,,,52.4X,NAFRev1,N,1.212518,47.141503,0.94,street,La Garenne 37460 Villeloin-Coulangé,37277_6seix9,G,LA GARENNE,
325880995,00015,32588099500015,O,1983-01-10,NN,,,2019-11-14T14:00:35,true,3,,,,,LA BRENELLIERE,37460,VILLELOIN-COULANGE,,,37277,,,,,,,,,,,,,,,,,,,2008-01-01,A,,,,,86.90D,NAFRev2,N,1.236595,47.15406,0.94,street,La Brenelliere 37460 Villeloin-Coulangé,37277_iql8u8,G,LA BRENELLIERE,
327356630,00019,32735663000019,O,,NN,,,2019-11-14T14:00:35,true,1,,,,,LA BRENELLIERE,37460,VILLELOIN-COULANGE,,,37277,,,,,,,,,,,,,,,,,,,1993-04-30,F,,,,,01.3Z,NAF1993,N,1.236595,47.15406,0.94,street,La Brenelliere 37460 Villeloin-Coulangé,37277_iql8u8,G,LA BRENELLIERE,
327614707,00013,32761470700013,O,1983-06-25,NN,,,2019-11-14T14:00:35,true,1,,,,,LA PITANCERIE,37460,VILLELOIN-COULANGE,,,37277,,,,,,,,,,,,,,,,,,,1993-02-04,F,,,,,70.2B,NAF1993,N,1.254347,47.165564,0.94,street,La Pitancerie 37460 Villeloin-Coulangé,37277_fbqs48,G,LA PITANCERIE,
327848297,00013,32784829700013,O,,NN,,,2019-11-14T14:00:35,true,1,,,,RUE,BERNARD DELATTRE,37460,VILLELOIN-COULANGE,,,37277,,,,,,,,,,,,,,,,,,,1992-09-15,F,,,,,55.3A,NAF1993,N,1.223364,47.140534,0.85,street,Rue Bernard de Lattre 37460 Villeloin-Coulangé,37277_0030,G,RUE BERNARD DE LATTRE,
329542740,00025,32954274000025,O,1997-11-01,NN,,,2019-11-14T14:00:35,true,3,,,,,LA BRENELLIERE,37460,VILLELOIN-COULANGE,,,37277,,,,,,,,,,,,,,,,,,,2008-01-01,A,,,,,01.50Z,NAFRev2,N,1.236595,47.15406,0.94,street,La Brenelliere 37460 Villeloin-Coulangé,37277_iql8u8,G,LA BRENELLIERE,
329795918,00013,32979591800013,O,1984-05-02,NN,,4321AB,2019-11-14T14:00:35,true,6,,,,LD,LE CARROIR,37460,VILLELOIN-COULANGE,,,37277,,,,,,,,,,,,,,,,,,,2017-03-31,F,,,,,43.21A,NAFRev2,N,-1.3978574,48.2603119,0.9,poi.bar,Le Carroir (Bar) Saint-Aubin-du-Cormier,https://osm.org/node/2607993249,G,,
330455791,00013,33045579100013,O,1984-01-01,NN,,,2019-11-14T14:00:35,true,3,,,,,LA GRANGE,37460,VILLELOIN-COULANGE,,,37277,,,,,,,,,,,,,,,,,,,2005-02-28,F,,,,,01.3Z,NAFRev1,N,1.218493,47.136274,0.94,street,La Grange 37460 Villeloin-Coulangé,37277_duubbb,G,LA GRANGE,
330792425,00010,33079242500010,O,,NN,,,2019-11-14T14:00:35,true,1,,,,RUE,DE L ABBAYE,37460,VILLELOIN-COULANGE,,,37277,,,,,,,,,,,,,,,,,,,,F,,,,,81.21,NAP,N,1.221551,47.140999,0.94,street,Rue de l'Abbaye 37460 Villeloin-Coulangé,37277_0010,G,RUE DE L ABBAYE,
330877432,00014,33087743200014,O,,NN,,,2019-11-14T14:00:35,true,1,,,,RUE,DE L ABBAYE,37460,VILLELOIN-COULANGE,,,37277,,,,,,,,,,,,,,,,,,,,F,,,,,38.40,NAP,N,1.221551,47.140999,0.94,street,Rue de l'Abbaye 37460 Villeloin-Coulangé,37277_0010,G,RUE DE L ABBAYE,
330877440,00017,33087744000017,O,,NN,,,2019-11-14T14:00:35,true,1,,,,RUE,DE L ABBAYE,37460,VILLELOIN-COULANGE,,,37277,,,,,,,,,,,,,,,,,,,,F,,,,,38.40,NAP,N,1.221551,47.140999,0.94,street,Rue de l'Abbaye 37460 Villeloin-Coulangé,37277_0010,G,RUE DE L ABBAYE,
331677245,00036,33167724500036,O,2020-11-01,,,,2021-02-23T10:51:42,true,1,,8,,,LES BRUYERES,37460,VILLELOIN-COULANGE,,,37277,,,,,,,,,,,,,,,,,,,2020-11-01,A,,,,,01.61Z,NAFRev2,N,1.275253,47.118553,0.94,housenumber,8 Les Bruyeres 37460 Villeloin-Coulangé,37277_8i2anp_00008,G,8 LES BRUYERES,
332230580,00018,33223058000018,O,1985-04-01,NN,,,2019-11-14T14:00:35,true,4,,14,,RUE,BERNARD DE LATTRE,37460,VILLELOIN-COULANGE,,,37277,,,,,,,,,,,,,,,,,,,2012-04-01,F,,,,,47.89Z,NAFRev2,N,1.221523,47.140357,0.94,housenumber,14 Rue Bernard de Lattre 37460 Villeloin-Coulangé,37277_0030_00014,G,14 RUE BERNARD DE LATTRE,
333861359,00011,33386135900011,O,,NN,,,2019-11-14T14:00:35,true,1,,25,,,LOTISSEMENT LES BARRAQUIN,37460,VILLELOIN-COULANGE,,,37277,,,,,,,,,,,,,,,,,,,,F,,,,,77.14,NAP,N,1.233831,47.137032,0.46,street,Les Baraquins 37460 Villeloin-Coulangé,37277_1mc6wm,G,LES BARAQUINS,
333874857,00019,33387485700019,O,,,,,2019-11-14T14:00:35,true,1,,,,RUE,DE L ABBAYE,37460,VILLELOIN-COULANGE,,,37277,,,,,,,,,,,,,,,,,,,1991-02-19,F,,,,,38.40,NAP,N,1.221551,47.140999,0.94,street,Rue de l'Abbaye 37460 Villeloin-Coulangé,37277_0010,G,RUE DE L ABBAYE,
334148327,00011,33414832700011,O,1985-01-01,NN,,,2019-11-14T14:00:35,false,3,,,,,LES GENETS,37460,VILLELOIN-COULANGE,,,37277,,,,,,,,,,,,,,,,,,,2007-07-31,F,,,,,01.3Z,NAFRev1,N,1.258647,47.132306,0.94,street,Les Genets 37460 Villeloin-Coulangé,37277_b10dbu,G,LES GENETS,
334148327,00029,33414832700029,O,2007-07-31,01,2018,,2020-08-25T10:36:34,true,2,LA CHENILLERE,,,LD,LA CHENILLERE,37460,VILLELOIN-COULANGE,,,37277,,,,,,,,,,,,,,,,,,,2008-01-01,A,,,,,01.50Z,NAFRev2,O,1.262033,47.136204,0.94,street,La Chenillere 37460 Villeloin-Coulangé,37277_klcb3n,G,LA CHENILLERE,
338059371,00017,33805937100017,O,,,,,2019-11-14T14:00:35,true,1,,,,,,37460,VILLELOIN-COULANGE,,,37277,,,,,,,,,,,,,,,,,,,,F,,,,,86.06,NAP,N,,,0,,,,,,
338627227,00022,33862722700022,O,2009-07-01,,,,2019-11-14T14:00:35,true,2,,,,,LES PERRUCHES,37460,VILLELOIN-COULANGE,,,37277,,,,,,,,,,,,,,,,,,,2018-01-31,F,,,,,43.12A,NAFRev2,N,1.256564,47.141185,0.94,street,Les Perruches 37460 Villeloin-Coulangé,37277_k2excm,G,LES PERRUCHES,
338627227,00030,33862722700030,O,2011-07-01,,,,2019-11-14T14:00:35,false,2,,,,,LES PERRUCHES,37460,VILLELOIN-COULANGE,,,37277,,,,,,,,,,,,,,,,,,,2018-01-31,F,,,,,01.50Z,NAFRev2,N,1.256564,47.141185,0.94,street,Les Perruches 37460 Villeloin-Coulangé,37277_k2excm,G,LES PERRUCHES,
338919020,00010,33891902000010,O,,,,,2019-11-14T14:00:35,true,1,,,,LD,LE BREUIL,37460,VILLELOIN-COULANGE,,,37277,,,,,,,,,,,,,,,,,,,1997-06-30,F,,,,,01.1A,NAF1993,N,1.219999,47.149815,0.94,street,Le Breuil 37460 Villeloin-Coulangé,37277_r39eof,G,LE BREUIL,
339822140,00010,33982214000010,O,,NN,,,2019-11-14T14:00:35,true,1,,,,LD,LES TREMBLAIRES,37460,VILLELOIN-COULANGE,,,37277,,,,,,,,,,,,,,,,,,,1990-09-30,F,,,,,01.07,NAP,N,1.214984,47.129281,0.94,street,Les Tremblaires 37460 Villeloin-Coulangé,37277_e7w8ek,G,LES TREMBLAIRES,
340116870,00015,34011687000015,O,1987-01-02,NN,,,2019-11-14T14:00:35,true,3,ROUTE NATIONALE 760,,,LD,LES BARAQUINS,37460,VILLELOIN-COULANGE,,,37277,,,,,,,,,,,,,,,,,,,2008-01-01,A,,,,,41.10D,NAFRev2,N,1.233831,47.137032,0.94,street,Les Baraquins 37460 Villeloin-Coulangé,37277_1mc6wm,G,LES BARAQUINS,
341843886,00019,34184388600019,O,,NN,,,2019-11-14T14:00:35,true,1,,,,,L AUMONERIE,37460,VILLELOIN-COULANGE,,,37277,,,,,,,,,,,,,,,,,,,1994-05-31,F,,,,,01.3Z,NAF1993,N,1.246033,47.160199,0.94,street,L'Aumonerie 37460 Villeloin-Coulangé,37277_nsxuwx,G,L AUMONERIE,
342243573,00033,34224357300033,O,1993-01-01,NN,,,2019-11-14T14:00:35,true,5,,,,,VILLEBASLIN,37460,VILLELOIN-COULANGE,,,37277,,,,,,,,,,,,,,,,,,,2007-06-15,F,,,,,74.8F,NAFRev1,N,1.227443,47.122653,0.94,street,Villebaslin 37460 Villeloin-Coulangé,37277_mah3r9,G,VILLEBASLIN,
342764628,00018,34276462800018,O,,NN,,,2019-11-14T14:00:35,true,1,,,,,LE BOURG,37460,VILLELOIN-COULANGE,,,37277,,,,,,,,,,,,,,,,,,,1996-12-31,F,,,,,45.2V,NAF1993,O,1.223387,47.138007,0.94,street,Le Bourg 37460 Villeloin-Coulangé,37277_ty40mc,G,LE BOURG,
343910428,00014,34391042800014,O,,,,,2019-11-14T14:00:35,true,1,,,,,LE BOURG,37460,VILLELOIN-COULANGE,,,37277,,,,,,,,,,,,,,,,,,,1996-11-21,F,,,,,01.1A,NAF1993,N,1.223387,47.138007,0.94,street,Le Bourg 37460 Villeloin-Coulangé,37277_ty40mc,G,LE BOURG,
344034236,00010,34403423600010,O,,NN,,,2019-11-14T14:00:35,true,1,,,,,LE BOURG,37460,VILLELOIN-COULANGE,,,37277,,,,,,,,,,,,,,,,,,,1989-08-22,F,,,,,84.12,NAP,N,1.223387,47.138007,0.94,street,Le Bourg 37460 Villeloin-Coulangé,37277_ty40mc,G,LE BOURG,
345005789,00010,34500578900010,O,1988-01-01,NN,,,2019-11-14T14:00:35,true,4,,,,,BEL AIR,37460,VILLELOIN-COULANGE,,,37277,,,,,,,,,,,,,,,,,,,1994-12-25,F,,,,,01.1A,NAF1993,N,1.240937,47.14369,0.94,street,Bel Air 37460 Villeloin-Coulangé,37277_b010,G,BEL AIR,
345063135,00023,34506313500023,O,1993-10-01,01,2018,,2020-08-25T10:42:26,true,3,,,,,CHENE ROND,37460,VILLELOIN-COULANGE,,,37277,,,,,,,,,,,,,,,,,,,2008-01-01,A,,,,,01.11Z,NAFRev2,N,1.264594,47.102388,0.93,street,Le Chene Rond 37460 Villeloin-Coulangé,37277_b045,G,LE CHENE ROND,
347924896,00017,34792489600017,O,1988-01-01,NN,,,2019-11-14T14:00:35,false,3,,,,,LE CHENE ROND,37460,VILLELOIN-COULANGE,,,37277,,,,,,,,,,,,,,,,,,,1994-01-01,F,,,,,01.1A,NAF1993,N,1.264594,47.102388,0.94,street,Le Chene Rond 37460 Villeloin-Coulangé,37277_b045,G,LE CHENE ROND,
349161398,00020,34916139800020,O,1995-01-01,NN,,,2019-11-14T14:00:35,false,4,,,,RUE,BERNARD DELATTRE,37460,VILLELOIN-COULANGE,,,37277,,,,,,,,,,,,,,,,,,,1997-09-01,F,,,,,85.1E,NAF1993,O,1.223364,47.140534,0.85,street,Rue Bernard de Lattre 37460 Villeloin-Coulangé,37277_0030,G,RUE BERNARD DE LATTRE,
349161398,00038,34916139800038,O,1997-09-01,,,,2019-11-14T14:00:35,false,4,,15,,RTE,DE NOUANS,37460,VILLELOIN-COULANGE,,,37277,,,,,,,,,,,,,,,,,,,2012-11-01,F,,,,,86.23Z,NAFRev2,O,1.224222,47.139053,0.78,housenumber,15 Rue de Nouans 37460 Villeloin-Coulangé,37277_0080_00015,G,15 RUE DE NOUANS,
349161398,00046,34916139800046,O,2012-11-01,01,2018,,2021-02-23T11:02:03,true,2,,7,,RUE,DE CHARREAU,37460,VILLELOIN-COULANGE,,,37277,,,,,,,,,,,,,,,,,,,2015-12-31,A,MAISON DE SANTE PLURIDISCIPLINAIRE,,,,86.23Z,NAFRev2,N,1.223373,47.139059,0.94,housenumber,7 Rue de Charreau 37460 Villeloin-Coulangé,37277_0040_00007,G,7 RUE DE CHARREAU,
349197640,00015,34919764000015,O,1989-01-02,NN,,,2019-11-14T14:00:35,true,5,,38,,RUE,DE NOUANS,37460,VILLELOIN-COULANGE,,,37277,,,,,,,,,,,,,,,,,,,2009-05-31,F,,,,,02.20Z,NAFRev2,N,1.226737,47.13755,0.94,housenumber,38 Rue de Nouans 37460 Villeloin-Coulangé,37277_0080_00038,G,38 RUE DE NOUANS,
349252494,00019,34925249400019,O,1989-01-01,NN,,,2019-11-14T14:00:35,false,4,,,,,LE BOURG,37460,VILLELOIN-COULANGE,,,37277,,,,,,,,,,,,,,,,,,,1999-10-08,F,,,,,85.1C,NAF1993,O,1.223387,47.138007,0.94,street,Le Bourg 37460 Villeloin-Coulangé,37277_ty40mc,G,LE BOURG,
349252494,00027,34925249400027,O,1999-10-08,NN,,,2019-11-14T14:00:35,true,4,,14,,RUE,DE NOUANS,37460,VILLELOIN-COULANGE,,,37277,,,,,,,,,,,,,,,,,,,2014-12-31,F,,,,,86.21Z,NAFRev2,O,1.223715,47.139574,0.94,housenumber,14 Rue de Nouans 37460 Villeloin-Coulangé,37277_0080_00014,G,14 RUE DE NOUANS,
349682849,00022,34968284900022,O,,NN,,,2019-11-14T14:00:35,true,1,,,,LD,LE VILLAGE DU PUITS,37460,VILLELOIN-COULANGE,,,37277,,,,,,,,,,,,,,,,,,,1995-11-27,F,,,,,02.0D,NAF1993,N,1.227112,47.161738,0.94,street,Le Village du Puits 37460 Villeloin-Coulangé,37277_b171,G,LE VILLAGE DU PUITS,
350988382,00023,35098838200023,O,1996-05-01,NN,,,2019-11-14T14:00:35,true,3,,,,,LE VILLAGE DU PUITS,37460,VILLELOIN-COULANGE,,,37277,,,,,,,,,,,,,,,,,,,2008-01-01,A,,,,,68.20B,NAFRev2,N,1.227112,47.161738,0.94,street,Le Village du Puits 37460 Villeloin-Coulangé,37277_b171,G,LE VILLAGE DU PUITS,
352189617,00017,35218961700017,O,,NN,,,2019-11-14T14:00:35,true,1,,,,RUE,DE L ABBAYE,37460,VILLELOIN-COULANGE,,,37277,,,,,,,,,,,,,,,,,,,1989-10-01,F,,,,,77.12,NAP,N,1.221551,47.140999,0.94,street,Rue de l'Abbaye 37460 Villeloin-Coulangé,37277_0010,G,RUE DE L ABBAYE,
352194971,00011,35219497100011,O,1989-10-16,NN,,,2019-11-14T14:00:35,true,4,,,,LD,LE BOURG,37460,VILLELOIN-COULANGE,,,37277,,,,,,,,,,,,,,,,,,,2004-06-30,F,,,,,52.3A,NAFRev1,O,1.223387,47.138007,0.94,street,Le Bourg 37460 Villeloin-Coulangé,37277_ty40mc,G,LE BOURG,
352948699,00017,35294869900017,O,1990-01-02,NN,,,2019-11-14T14:00:35,true,1,,,,RUE,BERNARD DELATRE,37460,VILLELOIN-COULANGE,,,37277,,,,,,,,,,,,,,,,,,,1999-06-29,F,,,,,52.4N,NAF1993,N,1.223364,47.140534,0.8,street,Rue Bernard de Lattre 37460 Villeloin-Coulangé,37277_0030,G,RUE BERNARD DE LATTRE,
353732886,00026,35373288600026,O,2008-01-01,,,,2019-11-14T14:00:35,false,1,,,,,LES BARAQUINS,37460,VILLELOIN-COULANGE,,,37277,,,,,,,,,,,,,,,,,,,2008-01-01,A,,,,,46.21Z,NAFRev2,N,1.233831,47.137032,0.94,street,Les Baraquins 37460 Villeloin-Coulangé,37277_1mc6wm,G,LES BARAQUINS,
353920994,00012,35392099400012,O,1990-01-01,NN,,,2019-11-14T14:00:35,false,3,,,,,LES GENETS,37460,VILLELOIN-COULANGE,,,37277,,,,,,,,,,,,,,,,,,,2008-01-01,A,,,,,02.40Z,NAFRev2,N,1.258647,47.132306,0.94,street,Les Genets 37460 Villeloin-Coulangé,37277_b10dbu,G,LES GENETS,
353920994,00020,35392099400020,O,2009-04-08,,,,2021-02-23T11:06:08,true,1,,,,,LA PINOTTIERE,37460,VILLELOIN-COULANGE,,,37277,,,,,,,,,,,,,,,,,,,2009-04-08,A,,,,,02.40Z,NAFRev2,N,1.258872,47.11949,0.81,street,La Pinotiere 37460 Villeloin-Coulangé,37277_cpnguz,G,LA PINOTIERE,
356000240,05742,35600024005742,O,1991-01-01,NN,,,2019-11-14T14:00:35,false,3,,15,,RUE,BERNARD DELATTRE,37460,VILLELOIN-COULANGE,,,37277,,,,,,,,,,,,,,,,,,,2005-11-01,F,BUREAU DE POSTE,,,,64.1A,NAFRev1,N,1.221871,47.140348,0.86,housenumber,15 Rue Bernard de Lattre 37460 Villeloin-Coulangé,37277_0030_00015,G,15 RUE BERNARD DE LATTRE,
377845516,00014,37784551600014,O,1990-01-01,NN,,,2019-11-14T14:00:35,true,5,,,,,VILLENEUVE,37460,VILLELOIN-COULANGE,,,37277,,,,,,,,,,,,,,,,,,,2013-06-30,F,,,,,01.50Z,NAFRev2,N,1.279416,47.112483,0.94,street,Villeneuve 37460 Villeloin-Coulangé,37277_gx51qa,G,VILLENEUVE,
379641749,00013,37964174900013,O,1990-10-01,NN,,,2021-02-23T11:08:12,true,3,,9,,,LES TREMBLAIRES,37460,VILLELOIN-COULANGE,,,37277,,,,,,,,,,,,,,,,,,,2008-01-01,A,,,,,01.11Z,NAFRev2,N,1.208795,47.127847,0.94,housenumber,9 Les Tremblaires 37460 Villeloin-Coulangé,37277_e7w8ek_00009,G,9 LES TREMBLAIRES,
380499426,00019,38049942600019,O,1990-11-21,,,,2019-11-14T14:00:35,false,4,,,,,LE VILLAGE DES CHAMPS,37460,VILLELOIN-COULANGE,,,37277,,,,,,,,,,,,,,,,,,,1997-04-30,F,,,,,01.1A,NAF1993,N,1.241301,47.144848,0.94,street,Le Village des Champs 37460 Villeloin-Coulangé,37277_b170,G,LE VILLAGE DES CHAMPS,
380608182,00016,38060818200016,O,1990-11-01,NN,,,2019-11-14T14:00:35,true,4,,,,,FEULARDE,37460,VILLELOIN-COULANGE,,,37277,,,,,,,,,,,,,,,,,,,1999-01-31,F,,,,,70.2B,NAF1993,N,1.258245,47.162793,0.94,street,Feularde 37460 Villeloin-Coulangé,37277_dbor3n,G,FEULARDE,
381184712,00010,38118471200010,O,,NN,,,2019-11-14T14:00:35,true,1,,,,,FEULARDE,37460,VILLELOIN-COULANGE,,,37277,,,,,,,,,,,,,,,,,,,1997-03-31,F,,,,,01.1A,NAF1993,N,1.258245,47.162793,0.94,street,Feularde 37460 Villeloin-Coulangé,37277_dbor3n,G,FEULARDE,
381557966,00011,38155796600011,O,1991-01-01,NN,,,2019-11-14T14:00:35,true,3,LES TREMBLAIRES,,,,,37460,VILLELOIN-COULANGE,,,37277,,,,,,,,,,,,,,,,,,,1998-12-25,F,,,,,01.3Z,NAF1993,N,1.214984,47.129281,0.94,street,Les Tremblaires 37460 Villeloin-Coulangé,37277_e7w8ek,D,LES TREMBLAIRES,
382390540,00013,38239054000013,O,1991-07-03,NN,,,2019-11-14T14:00:35,false,3,,,,,VILLEBASLIN,37460,VILLELOIN-COULANGE,,,37277,,,,,,,,,,,,,,,,,,,1993-06-01,F,,,,,85.1G,NAF1993,N,1.227443,47.122653,0.94,street,Villebaslin 37460 Villeloin-Coulangé,37277_mah3r9,G,VILLEBASLIN,
382390540,00021,38239054000021,O,1993-06-01,NN,,,2019-11-14T14:00:35,false,3,,,,PL,DU 11 NOVEMBRE,37460,VILLELOIN-COULANGE,,,37277,,,,,,,,,,,,,,,,,,,1995-02-06,F,,,,,85.1G,NAF1993,N,1.221899,47.140453,0.83,street,Place du 11 Novembre 1918 37460 Villeloin-Coulangé,37277_0090,G,PLACE DU 11 NOVEMBRE 1918,
382390540,00054,38239054000054,O,2012-10-15,,,,2021-02-23T11:10:44,true,1,,7,,RUE,DE CHARREAU,37460,VILLELOIN-COULANGE,,,37277,,,,,,,,,,,,,,,,,,,2012-10-15,A,,,,,86.90D,NAFRev2,N,1.223373,47.139059,0.94,housenumber,7 Rue de Charreau 37460 Villeloin-Coulangé,37277_0040_00007,G,7 RUE DE CHARREAU,
382671550,00012,38267155000012,O,1991-07-18,,,,2019-11-14T14:00:35,true,3,,,,,LA PITANCERIE,37460,VILLELOIN-COULANGE,,,37277,,,,,,,,,,,,,,,,,,,2008-01-01,A,,,,,01.11Z,NAFRev2,N,1.254347,47.165564,0.94,street,La Pitancerie 37460 Villeloin-Coulangé,37277_fbqs48,G,LA PITANCERIE,